{"text_format":"3","workbook":"xlsx","n_sheets":9,"sheets":["Capa","Info","Clubes Participantes","Tecnicos Participantes","Jogos","ClaFIN","ClaOUR","ClaPRA","ClaIND"],"not_rendered":{"images":2,"macros":1,"defined_names":19},"read":"whole","date_system":"1900"}

{"sheet":"Capa","index":0,"n_rows":49,"n_cols":4,"rows_kept":49,"merged":[[37,0,43,5],[44,0,45,2],[44,3,45,5],[48,0,49,4]]}
{"$rows_empty":37}
[{"$f":"\"BRASILEIRO INTERCLUBES\"&+CHAR(10)&+YEAR(Jogos!C6)","v":"BRASILEIRO INTERCLUBES\n2022"}]
[]
[]
[]
[]
[]
[]
["Matias Barbosa / MG",null,null,"15 a 17 de abril de 2022"]
[]
[]
[]
["Levantamento Estatístico\nPAULO SERGIO MARTINS & JOSE RICARDO ALMEIDA"]

{"sheet":"Info","index":1,"n_rows":73,"n_cols":34,"rows_kept":73,"merged":[[5,10,5,15],[5,16,5,21],[5,25,5,35],[6,10,6,12],[6,13,6,15],[6,16,6,18],[6,19,6,21],[6,33,6,35],[7,10,7,12],[7,13,7,15],[7,16,7,18],[7,19,7,21],[7,33,7,35],[8,10,8,12],[8,13,8,15],[8,16,8,18],[8,19,8,21],[9,10,9,12],[9,13,9,15],[9,16,9,18],[9,19,9,21],[9,33,9,35],[10,10,10,12],[10,13,10,15],[10,16,10,18],[10,19,10,21],[10,33,10,35],[11,10,11,12],[11,13,11,15],[11,16,11,18],[11,19,11,21],[11,33,11,35],[12,10,12,12],[12,13,12,15],[12,16,12,18],[12,19,12,21],[16,0,37,0],[16,11,16,15],[16,17,16,19],[16,22,16,24],[17,2,21,36],[23,12,24,14],[25,17,26,19],[27,2,28,4],[27,7,28,9],[27,12,28,14],[29,22,30,24],[31,2,32,4],[31,7,32,9],[31,12,32,14],[33,17,34,19],[35,12,36,14],[39,0,56,0],[39,12,39,14],[39,17,39,19],[40,7,44,36],[46,7,47,9],[48,12,49,14],[50,7,51,9],[50,17,51,19],[52,12,53,14],[54,7,55,9],[69,0,69,36],[70,0,70,36]]}
[{"$f":"\"XL CAMPEONATO BRASILEIRO INTERCLUBES / \"&+RIGHT(A2,4)","v":"XL CAMPEONATO BRASILEIRO INTERCLUBES / 2022"}]
[{"$f":"Capa!A45&+\", \"&+Capa!D45","v":"Matias Barbosa / MG, 15 a 17 de abril de 2022"}]
[]
["ESTATISTICAS:"]
[]
[{"$nulls":10},"EQUIPES",{"$nulls":5},"INDIVIDUAIS",{"$nulls":8},"PARTICIPANTES"]
[null,"JOGOS",{"$nulls":8},{"$f":"SUM(K8:K13)","v":79},null,null,{"$f":"IF(K7=MAX(Jogos!A:A),\"\",\"erro\")","v":""},null,null,{"$f":"SUM(Q8:Q13)","v":316},null,null,{"$f":"IF(Q7=MAX(Jogos!B:B),\"\",\"erro\")&+IF(Q7-Q13=ClaIND!W3,\"\",\"erro\")","v":""},{"$nulls":5},"CLUBES/EQUIPES",{"$nulls":7},{"$f":"COUNTA('Clubes Participantes'!B:B)-1","v":17}]
[null,null,"VITÓRIAS|DERROTAS",{"$nulls":7},{"$f":"COUNTIFS(Jogos!A:A,\">0\",Jogos!N:N,\"V\")+COUNTIFS(Jogos!A:A,\">0\",Jogos!N:N,\"D\")-K10-K13","v":70},null,null,{"$f":"K8/$K$7","v":{"v":0.8860759493670886,"d":"89%"}},null,null,{"$f":"COUNTIFS(Jogos!B:B,\">0\",Jogos!N:N,\"V\")+COUNTIFS(Jogos!B:B,\">0\",Jogos!N:N,\"D\")-Q10-Q13","v":232},null,null,{"$f":"Q8/$Q$7","v":{"v":0.7341772151898734,"d":"73%"}},{"$nulls":5},"BOTONISTAS",{"$nulls":7},{"$f":"COUNTA('Tecnicos Participantes'!A:A)-3","v":85}]
[null,null,"EMPATES",{"$nulls":7},{"$f":"COUNTIFS(Jogos!A:A,\">0\",Jogos!N:N,\"E\")","v":9},null,null,{"v":0.11392405063291139,"d":"11%"},null,null,{"$f":"COUNTIFS(Jogos!B:B,\">0\",Jogos!N:N,\"E\")","v":84},null,null,{"v":0.26582278481012656,"d":"27%"}]
[null,null,"WO´s",{"$nulls":7},{"$f":"COUNTIF(Jogos!$S:$S,\"W0\")","v":0},null,null,{"v":0,"d":"0%"},null,null,{"$f":"COUNTIFS(Jogos!B:B,\">0\",Jogos!$S:$S,\"W0IND\")","v":0},null,null,{"v":0,"d":"0%"},{"$nulls":5},"GOLS (com W0´s)",{"$nulls":7},{"$f":"ClaIND!T2","v":692}]
[null,null,"WW´s",{"$nulls":7},{"$f":"COUNTIF(Jogos!$S:$S,\"WW\")","v":0},null,null,{"v":0,"d":"0%"},null,null,{"$f":"COUNTIFS(Jogos!B:B,\">0\",Jogos!$S:$S,\"WWIND\")","v":0},null,null,{"v":0,"d":"0%"},{"$nulls":5},"GOLS (sem W0´s)",{"$nulls":7},{"$f":"AH10-(Q10*2)-(Q13*2)","v":692}]
[null,null,"ANULADOS",{"$nulls":7},{"$f":"COUNTIF(Jogos!$S:$S,\"NULO\")","v":0},null,null,{"v":0,"d":"0%"},null,null,{"$f":"COUNTIFS(Jogos!B:B,\">0\",Jogos!$S:$S,\"NULOIND\")","v":0},null,null,{"v":0,"d":"0%"},{"$nulls":5},"MÉDIA GOLS/JOGO *",{"$nulls":7},{"$f":"AH11/(Q8+Q9)","v":{"v":2.189873417721519,"d":"2.19"}}]
[null,null,"AUSENTES",{"$nulls":7},{"$f":"COUNTIF(Jogos!S:S,\"AUS\")","v":0},null,null,{"v":0,"d":"0%"},null,null,{"$f":"COUNTIFS(Jogos!B:B,\">0\",Jogos!$S:$S,\"AUSIND\")","v":0},null,null,{"v":0,"d":"0%"},{"$nulls":5},"*desconsiderado os W0´s"]
[]
["FÓRMULA DE DISPUTA:"]
[]
["TAÇA DE OURO",null,"1ª Fase",{"$nulls":4},"2ª Fase",{"$nulls":3},"QUARTAS",{"$nulls":5},"SEMI",{"$nulls":4},"FINAL"]
[null,null,"Na primeira fase, as equipes são divididas em dois grupos e os três primeiros de cada grupo avançam para as QUARTAS. Os quarto e quinto colocados avançam para a 2a FASE. Os vencedores dos confrontos da 2a FASE também avançam para as QUARTAS. A partir daí, se enfrentam em \"mata-mata\" até a final."]
[]
[]
[]
[]
[]
[{"$nulls":12},2]
[]
[{"$nulls":17},2]
[]
[null,null,9,{"$nulls":4},2,{"$nulls":4},2]
[]
[{"$nulls":22},2]
[]
[null,null,8,{"$nulls":4},2,{"$nulls":4},2]
[]
[{"$nulls":17},2]
[]
[{"$nulls":12},2]
[]
[]
[]
["TAÇA DE PRATA",{"$nulls":6},"1ª Fase",{"$nulls":4},"SEMI",{"$nulls":4},"FINAL"]
[{"$nulls":7},"Os tres ultimos de cada grupo da 1a FASE da Taça de Ouro se enfrentam em jogo único. Os vencedores destes confrontros se juntam ao 6o colocado do grupo A e disputam as SEMI. Os vencedores das SEMI disputam o título."]
[]
[]
[]
[]
[]
[{"$nulls":7},2]
[]
[{"$nulls":12},2]
[]
[{"$nulls":7},2,{"$nulls":9},2]
[]
[{"$nulls":12},2]
[]
[{"$nulls":7},2]
[]
[]
[]
["CRITÉRIOS DE CLASSIFICAÇÃO:"]
[]
["1) Maior número de PONTOS GANHOS, na fase em disputa"]
["2) Maior número de VITORIAS, na fase em disputa"]
["3) Melhor SALDO DE GOLS, na fase em disputa"]
["4) Maior número de GOLS PRO, na fase em disputa"]
["5) Melhor SALDO DE GOLS, no(s) confronto(s) direto(s), na fase em disputa"]
["6) Maior soma de SALDO DE GOLS INDIVIDUAIS, na fase em disputa"]
["7) Maior soma de GOLS PRO INDIVIDUAIS, na fase em disputa"]
["8) Adotar os critérios (1) a (7), pela ordem, em todo o campeonato"]
["9) Sorteio"]
["OBS1: Caso três ou mais equipes estejam empatadas, o quinto critério deverá ser desconsiderado. "]
["OBS2: Para efeito de classificação final, considera-se:"]
[null,null,"1) Disputado a fase mais próxima da final;"]
[null,null,"2) Melhor rendimento técnico (total PG obtidos dividos pelo total PG possiveis)"]

{"sheet":"Clubes Participantes","index":2,"n_rows":21,"n_cols":2,"rows_kept":21}
[{"$f":"Info!A1","v":"XL CAMPEONATO BRASILEIRO INTERCLUBES / 2022"}]
[{"$f":"Info!A2","v":"Matias Barbosa / MG, 15 a 17 de abril de 2022"}]
[]
["CLUBE","CIDADE / UF"]
["AABB/ACAFUMA [A]","Brasilia / DF"]
["AABB/ACAFUMA [B]","Brasilia / DF"]
["AABB/ACAFUMA [C]","Brasilia / DF"]
["BOTAFOGO","Rio de Janeiro / RJ"]
["CHACAL [A]","Juiz de Fora / MG"]
["CHACAL [B]","Juiz de Fora / MG"]
["COMARY","Teresópolis / RJ"]
["ELDORADO","Juiz de Fora / MG"]
["GRÊMIO MINEIRO","Belo Horizonte / MG"]
["LIBERDADE [A]","Belo Horizonte / MG"]
["LIBERDADE [B]","Belo Horizonte / MG"]
["MATIAS [A]","Matias Barbosa / MG"]
["MATIAS [B]","Matias Barbosa / MG"]
["TUPI [A]","Juiz de Fora / MG"]
["TUPI [B]","Juiz de Fora / MG"]
["UNIÃO INDEPENDENTE/UBERABA","Uberaba / MG"]
["VASCO DA GAMA","Rio de Janeiro / RJ"]

{"sheet":"Tecnicos Participantes","index":3,"n_rows":89,"n_cols":2,"rows_kept":89}
[{"$f":"Info!A1","v":"XL CAMPEONATO BRASILEIRO INTERCLUBES / 2022"}]
[{"$f":"Info!A2","v":"Matias Barbosa / MG, 15 a 17 de abril de 2022"}]
[]
["BOTONISTA","CLUBE"]
["Adolpho Parente","AABB/ACAFUMA [B]"]
["Ailson Brites \"Jucao\"","MATIAS [B]"]
["Alcides Figueira","AABB/ACAFUMA [B]"]
["Alex Lage","ELDORADO"]
["Altanir Junior \"Juninho\"","BOTAFOGO"]
["Andre Brandao","AABB/ACAFUMA [C]"]
["Antonio Carlos Almeida","AABB/ACAFUMA [A]"]
["Bernardo Pires","ELDORADO"]
["Breno Ribeiro","LIBERDADE [A]"]
["Brunno Gill","MATIAS [A]"]
["Bruno Machado \"Mestre\"","BOTAFOGO"]
["Carlos Antonio Miranda","TUPI [A]"]
["Carlos Henrique Garcia \"CH\"","LIBERDADE [A]"]
["Claudio Figueiredo","COMARY"]
["Constancio Moura","UNIÃO INDEPENDENTE/UBERABA"]
["Daniel Oliveira","LIBERDADE [B]"]
["Diego Americo","BOTAFOGO"]
["Eber Chapinotti","MATIAS [B]"]
["Eder Patrocinio","VASCO DA GAMA"]
["Eduardo Costa \"Dudu\"","VASCO DA GAMA"]
["Eduardo Guerra","TUPI [A]"]
["Eduardo Tavares","COMARY"]
["Emerson Claudino","UNIÃO INDEPENDENTE/UBERABA"]
["Evandro Gomes","VASCO DA GAMA"]
["Everton Costa","CHACAL [B]"]
["Fernando Ferreira \"Nando\"","VASCO DA GAMA"]
["Fernando Vianna","GRÊMIO MINEIRO"]
["Flavio Scarpelli","TUPI [B]"]
["Gustavo Lopes \"Heavy\"","GRÊMIO MINEIRO"]
["Heman Junior","CHACAL [B]"]
["Henrique Madeira","VASCO DA GAMA"]
["Humberto Ramos","MATIAS [B]"]
["Igor Guarilha","COMARY"]
["Janilson Pereira","CHACAL [A]"]
["Jefferson Rosa","CHACAL [B]"]
["Joao Eduardo Pereira","LIBERDADE [B]"]
["Joao Francisco Stephan","CHACAL [A]"]
["Jorge Dias","ELDORADO"]
["Jose Lessa","MATIAS [A]"]
["Jose Pires","ELDORADO"]
["Juliano Gomes","UNIÃO INDEPENDENTE/UBERABA"]
["Julio Celio Braga","CHACAL [A]"]
["Leandro Benicio \"Leco\"","TUPI [B]"]
["Leonardo de Oliveira","MATIAS [A]"]
["Leonardo Duguet","LIBERDADE [A]"]
["Leonardo Stumpf","TUPI [A]"]
["Lorival Ribeiro","LIBERDADE [A]"]
["Lucas Luna","CHACAL [B]"]
["Luiz Carlos Guerra","LIBERDADE [B]"]
["Luiz Claudio Caruso","AABB/ACAFUMA [A]"]
["Luiz Henrique Colla","TUPI [B]"]
["Luiz Humberto \"Beto\"","UNIÃO INDEPENDENTE/UBERABA"]
["Marcelo Ferreira","AABB/ACAFUMA [B]"]
["Marcelo Henrique \"Bozo\"","MATIAS [A]"]
["Marcelo Lima","VASCO DA GAMA"]
["Marcelo Silva \"Issa\"","AABB/ACAFUMA [C]"]
["Marcelo Virgilio","LIBERDADE [B]"]
["Marco Andre Veloso","COMARY"]
["Marcos Ferreira","BOTAFOGO"]
["Marcus Monteiro","TUPI [A]"]
["Mario Cleber","MATIAS [B]"]
["Pablino Colen","CHACAL [B]"]
["Pablo Sidarta","COMARY"]
["Paulo Airton Junior","AABB/ACAFUMA [C]"]
["Paulo Caruso","AABB/ACAFUMA [A]"]
["Paulo Cesar Faria","AABB/ACAFUMA [B]"]
["Paulo Mangia \"Chicao\"","CHACAL [A]"]
["Paulo Marcos de França","TUPI [A]"]
["Paulo Ricardo Souza","TUPI [B]"]
["Rafael Pena","LIBERDADE [B]"]
["Renato Negreiros","BOTAFOGO"]
["Ricardo Machado","COMARY"]
["Ricardo Sartine","MATIAS [B]"]
["Rodolfo Magalhaes","CHACAL [B]"]
["Rodrigo Caruso \"Digao\"","AABB/ACAFUMA [B]"]
["Rodrigo Primola \"Tuba\"","GRÊMIO MINEIRO"]
["Romualdo Piccinini","MATIAS [B]"]
["Sergio Falcometa","BOTAFOGO"]
["Simplicio Santos","AABB/ACAFUMA [C]"]
["Tarcizio Dinoa Junior","AABB/ACAFUMA [A]"]
["Thiago Stephan","CHACAL [A]"]
["Valmir Silva","VASCO DA GAMA"]
["Vander Felipe","GRÊMIO MINEIRO"]
["Vanderley da Silva","CHACAL [B]"]
["Wendel Cordeiro","LIBERDADE [A]"]

{"sheet":"Jogos","index":4,"n_rows":400,"n_cols":26,"rows_kept":400,"merged":[[2,10,2,13],[2,14,2,17],[2,18,3,18],[3,24,3,25]]}
[{"$f":"Info!A1","v":"XL CAMPEONATO BRASILEIRO INTERCLUBES / 2022"}]
[{"$f":"Info!A2","v":"Matias Barbosa / MG, 15 a 17 de abril de 2022"},{"$nulls":19},"↓ selecione a EQUIPE ou BOTONISTA ↓"]
[{"$nulls":10},"MANDANTE",{"$nulls":3},"VISITANTE",{"$nulls":3},"WO|WW",{"$nulls":3},"←←←←←←←←←←←←←",{"$f":"IFERROR(VLOOKUP(U3,Y:Z,2,FALSE),\"--\")","v":"--"}]
["JG.CLU","JG.IND","DATA","GRUPO","PARTIDA",{"$nulls":5},"PG","GP","GPI","V|E|D",null,"GPI","GP","PG",null,null,"JOGOS DA EQUIPE ou BOTONISTA",null,"MANDANTE","VISITANTE","EQUIPE ou BOTONISTA"]
[]
[{"v":1,"d":"001"},null,"2022-04-15",{"v":2,"d":"02"},"AABB/ACAFUMA [B]",1,"x",2,"MATIAS [A]",null,{"$f":"IF(N6=\"V\",3,IF(N6=\"E\",1,0))","v":0},{"$f":"F6","v":1},{"$f":"SUM(M7:M10)","v":2},{"$f":"IF(F6&+H6=\"WW\",\"D\",IF(F6>H6,\"V\",IF(F6=H6,\"E\",\"D\")))","v":"D"},{"$f":"IF(F6&+H6=\"WW\",\"D\",IF(F6<H6,\"V\",IF(F6=H6,\"E\",\"D\")))","v":"V"},{"$f":"SUM(P7:P10)","v":4},{"$f":"H6","v":2},{"$f":"IF(O6=\"V\",3,IF(O6=\"E\",1,0))","v":3},{"$f":"IF(LEFT(E6,7)=\"\",\"AUS\"&+IF(B6>0,\"IND\",\"\"),IF(LEFT(I6,7)=\"\",\"AUS\"&+IF(B6>0,\"IND\",\"\"),IF(LEFT(E6,7)=\"Ausente\",\"AUS\"&+IF(B6>0,\"IND\",\"\"),IF(LEFT(I6,7)=\"Ausente\",\"AUS\"&+IF(B6>0,\"IND\",\"\"),IF(RIGHT(F6,1)=\"*\",\"NULO\"&+IF(B6>0,\"IND\",\"\"),IF(F6&H6=\"----\",\"NULO\"&+IF(B6>0,\"IND\",\"\"),IF(F6&H6=\"W0\",\"W0\"&+IF(B6>0,\"IND\",\"\"),IF(F6&H6=\"0W\",\"W0\"&+IF(B6>0,\"IND\",\"\"),IF(F6&H6=\"WW\",\"WW\"&+IF(B6>0,\"IND\",\"\"),\"--\")))))))))","v":"--"},null,{"$f":"IF($X$3=\"BOTONISTA\",(IF($U$3=E6,$U$3,IF($U$3=I6,$U$3,\"--\"))),IF($X$3=\"EQUIPE\",(IF($U$3=W6,$U$3,IF($U$3=X6,$U$3,\"--\"))),\"--\"))","v":"--"},null,{"$f":"E6","v":"AABB/ACAFUMA [B]"},{"$f":"I6","v":"MATIAS [A]"},"LIBERDADE [A]",{"$f":"IF(LEFT(Y6,7)=\"AUSENTE\",\"EQUIPE\",IF(IFERROR(VLOOKUP(Y6,'Clubes Participantes'!A:B,1,FALSE),\"BOTONISTA\")=\"BOTONISTA\",\"BOTONISTA\",\"EQUIPE\"))","v":"EQUIPE"}]
[null,{"v":1,"d":"001"},null,null,"Adolpho Parente",1,"x",0,"Jose Lessa",{"$nulls":3},{"$f":"IF(F7&H7=\"WW\",0,IF(F7&H7=\"W0\",2,F7))","v":1},{"$f":"IF(F7&+H7=\"WW\",\"D\",IF(F7>H7,\"V\",IF(F7=H7,\"E\",\"D\")))","v":"V"},{"$f":"IF(F7&+H7=\"WW\",\"D\",IF(F7<H7,\"V\",IF(F7=H7,\"E\",\"D\")))","v":"D"},{"$f":"IF(F7&H7=\"WW\",0,IF(F7&H7=\"0W\",2,H7))","v":0},null,null,{"$f":"IF(LEFT(E7,7)=\"\",\"AUS\"&+IF(B7>0,\"IND\",\"\"),IF(LEFT(I7,7)=\"\",\"AUS\"&+IF(B7>0,\"IND\",\"\"),IF(LEFT(E7,7)=\"Ausente\",\"AUS\"&+IF(B7>0,\"IND\",\"\"),IF(LEFT(I7,7)=\"Ausente\",\"AUS\"&+IF(B7>0,\"IND\",\"\"),IF(RIGHT(F7,1)=\"*\",\"NULO\"&+IF(B7>0,\"IND\",\"\"),IF(F7&H7=\"----\",\"NULO\"&+IF(B7>0,\"IND\",\"\"),IF(F7&H7=\"W0\",\"W0\"&+IF(B7>0,\"IND\",\"\"),IF(F7&H7=\"0W\",\"W0\"&+IF(B7>0,\"IND\",\"\"),IF(F7&H7=\"WW\",\"WW\"&+IF(B7>0,\"IND\",\"\"),\"--\")))))))))","v":"--"},null,"--",null,{"$f":"W6","v":"AABB/ACAFUMA [B]"},{"$f":"X6","v":"MATIAS [A]"},"Breno Ribeiro",{"$f":"IF(LEFT(Y7,7)=\"AUSENTE\",\"EQUIPE\",IF(IFERROR(VLOOKUP(Y7,'Clubes Participantes'!A:B,1,FALSE),\"BOTONISTA\")=\"BOTONISTA\",\"BOTONISTA\",\"EQUIPE\"))","v":"BOTONISTA"}]
[null,{"v":2,"d":"002"},null,null,"Paulo Cesar Faria",0,"x",0,"Marcelo Henrique",{"$nulls":3},{"$f":"IF(F8&H8=\"WW\",0,IF(F8&H8=\"W0\",2,F8))","v":0},"E","E",{"$f":"IF(F8&H8=\"WW\",0,IF(F8&H8=\"0W\",2,H8))","v":0},null,null,"--",null,"--",null,{"$f":"W6","v":"AABB/ACAFUMA [B]"},"MATIAS [A]","Carlos Henrique Garcia",{"$f":"IF(LEFT(Y8,7)=\"AUSENTE\",\"EQUIPE\",IF(IFERROR(VLOOKUP(Y8,'Clubes Participantes'!A:B,1,FALSE),\"BOTONISTA\")=\"BOTONISTA\",\"BOTONISTA\",\"EQUIPE\"))","v":"BOTONISTA"}]
[null,{"v":3,"d":"003"},null,null,"Rodrigo Caruso",0,"x",1,"Brunno Gill",{"$nulls":3},0,"D","V",1,null,null,"--",null,"--",null,"AABB/ACAFUMA [B]","MATIAS [A]","Leonardo Duguet",{"$f":"IF(LEFT(Y9,7)=\"AUSENTE\",\"EQUIPE\",IF(IFERROR(VLOOKUP(Y9,'Clubes Participantes'!A:B,1,FALSE),\"BOTONISTA\")=\"BOTONISTA\",\"BOTONISTA\",\"EQUIPE\"))","v":"BOTONISTA"}]
[null,{"v":4,"d":"004"},null,null,"Alcides Figueira",1,"x",3,"Leonardo de Oliveira",{"$nulls":3},1,"D","V",3,null,null,"--",null,"--",null,"AABB/ACAFUMA [B]","MATIAS [A]","Lorival Ribeiro",{"$f":"IF(LEFT(Y10,7)=\"AUSENTE\",\"EQUIPE\",IF(IFERROR(VLOOKUP(Y10,'Clubes Participantes'!A:B,1,FALSE),\"BOTONISTA\")=\"BOTONISTA\",\"BOTONISTA\",\"EQUIPE\"))","v":"BOTONISTA"}]
[{"v":2,"d":"002"},null,"2022-04-15",{"v":2,"d":"02"},"VASCO DA GAMA",0,"x",4,"LIBERDADE [A]",null,{"$f":"IF(N11=\"V\",3,IF(N11=\"E\",1,0))","v":0},{"$f":"F11","v":0},{"$f":"SUM(M12:M15)","v":3},"D","V",{"$f":"SUM(P12:P15)","v":11},{"$f":"H11","v":4},{"$f":"IF(O11=\"V\",3,IF(O11=\"E\",1,0))","v":3},"--",null,"--",null,{"$f":"E11","v":"VASCO DA GAMA"},{"$f":"I11","v":"LIBERDADE [A]"},"Wendel Cordeiro",{"$f":"IF(LEFT(Y11,7)=\"AUSENTE\",\"EQUIPE\",IF(IFERROR(VLOOKUP(Y11,'Clubes Participantes'!A:B,1,FALSE),\"BOTONISTA\")=\"BOTONISTA\",\"BOTONISTA\",\"EQUIPE\"))","v":"BOTONISTA"}]
[null,{"v":5,"d":"005"},null,null,"Evandro Gomes",1,"x",2,"Leonardo Duguet",{"$nulls":3},{"$f":"IF(F12&H12=\"WW\",0,IF(F12&H12=\"W0\",2,F12))","v":1},{"$f":"IF(F12&+H12=\"WW\",\"D\",IF(F12>H12,\"V\",IF(F12=H12,\"E\",\"D\")))","v":"D"},{"$f":"IF(F12&+H12=\"WW\",\"D\",IF(F12<H12,\"V\",IF(F12=H12,\"E\",\"D\")))","v":"V"},{"$f":"IF(F12&H12=\"WW\",0,IF(F12&H12=\"0W\",2,H12))","v":2},null,null,"--",null,"--",null,{"$f":"W11","v":"VASCO DA GAMA"},"LIBERDADE [A]","TUPI [A]",{"$f":"IF(LEFT(Y12,7)=\"AUSENTE\",\"EQUIPE\",IF(IFERROR(VLOOKUP(Y12,'Clubes Participantes'!A:B,1,FALSE),\"BOTONISTA\")=\"BOTONISTA\",\"BOTONISTA\",\"EQUIPE\"))","v":"EQUIPE"}]
[null,{"v":6,"d":"006"},null,null,"Eder Patrocinio",0,"x",4,"Breno Ribeiro",{"$nulls":3},0,"D","V",4,null,null,"--",null,"--",null,{"$f":"W11","v":"VASCO DA GAMA"},"LIBERDADE [A]","Carlos Antonio Miranda",{"$f":"IF(LEFT(Y13,7)=\"AUSENTE\",\"EQUIPE\",IF(IFERROR(VLOOKUP(Y13,'Clubes Participantes'!A:B,1,FALSE),\"BOTONISTA\")=\"BOTONISTA\",\"BOTONISTA\",\"EQUIPE\"))","v":"BOTONISTA"}]
[null,{"v":7,"d":"007"},null,null,"Fernando Ferreira",1,"x",3,"Lorival Ribeiro",{"$nulls":3},1,"D","V",3,null,null,"--",null,"--",null,"VASCO DA GAMA","LIBERDADE [A]","Eduardo Guerra",{"$f":"IF(LEFT(Y14,7)=\"AUSENTE\",\"EQUIPE\",IF(IFERROR(VLOOKUP(Y14,'Clubes Participantes'!A:B,1,FALSE),\"BOTONISTA\")=\"BOTONISTA\",\"BOTONISTA\",\"EQUIPE\"))","v":"BOTONISTA"}]
[null,{"v":8,"d":"008"},null,null,"Henrique Madeira",1,"x",2,"Carlos Henrique Garcia",{"$nulls":3},1,"D","V",2,null,null,"--",null,"--",null,"VASCO DA GAMA","LIBERDADE [A]","Leonardo Stumpf",{"$f":"IF(LEFT(Y15,7)=\"AUSENTE\",\"EQUIPE\",IF(IFERROR(VLOOKUP(Y15,'Clubes Participantes'!A:B,1,FALSE),\"BOTONISTA\")=\"BOTONISTA\",\"BOTONISTA\",\"EQUIPE\"))","v":"BOTONISTA"}]
[{"v":3,"d":"003"},null,"2022-04-15",{"v":1,"d":"01"},"BOTAFOGO",4,"x",0,"GRÊMIO MINEIRO",null,{"$f":"IF(N16=\"V\",3,IF(N16=\"E\",1,0))","v":3},{"$f":"F16","v":4},{"$f":"SUM(M17:M20)","v":7},"V","D",{"$f":"SUM(P17:P20)","v":3},{"$f":"H16","v":0},{"$f":"IF(O16=\"V\",3,IF(O16=\"E\",1,0))","v":0},"--",null,"--",null,{"$f":"E16","v":"BOTAFOGO"},{"$f":"I16","v":"GRÊMIO MINEIRO"},"Marcus Monteiro",{"$f":"IF(LEFT(Y16,7)=\"AUSENTE\",\"EQUIPE\",IF(IFERROR(VLOOKUP(Y16,'Clubes Participantes'!A:B,1,FALSE),\"BOTONISTA\")=\"BOTONISTA\",\"BOTONISTA\",\"EQUIPE\"))","v":"BOTONISTA"}]
[null,{"v":9,"d":"009"},null,null,"Altanir Junior",2,"x",1,"Gustavo Lopes",{"$nulls":3},{"$f":"IF(F17&H17=\"WW\",0,IF(F17&H17=\"W0\",2,F17))","v":2},"V","D",{"$f":"IF(F17&H17=\"WW\",0,IF(F17&H17=\"0W\",2,H17))","v":1},null,null,"--",null,"--",null,{"$f":"W16","v":"BOTAFOGO"},"GRÊMIO MINEIRO","Paulo Marcos de França",{"$f":"IF(LEFT(Y17,7)=\"AUSENTE\",\"EQUIPE\",IF(IFERROR(VLOOKUP(Y17,'Clubes Participantes'!A:B,1,FALSE),\"BOTONISTA\")=\"BOTONISTA\",\"BOTONISTA\",\"EQUIPE\"))","v":"BOTONISTA"}]
[null,{"v":10,"d":"010"},null,null,"Diego Americo",2,"x",1,"Vander Felipe",{"$nulls":3},2,"V","D",1,null,null,"--",null,"--",null,{"$f":"W16","v":"BOTAFOGO"},"GRÊMIO MINEIRO","UNIÃO INDEPENDENTE/UBERABA",{"$f":"IF(LEFT(Y18,7)=\"AUSENTE\",\"EQUIPE\",IF(IFERROR(VLOOKUP(Y18,'Clubes Participantes'!A:B,1,FALSE),\"BOTONISTA\")=\"BOTONISTA\",\"BOTONISTA\",\"EQUIPE\"))","v":"EQUIPE"}]
[null,{"v":11,"d":"011"},null,null,"Renato Negreiros",2,"x",1,"Rodrigo Primola",{"$nulls":3},2,"V","D",1,null,null,"--",null,"--",null,"BOTAFOGO","GRÊMIO MINEIRO","Constancio Moura",{"$f":"IF(LEFT(Y19,7)=\"AUSENTE\",\"EQUIPE\",IF(IFERROR(VLOOKUP(Y19,'Clubes Participantes'!A:B,1,FALSE),\"BOTONISTA\")=\"BOTONISTA\",\"BOTONISTA\",\"EQUIPE\"))","v":"BOTONISTA"}]
[null,{"v":12,"d":"012"},null,null,"Sergio Falcometa",1,"x",0,"Fernando Vianna",{"$nulls":3},1,"V","D",0,null,null,"--",null,"--",null,"BOTAFOGO","GRÊMIO MINEIRO","Emerson Claudino",{"$f":"IF(LEFT(Y20,7)=\"AUSENTE\",\"EQUIPE\",IF(IFERROR(VLOOKUP(Y20,'Clubes Participantes'!A:B,1,FALSE),\"BOTONISTA\")=\"BOTONISTA\",\"BOTONISTA\",\"EQUIPE\"))","v":"BOTONISTA"}]
[{"v":4,"d":"004"},null,"2022-04-15",{"v":1,"d":"01"},"AABB/ACAFUMA [C]",1,"x",1,"AABB/ACAFUMA [A]",null,{"$f":"IF(N21=\"V\",3,IF(N21=\"E\",1,0))","v":1},{"$f":"F21","v":1},{"$f":"SUM(M22:M25)","v":3},"E","E",{"$f":"SUM(P22:P25)","v":3},{"$f":"H21","v":1},{"$f":"IF(O21=\"V\",3,IF(O21=\"E\",1,0))","v":1},"--",null,"--",null,{"$f":"E21","v":"AABB/ACAFUMA [C]"},{"$f":"I21","v":"AABB/ACAFUMA [A]"},"Juliano Gomes",{"$f":"IF(LEFT(Y21,7)=\"AUSENTE\",\"EQUIPE\",IF(IFERROR(VLOOKUP(Y21,'Clubes Participantes'!A:B,1,FALSE),\"BOTONISTA\")=\"BOTONISTA\",\"BOTONISTA\",\"EQUIPE\"))","v":"BOTONISTA"}]
[null,{"v":13,"d":"013"},null,null,"Andre Brandao",0,"x",0,"Antonio Carlos Almeida",{"$nulls":3},{"$f":"IF(F22&H22=\"WW\",0,IF(F22&H22=\"W0\",2,F22))","v":0},"E","E",{"$f":"IF(F22&H22=\"WW\",0,IF(F22&H22=\"0W\",2,H22))","v":0},null,null,"--",null,"--",null,{"$f":"W21","v":"AABB/ACAFUMA [C]"},"AABB/ACAFUMA [A]","Luiz Humberto",{"$f":"IF(LEFT(Y22,7)=\"AUSENTE\",\"EQUIPE\",IF(IFERROR(VLOOKUP(Y22,'Clubes Participantes'!A:B,1,FALSE),\"BOTONISTA\")=\"BOTONISTA\",\"BOTONISTA\",\"EQUIPE\"))","v":"BOTONISTA"}]
[null,{"v":14,"d":"014"},null,null,"Paulo Airton Junior",1,"x",1,"Tarcizio Dinoa Junior",{"$nulls":3},1,"E","E",1,null,null,"--",null,"--",null,{"$f":"W21","v":"AABB/ACAFUMA [C]"},"AABB/ACAFUMA [A]","MATIAS [A]",{"$f":"IF(LEFT(Y23,7)=\"AUSENTE\",\"EQUIPE\",IF(IFERROR(VLOOKUP(Y23,'Clubes Participantes'!A:B,1,FALSE),\"BOTONISTA\")=\"BOTONISTA\",\"BOTONISTA\",\"EQUIPE\"))","v":"EQUIPE"}]
[null,{"v":15,"d":"015"},null,null,"Simplicio Santos",1,"x",2,"Luiz Claudio Caruso",{"$nulls":3},1,"D","V",2,null,null,"--",null,"--",null,"AABB/ACAFUMA [C]","AABB/ACAFUMA [A]","Brunno Gill",{"$f":"IF(LEFT(Y24,7)=\"AUSENTE\",\"EQUIPE\",IF(IFERROR(VLOOKUP(Y24,'Clubes Participantes'!A:B,1,FALSE),\"BOTONISTA\")=\"BOTONISTA\",\"BOTONISTA\",\"EQUIPE\"))","v":"BOTONISTA"}]
[null,{"v":16,"d":"016"},null,null,"Marcelo Silva",1,"x",0,"Paulo Caruso",{"$nulls":3},1,"V","D",0,null,null,"--",null,"--",null,"AABB/ACAFUMA [C]","AABB/ACAFUMA [A]","Jose Lessa",{"$f":"IF(LEFT(Y25,7)=\"AUSENTE\",\"EQUIPE\",IF(IFERROR(VLOOKUP(Y25,'Clubes Participantes'!A:B,1,FALSE),\"BOTONISTA\")=\"BOTONISTA\",\"BOTONISTA\",\"EQUIPE\"))","v":"BOTONISTA"}]
[{"v":5,"d":"005"},null,"2022-04-15",{"v":1,"d":"01"},"COMARY",1,"x",2,"CHACAL [A]",null,{"$f":"IF(N26=\"V\",3,IF(N26=\"E\",1,0))","v":0},{"$f":"F26","v":1},{"$f":"SUM(M27:M30)","v":2},"D","V",{"$f":"SUM(P27:P30)","v":6},{"$f":"H26","v":2},{"$f":"IF(O26=\"V\",3,IF(O26=\"E\",1,0))","v":3},"--",null,"--",null,{"$f":"E26","v":"COMARY"},{"$f":"I26","v":"CHACAL [A]"},"Leonardo de Oliveira",{"$f":"IF(LEFT(Y26,7)=\"AUSENTE\",\"EQUIPE\",IF(IFERROR(VLOOKUP(Y26,'Clubes Participantes'!A:B,1,FALSE),\"BOTONISTA\")=\"BOTONISTA\",\"BOTONISTA\",\"EQUIPE\"))","v":"BOTONISTA"}]
[null,{"v":17,"d":"017"},null,null,"Eduardo Tavares",0,"x",0,"Thiago Stephan",{"$nulls":3},{"$f":"IF(F27&H27=\"WW\",0,IF(F27&H27=\"W0\",2,F27))","v":0},"E","E",{"$f":"IF(F27&H27=\"WW\",0,IF(F27&H27=\"0W\",2,H27))","v":0},null,null,"--",null,"--",null,{"$f":"W26","v":"COMARY"},"CHACAL [A]","Marcelo Henrique",{"$f":"IF(LEFT(Y27,7)=\"AUSENTE\",\"EQUIPE\",IF(IFERROR(VLOOKUP(Y27,'Clubes Participantes'!A:B,1,FALSE),\"BOTONISTA\")=\"BOTONISTA\",\"BOTONISTA\",\"EQUIPE\"))","v":"BOTONISTA"}]
[null,{"v":18,"d":"018"},null,null,"Igor Guarilha",2,"x",1,"Julio Celio Braga",{"$nulls":3},2,"V","D",1,null,null,"--",null,"--",null,{"$f":"W26","v":"COMARY"},"CHACAL [A]","BOTAFOGO",{"$f":"IF(LEFT(Y28,7)=\"AUSENTE\",\"EQUIPE\",IF(IFERROR(VLOOKUP(Y28,'Clubes Participantes'!A:B,1,FALSE),\"BOTONISTA\")=\"BOTONISTA\",\"BOTONISTA\",\"EQUIPE\"))","v":"EQUIPE"}]
[null,{"v":19,"d":"019"},null,null,"Ricardo Machado",0,"x",3,"Joao Francisco Stephan",{"$nulls":3},0,"D","V",3,null,null,"--",null,"--",null,"COMARY","CHACAL [A]","Altanir Junior",{"$f":"IF(LEFT(Y29,7)=\"AUSENTE\",\"EQUIPE\",IF(IFERROR(VLOOKUP(Y29,'Clubes Participantes'!A:B,1,FALSE),\"BOTONISTA\")=\"BOTONISTA\",\"BOTONISTA\",\"EQUIPE\"))","v":"BOTONISTA"}]
[null,{"v":20,"d":"020"},null,null,"Marco Andre Veloso",0,"x",2,"Janilson Pereira",{"$nulls":3},0,"D","V",2,null,null,"--",null,"--",null,"COMARY","CHACAL [A]","Bruno Machado",{"$f":"IF(LEFT(Y30,7)=\"AUSENTE\",\"EQUIPE\",IF(IFERROR(VLOOKUP(Y30,'Clubes Participantes'!A:B,1,FALSE),\"BOTONISTA\")=\"BOTONISTA\",\"BOTONISTA\",\"EQUIPE\"))","v":"BOTONISTA"}]
[{"v":6,"d":"006"},null,"2022-04-15",{"v":2,"d":"02"},"CHACAL [B]",0,"x",4,"UNIÃO INDEPENDENTE/UBERABA",null,{"$f":"IF(N31=\"V\",3,IF(N31=\"E\",1,0))","v":0},{"$f":"F31","v":0},{"$f":"SUM(M32:M35)","v":0},"D","V",{"$f":"SUM(P32:P35)","v":8},{"$f":"H31","v":4},{"$f":"IF(O31=\"V\",3,IF(O31=\"E\",1,0))","v":3},"--",null,"--",null,{"$f":"E31","v":"CHACAL [B]"},{"$f":"I31","v":"UNIÃO INDEPENDENTE/UBERABA"},"Diego Americo",{"$f":"IF(LEFT(Y31,7)=\"AUSENTE\",\"EQUIPE\",IF(IFERROR(VLOOKUP(Y31,'Clubes Participantes'!A:B,1,FALSE),\"BOTONISTA\")=\"BOTONISTA\",\"BOTONISTA\",\"EQUIPE\"))","v":"BOTONISTA"}]
[null,{"v":21,"d":"021"},null,null,"Everton Costa",0,"x",2,"Emerson Claudino",{"$nulls":3},{"$f":"IF(F32&H32=\"WW\",0,IF(F32&H32=\"W0\",2,F32))","v":0},"D","V",{"$f":"IF(F32&H32=\"WW\",0,IF(F32&H32=\"0W\",2,H32))","v":2},null,null,"--",null,"--",null,{"$f":"W31","v":"CHACAL [B]"},"UNIÃO INDEPENDENTE/UBERABA","Marcos Ferreira",{"$f":"IF(LEFT(Y32,7)=\"AUSENTE\",\"EQUIPE\",IF(IFERROR(VLOOKUP(Y32,'Clubes Participantes'!A:B,1,FALSE),\"BOTONISTA\")=\"BOTONISTA\",\"BOTONISTA\",\"EQUIPE\"))","v":"BOTONISTA"}]
[null,{"v":22,"d":"022"},null,null,"Jefferson Rosa",0,"x",2,"Juliano Gomes",{"$nulls":3},0,"D","V",2,null,null,"--",null,"--",null,{"$f":"W31","v":"CHACAL [B]"},"UNIÃO INDEPENDENTE/UBERABA","Renato Negreiros",{"$f":"IF(LEFT(Y33,7)=\"AUSENTE\",\"EQUIPE\",IF(IFERROR(VLOOKUP(Y33,'Clubes Participantes'!A:B,1,FALSE),\"BOTONISTA\")=\"BOTONISTA\",\"BOTONISTA\",\"EQUIPE\"))","v":"BOTONISTA"}]
[null,{"v":23,"d":"023"},null,null,"Heman Junior",0,"x",2,"Constancio Moura",{"$nulls":3},0,"D","V",2,null,null,"--",null,"--",null,"CHACAL [B]","UNIÃO INDEPENDENTE/UBERABA","Sergio Falcometa",{"$f":"IF(LEFT(Y34,7)=\"AUSENTE\",\"EQUIPE\",IF(IFERROR(VLOOKUP(Y34,'Clubes Participantes'!A:B,1,FALSE),\"BOTONISTA\")=\"BOTONISTA\",\"BOTONISTA\",\"EQUIPE\"))","v":"BOTONISTA"}]
[null,{"v":24,"d":"024"},null,null,"Lucas Luna",0,"x",2,"Luiz Humberto",{"$nulls":3},0,"D","V",2,null,null,"--",null,"--",null,"CHACAL [B]","UNIÃO INDEPENDENTE/UBERABA","LIBERDADE [B]",{"$f":"IF(LEFT(Y35,7)=\"AUSENTE\",\"EQUIPE\",IF(IFERROR(VLOOKUP(Y35,'Clubes Participantes'!A:B,1,FALSE),\"BOTONISTA\")=\"BOTONISTA\",\"BOTONISTA\",\"EQUIPE\"))","v":"EQUIPE"}]
[{"v":7,"d":"007"},null,"2022-04-15",{"v":2,"d":"02"},"ELDORADO",0,"x",2,"TUPI [B]",null,{"$f":"IF(N36=\"V\",3,IF(N36=\"E\",1,0))","v":0},{"$f":"F36","v":0},{"$f":"SUM(M37:M40)","v":3},"D","V",{"$f":"SUM(P37:P40)","v":5},{"$f":"H36","v":2},{"$f":"IF(O36=\"V\",3,IF(O36=\"E\",1,0))","v":3},"--",null,"--",null,{"$f":"E36","v":"ELDORADO"},{"$f":"I36","v":"TUPI [B]"},"Daniel Oliveira",{"$f":"IF(LEFT(Y36,7)=\"AUSENTE\",\"EQUIPE\",IF(IFERROR(VLOOKUP(Y36,'Clubes Participantes'!A:B,1,FALSE),\"BOTONISTA\")=\"BOTONISTA\",\"BOTONISTA\",\"EQUIPE\"))","v":"BOTONISTA"}]
[null,{"v":25,"d":"025"},null,null,"Jorge Dias",0,"x",1,"Paulo Ricardo Souza",{"$nulls":3},{"$f":"IF(F37&H37=\"WW\",0,IF(F37&H37=\"W0\",2,F37))","v":0},"D","V",{"$f":"IF(F37&H37=\"WW\",0,IF(F37&H37=\"0W\",2,H37))","v":1},null,null,"--",null,"--",null,{"$f":"W36","v":"ELDORADO"},"TUPI [B]","Joao Eduardo Pereira",{"$f":"IF(LEFT(Y37,7)=\"AUSENTE\",\"EQUIPE\",IF(IFERROR(VLOOKUP(Y37,'Clubes Participantes'!A:B,1,FALSE),\"BOTONISTA\")=\"BOTONISTA\",\"BOTONISTA\",\"EQUIPE\"))","v":"BOTONISTA"}]
[null,{"v":26,"d":"026"},null,null,"Jose Pires",0,"x",0,"Leandro Benicio",{"$nulls":3},0,"E","E",0,null,null,"--",null,"--",null,{"$f":"W36","v":"ELDORADO"},"TUPI [B]","Luiz Carlos Guerra",{"$f":"IF(LEFT(Y38,7)=\"AUSENTE\",\"EQUIPE\",IF(IFERROR(VLOOKUP(Y38,'Clubes Participantes'!A:B,1,FALSE),\"BOTONISTA\")=\"BOTONISTA\",\"BOTONISTA\",\"EQUIPE\"))","v":"BOTONISTA"}]
[null,{"v":27,"d":"027"},null,null,"Alex Lage",2,"x",2,"Luiz Henrique Colla",{"$nulls":3},2,"E","E",2,null,null,"--",null,"--",null,"ELDORADO","TUPI [B]","Marcelo Virgilio",{"$f":"IF(LEFT(Y39,7)=\"AUSENTE\",\"EQUIPE\",IF(IFERROR(VLOOKUP(Y39,'Clubes Participantes'!A:B,1,FALSE),\"BOTONISTA\")=\"BOTONISTA\",\"BOTONISTA\",\"EQUIPE\"))","v":"BOTONISTA"}]
[null,{"v":28,"d":"028"},null,null,"Bernardo Pires",1,"x",2,"Flavio Scarpelli",{"$nulls":3},1,"D","V",2,null,null,"--",null,"--",null,"ELDORADO","TUPI [B]","Rafael Pena",{"$f":"IF(LEFT(Y40,7)=\"AUSENTE\",\"EQUIPE\",IF(IFERROR(VLOOKUP(Y40,'Clubes Participantes'!A:B,1,FALSE),\"BOTONISTA\")=\"BOTONISTA\",\"BOTONISTA\",\"EQUIPE\"))","v":"BOTONISTA"}]
[{"v":8,"d":"008"},null,"2022-04-15",{"v":1,"d":"01"},"LIBERDADE [B]",2,"x",0,"COMARY",null,{"$f":"IF(N41=\"V\",3,IF(N41=\"E\",1,0))","v":3},{"$f":"F41","v":2},{"$f":"SUM(M42:M45)","v":4},"V","D",{"$f":"SUM(P42:P45)","v":0},{"$f":"H41","v":0},{"$f":"IF(O41=\"V\",3,IF(O41=\"E\",1,0))","v":0},"--",null,"--",null,{"$f":"E41","v":"LIBERDADE [B]"},{"$f":"I41","v":"COMARY"},"VASCO DA GAMA",{"$f":"IF(LEFT(Y41,7)=\"AUSENTE\",\"EQUIPE\",IF(IFERROR(VLOOKUP(Y41,'Clubes Participantes'!A:B,1,FALSE),\"BOTONISTA\")=\"BOTONISTA\",\"BOTONISTA\",\"EQUIPE\"))","v":"EQUIPE"}]
[null,{"v":29,"d":"029"},null,null,"Luiz Carlos Guerra",3,"x",0,"Claudio Figueiredo",{"$nulls":3},{"$f":"IF(F42&H42=\"WW\",0,IF(F42&H42=\"W0\",2,F42))","v":3},"V","D",{"$f":"IF(F42&H42=\"WW\",0,IF(F42&H42=\"0W\",2,H42))","v":0},null,null,"--",null,"--",null,{"$f":"W41","v":"LIBERDADE [B]"},"COMARY","Eder Patrocinio",{"$f":"IF(LEFT(Y42,7)=\"AUSENTE\",\"EQUIPE\",IF(IFERROR(VLOOKUP(Y42,'Clubes Participantes'!A:B,1,FALSE),\"BOTONISTA\")=\"BOTONISTA\",\"BOTONISTA\",\"EQUIPE\"))","v":"BOTONISTA"}]
[null,{"v":30,"d":"030"},null,null,"Joao Eduardo Pereira",0,"x",0,"Igor Guarilha",{"$nulls":3},0,"E","E",0,null,null,"--",null,"--",null,{"$f":"W41","v":"LIBERDADE [B]"},"COMARY","Eduardo Costa",{"$f":"IF(LEFT(Y43,7)=\"AUSENTE\",\"EQUIPE\",IF(IFERROR(VLOOKUP(Y43,'Clubes Participantes'!A:B,1,FALSE),\"BOTONISTA\")=\"BOTONISTA\",\"BOTONISTA\",\"EQUIPE\"))","v":"BOTONISTA"}]
[null,{"v":31,"d":"031"},null,null,"Rafael Pena",0,"x",0,"Pablo Sidarta",{"$nulls":3},0,"E","E",0,null,null,"--",null,"--",null,"LIBERDADE [B]","COMARY","Evandro Gomes",{"$f":"IF(LEFT(Y44,7)=\"AUSENTE\",\"EQUIPE\",IF(IFERROR(VLOOKUP(Y44,'Clubes Participantes'!A:B,1,FALSE),\"BOTONISTA\")=\"BOTONISTA\",\"BOTONISTA\",\"EQUIPE\"))","v":"BOTONISTA"}]
[null,{"v":32,"d":"032"},null,null,"Marcelo Virgilio",1,"x",0,"Eduardo Tavares",{"$nulls":3},1,"V","D",0,null,null,"--",null,"--",null,"LIBERDADE [B]","COMARY","Fernando Ferreira",{"$f":"IF(LEFT(Y45,7)=\"AUSENTE\",\"EQUIPE\",IF(IFERROR(VLOOKUP(Y45,'Clubes Participantes'!A:B,1,FALSE),\"BOTONISTA\")=\"BOTONISTA\",\"BOTONISTA\",\"EQUIPE\"))","v":"BOTONISTA"}]
[{"v":9,"d":"009"},null,"2022-04-15",{"v":1,"d":"01"},"MATIAS [B]",0,"x",3,"BOTAFOGO",null,{"$f":"IF(N46=\"V\",3,IF(N46=\"E\",1,0))","v":0},{"$f":"F46","v":0},{"$f":"SUM(M47:M50)","v":1},"D","V",{"$f":"SUM(P47:P50)","v":5},{"$f":"H46","v":3},{"$f":"IF(O46=\"V\",3,IF(O46=\"E\",1,0))","v":3},"--",null,"--",null,{"$f":"E46","v":"MATIAS [B]"},{"$f":"I46","v":"BOTAFOGO"},"Henrique Madeira",{"$f":"IF(LEFT(Y46,7)=\"AUSENTE\",\"EQUIPE\",IF(IFERROR(VLOOKUP(Y46,'Clubes Participantes'!A:B,1,FALSE),\"BOTONISTA\")=\"BOTONISTA\",\"BOTONISTA\",\"EQUIPE\"))","v":"BOTONISTA"}]
[null,{"v":33,"d":"033"},null,null,"Eber Chapinotti",0,"x",1,"Sergio Falcometa",{"$nulls":3},{"$f":"IF(F47&H47=\"WW\",0,IF(F47&H47=\"W0\",2,F47))","v":0},"D","V",{"$f":"IF(F47&H47=\"WW\",0,IF(F47&H47=\"0W\",2,H47))","v":1},null,null,"--",null,"--",null,{"$f":"W46","v":"MATIAS [B]"},"BOTAFOGO","Marcelo Lima",{"$f":"IF(LEFT(Y47,7)=\"AUSENTE\",\"EQUIPE\",IF(IFERROR(VLOOKUP(Y47,'Clubes Participantes'!A:B,1,FALSE),\"BOTONISTA\")=\"BOTONISTA\",\"BOTONISTA\",\"EQUIPE\"))","v":"BOTONISTA"}]
[null,{"v":34,"d":"034"},null,null,"Ailson Brites",1,"x",3,"Altanir Junior",{"$nulls":3},1,"D","V",3,null,null,"--",null,"--",null,{"$f":"W46","v":"MATIAS [B]"},"BOTAFOGO","Valmir Silva",{"$f":"IF(LEFT(Y48,7)=\"AUSENTE\",\"EQUIPE\",IF(IFERROR(VLOOKUP(Y48,'Clubes Participantes'!A:B,1,FALSE),\"BOTONISTA\")=\"BOTONISTA\",\"BOTONISTA\",\"EQUIPE\"))","v":"BOTONISTA"}]
[null,{"v":35,"d":"035"},null,null,"Mario Cleber",0,"x",0,"Diego Americo",{"$nulls":3},0,"E","E",0,null,null,"--",null,"--",null,"MATIAS [B]","BOTAFOGO","AABB/ACAFUMA [C]",{"$f":"IF(LEFT(Y49,7)=\"AUSENTE\",\"EQUIPE\",IF(IFERROR(VLOOKUP(Y49,'Clubes Participantes'!A:B,1,FALSE),\"BOTONISTA\")=\"BOTONISTA\",\"BOTONISTA\",\"EQUIPE\"))","v":"EQUIPE"}]
[null,{"v":36,"d":"036"},null,null,"Romualdo Piccinini",0,"x",1,"Renato Negreiros",{"$nulls":3},0,"D","V",1,null,null,"--",null,"--",null,"MATIAS [B]","BOTAFOGO","Andre Brandao",{"$f":"IF(LEFT(Y50,7)=\"AUSENTE\",\"EQUIPE\",IF(IFERROR(VLOOKUP(Y50,'Clubes Participantes'!A:B,1,FALSE),\"BOTONISTA\")=\"BOTONISTA\",\"BOTONISTA\",\"EQUIPE\"))","v":"BOTONISTA"}]
[{"v":10,"d":"010"},null,"2022-04-15",{"v":1,"d":"01"},"TUPI [A]",3,"x",0,"AABB/ACAFUMA [C]",null,{"$f":"IF(N51=\"V\",3,IF(N51=\"E\",1,0))","v":3},{"$f":"F51","v":3},{"$f":"SUM(M52:M55)","v":10},"V","D",{"$f":"SUM(P52:P55)","v":0},{"$f":"H51","v":0},{"$f":"IF(O51=\"V\",3,IF(O51=\"E\",1,0))","v":0},"--",null,"--",null,{"$f":"E51","v":"TUPI [A]"},{"$f":"I51","v":"AABB/ACAFUMA [C]"},"Marcelo Silva",{"$f":"IF(LEFT(Y51,7)=\"AUSENTE\",\"EQUIPE\",IF(IFERROR(VLOOKUP(Y51,'Clubes Participantes'!A:B,1,FALSE),\"BOTONISTA\")=\"BOTONISTA\",\"BOTONISTA\",\"EQUIPE\"))","v":"BOTONISTA"}]
[null,{"v":37,"d":"037"},null,null,"Paulo Marcos de França",0,"x",0,"Andre Brandao",{"$nulls":3},{"$f":"IF(F52&H52=\"WW\",0,IF(F52&H52=\"W0\",2,F52))","v":0},"E","E",{"$f":"IF(F52&H52=\"WW\",0,IF(F52&H52=\"0W\",2,H52))","v":0},null,null,"--",null,"--",null,{"$f":"W51","v":"TUPI [A]"},"AABB/ACAFUMA [C]","Paulo Airton Junior",{"$f":"IF(LEFT(Y52,7)=\"AUSENTE\",\"EQUIPE\",IF(IFERROR(VLOOKUP(Y52,'Clubes Participantes'!A:B,1,FALSE),\"BOTONISTA\")=\"BOTONISTA\",\"BOTONISTA\",\"EQUIPE\"))","v":"BOTONISTA"}]
[null,{"v":38,"d":"038"},null,null,"Eduardo Guerra",2,"x",0,"Marcelo Silva",{"$nulls":3},2,"V","D",0,null,null,"--",null,"--",null,{"$f":"W51","v":"TUPI [A]"},"AABB/ACAFUMA [C]","Simplicio Santos",{"$f":"IF(LEFT(Y53,7)=\"AUSENTE\",\"EQUIPE\",IF(IFERROR(VLOOKUP(Y53,'Clubes Participantes'!A:B,1,FALSE),\"BOTONISTA\")=\"BOTONISTA\",\"BOTONISTA\",\"EQUIPE\"))","v":"BOTONISTA"}]
[null,{"v":39,"d":"039"},null,null,"Leonardo Stumpf",5,"x",0,"Paulo Airton Junior",{"$nulls":3},5,"V","D",0,null,null,"--",null,"--",null,"TUPI [A]","AABB/ACAFUMA [C]","AABB/ACAFUMA [A]",{"$f":"IF(LEFT(Y54,7)=\"AUSENTE\",\"EQUIPE\",IF(IFERROR(VLOOKUP(Y54,'Clubes Participantes'!A:B,1,FALSE),\"BOTONISTA\")=\"BOTONISTA\",\"BOTONISTA\",\"EQUIPE\"))","v":"EQUIPE"}]
[null,{"v":40,"d":"040"},null,null,"Marcus Monteiro",3,"x",0,"Simplicio Santos",{"$nulls":3},3,"V","D",0,null,null,"--",null,"--",null,"TUPI [A]","AABB/ACAFUMA [C]","Antonio Carlos Almeida",{"$f":"IF(LEFT(Y55,7)=\"AUSENTE\",\"EQUIPE\",IF(IFERROR(VLOOKUP(Y55,'Clubes Participantes'!A:B,1,FALSE),\"BOTONISTA\")=\"BOTONISTA\",\"BOTONISTA\",\"EQUIPE\"))","v":"BOTONISTA"}]
[{"v":11,"d":"011"},null,"2022-04-15",{"v":1,"d":"01"},"GRÊMIO MINEIRO",2,"x",2,"MATIAS [B]",null,{"$f":"IF(N56=\"V\",3,IF(N56=\"E\",1,0))","v":1},{"$f":"F56","v":2},{"$f":"SUM(M57:M60)","v":7},"E","E",{"$f":"SUM(P57:P60)","v":7},{"$f":"H56","v":2},{"$f":"IF(O56=\"V\",3,IF(O56=\"E\",1,0))","v":1},"--",null,"--",null,{"$f":"E56","v":"GRÊMIO MINEIRO"},{"$f":"I56","v":"MATIAS [B]"},"Luiz Claudio Caruso",{"$f":"IF(LEFT(Y56,7)=\"AUSENTE\",\"EQUIPE\",IF(IFERROR(VLOOKUP(Y56,'Clubes Participantes'!A:B,1,FALSE),\"BOTONISTA\")=\"BOTONISTA\",\"BOTONISTA\",\"EQUIPE\"))","v":"BOTONISTA"}]
[null,{"v":41,"d":"041"},null,null,"Fernando Vianna",0,"x",4,"Romualdo Piccinini",{"$nulls":3},{"$f":"IF(F57&H57=\"WW\",0,IF(F57&H57=\"W0\",2,F57))","v":0},"D","V",{"$f":"IF(F57&H57=\"WW\",0,IF(F57&H57=\"0W\",2,H57))","v":4},null,null,"--",null,"--",null,{"$f":"W56","v":"GRÊMIO MINEIRO"},"MATIAS [B]","Paulo Caruso",{"$f":"IF(LEFT(Y57,7)=\"AUSENTE\",\"EQUIPE\",IF(IFERROR(VLOOKUP(Y57,'Clubes Participantes'!A:B,1,FALSE),\"BOTONISTA\")=\"BOTONISTA\",\"BOTONISTA\",\"EQUIPE\"))","v":"BOTONISTA"}]
[null,{"v":42,"d":"042"},null,null,"Rodrigo Primola",1,"x",2,"Eber Chapinotti",{"$nulls":3},1,"D","V",2,null,null,"--",null,"--",null,{"$f":"W56","v":"GRÊMIO MINEIRO"},"MATIAS [B]","Tarcizio Dinoa Junior",{"$f":"IF(LEFT(Y58,7)=\"AUSENTE\",\"EQUIPE\",IF(IFERROR(VLOOKUP(Y58,'Clubes Participantes'!A:B,1,FALSE),\"BOTONISTA\")=\"BOTONISTA\",\"BOTONISTA\",\"EQUIPE\"))","v":"BOTONISTA"}]
[null,{"v":43,"d":"043"},null,null,"Vander Felipe",3,"x",1,"Ailson Brites",{"$nulls":3},3,"V","D",1,null,null,"--",null,"--",null,"GRÊMIO MINEIRO","MATIAS [B]","TUPI [B]",{"$f":"IF(LEFT(Y59,7)=\"AUSENTE\",\"EQUIPE\",IF(IFERROR(VLOOKUP(Y59,'Clubes Participantes'!A:B,1,FALSE),\"BOTONISTA\")=\"BOTONISTA\",\"BOTONISTA\",\"EQUIPE\"))","v":"EQUIPE"}]
[null,{"v":44,"d":"044"},null,null,"Gustavo Lopes",3,"x",0,"Humberto Ramos",{"$nulls":3},3,"V","D",0,null,null,"--",null,"--",null,"GRÊMIO MINEIRO","MATIAS [B]","Flavio Scarpelli",{"$f":"IF(LEFT(Y60,7)=\"AUSENTE\",\"EQUIPE\",IF(IFERROR(VLOOKUP(Y60,'Clubes Participantes'!A:B,1,FALSE),\"BOTONISTA\")=\"BOTONISTA\",\"BOTONISTA\",\"EQUIPE\"))","v":"BOTONISTA"}]
[{"v":12,"d":"012"},null,"2022-04-15",{"v":1,"d":"01"},"AABB/ACAFUMA [A]",0,"x",2,"TUPI [A]",null,{"$f":"IF(N61=\"V\",3,IF(N61=\"E\",1,0))","v":0},{"$f":"F61","v":0},{"$f":"SUM(M62:M65)","v":1},"D","V",{"$f":"SUM(P62:P65)","v":5},{"$f":"H61","v":2},{"$f":"IF(O61=\"V\",3,IF(O61=\"E\",1,0))","v":3},"--",null,"--",null,{"$f":"E61","v":"AABB/ACAFUMA [A]"},{"$f":"I61","v":"TUPI [A]"},"Leandro Benicio",{"$f":"IF(LEFT(Y61,7)=\"AUSENTE\",\"EQUIPE\",IF(IFERROR(VLOOKUP(Y61,'Clubes Participantes'!A:B,1,FALSE),\"BOTONISTA\")=\"BOTONISTA\",\"BOTONISTA\",\"EQUIPE\"))","v":"BOTONISTA"}]
[null,{"v":45,"d":"045"},null,null,"Antonio Carlos Almeida",0,"x",0,"Leonardo Stumpf",{"$nulls":3},{"$f":"IF(F62&H62=\"WW\",0,IF(F62&H62=\"W0\",2,F62))","v":0},"E","E",{"$f":"IF(F62&H62=\"WW\",0,IF(F62&H62=\"0W\",2,H62))","v":0},null,null,"--",null,"--",null,{"$f":"W61","v":"AABB/ACAFUMA [A]"},"TUPI [A]","Luiz Henrique Colla",{"$f":"IF(LEFT(Y62,7)=\"AUSENTE\",\"EQUIPE\",IF(IFERROR(VLOOKUP(Y62,'Clubes Participantes'!A:B,1,FALSE),\"BOTONISTA\")=\"BOTONISTA\",\"BOTONISTA\",\"EQUIPE\"))","v":"BOTONISTA"}]
[null,{"v":46,"d":"046"},null,null,"Tarcizio Dinoa Junior",1,"x",1,"Marcus Monteiro",{"$nulls":3},1,"E","E",1,null,null,"--",null,"--",null,{"$f":"W61","v":"AABB/ACAFUMA [A]"},"TUPI [A]","Paulo Ricardo Souza",{"$f":"IF(LEFT(Y63,7)=\"AUSENTE\",\"EQUIPE\",IF(IFERROR(VLOOKUP(Y63,'Clubes Participantes'!A:B,1,FALSE),\"BOTONISTA\")=\"BOTONISTA\",\"BOTONISTA\",\"EQUIPE\"))","v":"BOTONISTA"}]
[null,{"v":47,"d":"047"},null,null,"Luiz Claudio Caruso",0,"x",2,"Paulo Marcos de França",{"$nulls":3},0,"D","V",2,null,null,"--",null,"--",null,"AABB/ACAFUMA [A]","TUPI [A]","AABB/ACAFUMA [B]",{"$f":"IF(LEFT(Y64,7)=\"AUSENTE\",\"EQUIPE\",IF(IFERROR(VLOOKUP(Y64,'Clubes Participantes'!A:B,1,FALSE),\"BOTONISTA\")=\"BOTONISTA\",\"BOTONISTA\",\"EQUIPE\"))","v":"EQUIPE"}]
[null,{"v":48,"d":"048"},null,null,"Paulo Caruso",0,"x",2,"Carlos Antonio Miranda",{"$nulls":3},0,"D","V",2,null,null,"--",null,"--",null,"AABB/ACAFUMA [A]","TUPI [A]","Adolpho Parente",{"$f":"IF(LEFT(Y65,7)=\"AUSENTE\",\"EQUIPE\",IF(IFERROR(VLOOKUP(Y65,'Clubes Participantes'!A:B,1,FALSE),\"BOTONISTA\")=\"BOTONISTA\",\"BOTONISTA\",\"EQUIPE\"))","v":"BOTONISTA"}]
[{"v":13,"d":"013"},null,"2022-04-15",{"v":2,"d":"02"},"LIBERDADE [A]",2,"x",1,"AABB/ACAFUMA [B]",null,{"$f":"IF(N66=\"V\",3,IF(N66=\"E\",1,0))","v":3},{"$f":"F66","v":2},{"$f":"SUM(M67:M70)","v":6},"V","D",{"$f":"SUM(P67:P70)","v":4},{"$f":"H66","v":1},{"$f":"IF(O66=\"V\",3,IF(O66=\"E\",1,0))","v":0},"--",null,"--",null,{"$f":"E66","v":"LIBERDADE [A]"},{"$f":"I66","v":"AABB/ACAFUMA [B]"},"Alcides Figueira",{"$f":"IF(LEFT(Y66,7)=\"AUSENTE\",\"EQUIPE\",IF(IFERROR(VLOOKUP(Y66,'Clubes Participantes'!A:B,1,FALSE),\"BOTONISTA\")=\"BOTONISTA\",\"BOTONISTA\",\"EQUIPE\"))","v":"BOTONISTA"}]
[null,{"v":49,"d":"049"},null,null,"Wendel Cordeiro",1,"x",1,"Alcides Figueira",{"$nulls":3},{"$f":"IF(F67&H67=\"WW\",0,IF(F67&H67=\"W0\",2,F67))","v":1},"E","E",{"$f":"IF(F67&H67=\"WW\",0,IF(F67&H67=\"0W\",2,H67))","v":1},null,null,"--",null,"--",null,{"$f":"W66","v":"LIBERDADE [A]"},"AABB/ACAFUMA [B]","Marcelo Ferreira",{"$f":"IF(LEFT(Y67,7)=\"AUSENTE\",\"EQUIPE\",IF(IFERROR(VLOOKUP(Y67,'Clubes Participantes'!A:B,1,FALSE),\"BOTONISTA\")=\"BOTONISTA\",\"BOTONISTA\",\"EQUIPE\"))","v":"BOTONISTA"}]
[null,{"v":50,"d":"050"},null,null,"Breno Ribeiro",0,"x",2,"Adolpho Parente",{"$nulls":3},0,"D","V",2,null,null,"--",null,"--",null,{"$f":"W66","v":"LIBERDADE [A]"},"AABB/ACAFUMA [B]","Paulo Cesar Faria",{"$f":"IF(LEFT(Y68,7)=\"AUSENTE\",\"EQUIPE\",IF(IFERROR(VLOOKUP(Y68,'Clubes Participantes'!A:B,1,FALSE),\"BOTONISTA\")=\"BOTONISTA\",\"BOTONISTA\",\"EQUIPE\"))","v":"BOTONISTA"}]
[null,{"v":51,"d":"051"},null,null,"Lorival Ribeiro",2,"x",1,"Rodrigo Caruso",{"$nulls":3},2,"V","D",1,null,null,"--",null,"--",null,"LIBERDADE [A]","AABB/ACAFUMA [B]","Rodrigo Caruso",{"$f":"IF(LEFT(Y69,7)=\"AUSENTE\",\"EQUIPE\",IF(IFERROR(VLOOKUP(Y69,'Clubes Participantes'!A:B,1,FALSE),\"BOTONISTA\")=\"BOTONISTA\",\"BOTONISTA\",\"EQUIPE\"))","v":"BOTONISTA"}]
[null,{"v":52,"d":"052"},null,null,"Carlos Henrique Garcia",3,"x",0,"Marcelo Ferreira",{"$nulls":3},3,"V","D",0,null,null,"--",null,{"$f":"IF($X$3=\"BOTONISTA\",(IF($U$3=E70,$U$3,IF($U$3=I70,$U$3,\"--\"))),IF($X$3=\"EQUIPE\",(IF($U$3=W70,$U$3,IF($U$3=X70,$U$3,\"--\"))),\"--\"))","v":"--"},null,"LIBERDADE [A]","AABB/ACAFUMA [B]","COMARY",{"$f":"IF(LEFT(Y70,7)=\"AUSENTE\",\"EQUIPE\",IF(IFERROR(VLOOKUP(Y70,'Clubes Participantes'!A:B,1,FALSE),\"BOTONISTA\")=\"BOTONISTA\",\"BOTONISTA\",\"EQUIPE\"))","v":"EQUIPE"}]
[{"v":14,"d":"014"},null,"2022-04-15",{"v":1,"d":"01"},"CHACAL [A]",0,"x",2,"LIBERDADE [B]",null,{"$f":"IF(N71=\"V\",3,IF(N71=\"E\",1,0))","v":0},{"$f":"F71","v":0},{"$f":"SUM(M72:M75)","v":2},"D","V",{"$f":"SUM(P72:P75)","v":6},{"$f":"H71","v":2},{"$f":"IF(O71=\"V\",3,IF(O71=\"E\",1,0))","v":3},{"$f":"IF(LEFT(E71,7)=\"\",\"AUS\"&+IF(B71>0,\"IND\",\"\"),IF(LEFT(I71,7)=\"\",\"AUS\"&+IF(B71>0,\"IND\",\"\"),IF(LEFT(E71,7)=\"Ausente\",\"AUS\"&+IF(B71>0,\"IND\",\"\"),IF(LEFT(I71,7)=\"Ausente\",\"AUS\"&+IF(B71>0,\"IND\",\"\"),IF(RIGHT(F71,1)=\"*\",\"NULO\"&+IF(B71>0,\"IND\",\"\"),IF(F71&H71=\"----\",\"NULO\"&+IF(B71>0,\"IND\",\"\"),IF(F71&H71=\"W0\",\"W0\"&+IF(B71>0,\"IND\",\"\"),IF(F71&H71=\"0W\",\"W0\"&+IF(B71>0,\"IND\",\"\"),IF(F71&H71=\"WW\",\"WW\"&+IF(B71>0,\"IND\",\"\"),\"--\")))))))))","v":"--"},null,"--",null,{"$f":"E71","v":"CHACAL [A]"},{"$f":"I71","v":"LIBERDADE [B]"},"Claudio Figueiredo",{"$f":"IF(LEFT(Y71,7)=\"AUSENTE\",\"EQUIPE\",IF(IFERROR(VLOOKUP(Y71,'Clubes Participantes'!A:B,1,FALSE),\"BOTONISTA\")=\"BOTONISTA\",\"BOTONISTA\",\"EQUIPE\"))","v":"BOTONISTA"}]
[null,{"v":53,"d":"053"},null,null,"Thiago Stephan",1,"x",1,"Rafael Pena",{"$nulls":3},{"$f":"IF(F72&H72=\"WW\",0,IF(F72&H72=\"W0\",2,F72))","v":1},"E","E",{"$f":"IF(F72&H72=\"WW\",0,IF(F72&H72=\"0W\",2,H72))","v":1},null,null,"--",null,"--",null,{"$f":"W71","v":"CHACAL [A]"},"LIBERDADE [B]","Eduardo Tavares",{"$f":"IF(LEFT(Y72,7)=\"AUSENTE\",\"EQUIPE\",IF(IFERROR(VLOOKUP(Y72,'Clubes Participantes'!A:B,1,FALSE),\"BOTONISTA\")=\"BOTONISTA\",\"BOTONISTA\",\"EQUIPE\"))","v":"BOTONISTA"}]
[null,{"v":54,"d":"054"},null,null,"Paulo Mangia",0,"x",2,"Marcelo Virgilio",{"$nulls":3},0,"D","V",2,null,null,"--",null,"--",null,{"$f":"W71","v":"CHACAL [A]"},"LIBERDADE [B]","Igor Guarilha",{"$f":"IF(LEFT(Y73,7)=\"AUSENTE\",\"EQUIPE\",IF(IFERROR(VLOOKUP(Y73,'Clubes Participantes'!A:B,1,FALSE),\"BOTONISTA\")=\"BOTONISTA\",\"BOTONISTA\",\"EQUIPE\"))","v":"BOTONISTA"}]
[null,{"v":55,"d":"055"},null,null,"Joao Francisco Stephan",0,"x",2,"Luiz Carlos Guerra",{"$nulls":3},0,"D","V",2,null,null,"--",null,"--",null,"CHACAL [A]","LIBERDADE [B]","Marco Andre Veloso",{"$f":"IF(LEFT(Y74,7)=\"AUSENTE\",\"EQUIPE\",IF(IFERROR(VLOOKUP(Y74,'Clubes Participantes'!A:B,1,FALSE),\"BOTONISTA\")=\"BOTONISTA\",\"BOTONISTA\",\"EQUIPE\"))","v":"BOTONISTA"}]
[null,{"v":56,"d":"056"},null,null,"Julio Celio Braga",1,"x",1,"Daniel Oliveira",{"$nulls":3},1,"E","E",1,null,null,"--",null,"--",null,"CHACAL [A]","LIBERDADE [B]","Pablo Sidarta",{"$f":"IF(LEFT(Y75,7)=\"AUSENTE\",\"EQUIPE\",IF(IFERROR(VLOOKUP(Y75,'Clubes Participantes'!A:B,1,FALSE),\"BOTONISTA\")=\"BOTONISTA\",\"BOTONISTA\",\"EQUIPE\"))","v":"BOTONISTA"}]
[{"v":15,"d":"015"},null,"2022-04-15",{"v":2,"d":"02"},"UNIÃO INDEPENDENTE/UBERABA",2,"x",2,"VASCO DA GAMA",null,{"$f":"IF(N76=\"V\",3,IF(N76=\"E\",1,0))","v":1},{"$f":"F76","v":2},{"$f":"SUM(M77:M80)","v":4},{"$f":"IF(F76&+H76=\"WW\",\"D\",IF(F76>H76,\"V\",IF(F76=H76,\"E\",\"D\")))","v":"E"},{"$f":"IF(F76&+H76=\"WW\",\"D\",IF(F76<H76,\"V\",IF(F76=H76,\"E\",\"D\")))","v":"E"},{"$f":"SUM(P77:P80)","v":8},{"$f":"H76","v":2},{"$f":"IF(O76=\"V\",3,IF(O76=\"E\",1,0))","v":1},"--",null,"--",null,{"$f":"E76","v":"UNIÃO INDEPENDENTE/UBERABA"},{"$f":"I76","v":"VASCO DA GAMA"},"Ricardo Machado",{"$f":"IF(LEFT(Y76,7)=\"AUSENTE\",\"EQUIPE\",IF(IFERROR(VLOOKUP(Y76,'Clubes Participantes'!A:B,1,FALSE),\"BOTONISTA\")=\"BOTONISTA\",\"BOTONISTA\",\"EQUIPE\"))","v":"BOTONISTA"}]
[null,{"v":57,"d":"057"},null,null,"Constancio Moura",0,"x",3,"Eduardo Costa",{"$nulls":3},{"$f":"IF(F77&H77=\"WW\",0,IF(F77&H77=\"W0\",2,F77))","v":0},"D","V",{"$f":"IF(F77&H77=\"WW\",0,IF(F77&H77=\"0W\",2,H77))","v":3},null,null,"--",null,"--",null,{"$f":"W76","v":"UNIÃO INDEPENDENTE/UBERABA"},"VASCO DA GAMA","CHACAL [A]",{"$f":"IF(LEFT(Y77,7)=\"AUSENTE\",\"EQUIPE\",IF(IFERROR(VLOOKUP(Y77,'Clubes Participantes'!A:B,1,FALSE),\"BOTONISTA\")=\"BOTONISTA\",\"BOTONISTA\",\"EQUIPE\"))","v":"EQUIPE"}]
[null,{"v":58,"d":"058"},null,null,"Luiz Humberto",2,"x",1,"Evandro Gomes",{"$nulls":3},2,"V","D",1,null,null,"--",null,"--",null,{"$f":"W76","v":"UNIÃO INDEPENDENTE/UBERABA"},"VASCO DA GAMA","Janilson Pereira",{"$f":"IF(LEFT(Y78,7)=\"AUSENTE\",\"EQUIPE\",IF(IFERROR(VLOOKUP(Y78,'Clubes Participantes'!A:B,1,FALSE),\"BOTONISTA\")=\"BOTONISTA\",\"BOTONISTA\",\"EQUIPE\"))","v":"BOTONISTA"}]
[null,{"v":59,"d":"059"},null,null,"Emerson Claudino",2,"x",1,"Henrique Madeira",{"$nulls":3},2,"V","D",1,null,null,"--",null,"--",null,"UNIÃO INDEPENDENTE/UBERABA","VASCO DA GAMA","Joao Francisco Stephan",{"$f":"IF(LEFT(Y79,7)=\"AUSENTE\",\"EQUIPE\",IF(IFERROR(VLOOKUP(Y79,'Clubes Participantes'!A:B,1,FALSE),\"BOTONISTA\")=\"BOTONISTA\",\"BOTONISTA\",\"EQUIPE\"))","v":"BOTONISTA"}]
[null,{"v":60,"d":"060"},null,null,"Juliano Gomes",0,"x",3,"Fernando Ferreira",{"$nulls":3},0,"D","V",3,null,null,"--",null,"--",null,"UNIÃO INDEPENDENTE/UBERABA","VASCO DA GAMA","Julio Celio Braga",{"$f":"IF(LEFT(Y80,7)=\"AUSENTE\",\"EQUIPE\",IF(IFERROR(VLOOKUP(Y80,'Clubes Participantes'!A:B,1,FALSE),\"BOTONISTA\")=\"BOTONISTA\",\"BOTONISTA\",\"EQUIPE\"))","v":"BOTONISTA"}]
[{"v":16,"d":"016"},null,"2022-04-15",{"v":2,"d":"02"},"AABB/ACAFUMA [B]",0,"x",2,"UNIÃO INDEPENDENTE/UBERABA",null,{"$f":"IF(N81=\"V\",3,IF(N81=\"E\",1,0))","v":0},{"$f":"F81","v":0},{"$f":"SUM(M82:M85)","v":3},"D","V",{"$f":"SUM(P82:P85)","v":8},{"$f":"H81","v":2},{"$f":"IF(O81=\"V\",3,IF(O81=\"E\",1,0))","v":3},"--",null,"--",null,{"$f":"E81","v":"AABB/ACAFUMA [B]"},{"$f":"I81","v":"UNIÃO INDEPENDENTE/UBERABA"},"Paulo Mangia",{"$f":"IF(LEFT(Y81,7)=\"AUSENTE\",\"EQUIPE\",IF(IFERROR(VLOOKUP(Y81,'Clubes Participantes'!A:B,1,FALSE),\"BOTONISTA\")=\"BOTONISTA\",\"BOTONISTA\",\"EQUIPE\"))","v":"BOTONISTA"}]
[null,{"v":61,"d":"061"},null,null,"Alcides Figueira",0,"x",2,"Emerson Claudino",{"$nulls":3},{"$f":"IF(F82&H82=\"WW\",0,IF(F82&H82=\"W0\",2,F82))","v":0},"D","V",{"$f":"IF(F82&H82=\"WW\",0,IF(F82&H82=\"0W\",2,H82))","v":2},null,null,"--",null,"--",null,{"$f":"W81","v":"AABB/ACAFUMA [B]"},"UNIÃO INDEPENDENTE/UBERABA","Thiago Stephan",{"$f":"IF(LEFT(Y82,7)=\"AUSENTE\",\"EQUIPE\",IF(IFERROR(VLOOKUP(Y82,'Clubes Participantes'!A:B,1,FALSE),\"BOTONISTA\")=\"BOTONISTA\",\"BOTONISTA\",\"EQUIPE\"))","v":"BOTONISTA"}]
[null,{"v":62,"d":"062"},null,null,"Adolpho Parente",2,"x",2,"Juliano Gomes",{"$nulls":3},2,"E","E",2,null,null,"--",null,"--",null,{"$f":"W81","v":"AABB/ACAFUMA [B]"},"UNIÃO INDEPENDENTE/UBERABA","ELDORADO",{"$f":"IF(LEFT(Y83,7)=\"AUSENTE\",\"EQUIPE\",IF(IFERROR(VLOOKUP(Y83,'Clubes Participantes'!A:B,1,FALSE),\"BOTONISTA\")=\"BOTONISTA\",\"BOTONISTA\",\"EQUIPE\"))","v":"EQUIPE"}]
[null,{"v":63,"d":"063"},null,null,"Paulo Cesar Faria",1,"x",4,"Constancio Moura",{"$nulls":3},1,"D","V",4,null,null,"--",null,"--",null,"AABB/ACAFUMA [B]","UNIÃO INDEPENDENTE/UBERABA","Alex Lage",{"$f":"IF(LEFT(Y84,7)=\"AUSENTE\",\"EQUIPE\",IF(IFERROR(VLOOKUP(Y84,'Clubes Participantes'!A:B,1,FALSE),\"BOTONISTA\")=\"BOTONISTA\",\"BOTONISTA\",\"EQUIPE\"))","v":"BOTONISTA"}]
[null,{"v":64,"d":"064"},null,null,"Marcelo Ferreira",0,"x",0,"Luiz Humberto",{"$nulls":3},0,"E","E",0,null,null,"--",null,"--",null,"AABB/ACAFUMA [B]","UNIÃO INDEPENDENTE/UBERABA","Bernardo Pires",{"$f":"IF(LEFT(Y85,7)=\"AUSENTE\",\"EQUIPE\",IF(IFERROR(VLOOKUP(Y85,'Clubes Participantes'!A:B,1,FALSE),\"BOTONISTA\")=\"BOTONISTA\",\"BOTONISTA\",\"EQUIPE\"))","v":"BOTONISTA"}]
[{"v":17,"d":"017"},null,"2022-04-15",{"v":1,"d":"01"},"AABB/ACAFUMA [C]",1,"x",1,"CHACAL [A]",null,{"$f":"IF(N86=\"V\",3,IF(N86=\"E\",1,0))","v":1},{"$f":"F86","v":1},{"$f":"SUM(M87:M90)","v":4},"E","E",{"$f":"SUM(P87:P90)","v":4},{"$f":"H86","v":1},{"$f":"IF(O86=\"V\",3,IF(O86=\"E\",1,0))","v":1},"--",null,"--",null,{"$f":"E86","v":"AABB/ACAFUMA [C]"},{"$f":"I86","v":"CHACAL [A]"},"Jorge Dias",{"$f":"IF(LEFT(Y86,7)=\"AUSENTE\",\"EQUIPE\",IF(IFERROR(VLOOKUP(Y86,'Clubes Participantes'!A:B,1,FALSE),\"BOTONISTA\")=\"BOTONISTA\",\"BOTONISTA\",\"EQUIPE\"))","v":"BOTONISTA"}]
[null,{"v":65,"d":"065"},null,null,"Andre Brandao",1,"x",1,"Joao Francisco Stephan",{"$nulls":3},{"$f":"IF(F87&H87=\"WW\",0,IF(F87&H87=\"W0\",2,F87))","v":1},"E","E",{"$f":"IF(F87&H87=\"WW\",0,IF(F87&H87=\"0W\",2,H87))","v":1},null,null,"--",null,"--",null,{"$f":"W86","v":"AABB/ACAFUMA [C]"},"CHACAL [A]","Jose Pires",{"$f":"IF(LEFT(Y87,7)=\"AUSENTE\",\"EQUIPE\",IF(IFERROR(VLOOKUP(Y87,'Clubes Participantes'!A:B,1,FALSE),\"BOTONISTA\")=\"BOTONISTA\",\"BOTONISTA\",\"EQUIPE\"))","v":"BOTONISTA"}]
[null,{"v":66,"d":"066"},null,null,"Marcelo Silva",1,"x",1,"Thiago Stephan",{"$nulls":3},1,"E","E",1,null,null,"--",null,"--",null,{"$f":"W86","v":"AABB/ACAFUMA [C]"},"CHACAL [A]","GRÊMIO MINEIRO",{"$f":"IF(LEFT(Y88,7)=\"AUSENTE\",\"EQUIPE\",IF(IFERROR(VLOOKUP(Y88,'Clubes Participantes'!A:B,1,FALSE),\"BOTONISTA\")=\"BOTONISTA\",\"BOTONISTA\",\"EQUIPE\"))","v":"EQUIPE"}]
[null,{"v":67,"d":"067"},null,null,"Simplicio Santos",2,"x",1,"Paulo Mangia",{"$nulls":3},2,"V","D",1,null,null,"--",null,"--",null,"AABB/ACAFUMA [C]","CHACAL [A]","Fernando Vianna",{"$f":"IF(LEFT(Y89,7)=\"AUSENTE\",\"EQUIPE\",IF(IFERROR(VLOOKUP(Y89,'Clubes Participantes'!A:B,1,FALSE),\"BOTONISTA\")=\"BOTONISTA\",\"BOTONISTA\",\"EQUIPE\"))","v":"BOTONISTA"}]
[null,{"v":68,"d":"068"},null,null,"Paulo Airton Junior",0,"x",1,"Janilson Pereira",{"$nulls":3},0,"D","V",1,null,null,"--",null,"--",null,"AABB/ACAFUMA [C]","CHACAL [A]","Gustavo Lopes",{"$f":"IF(LEFT(Y90,7)=\"AUSENTE\",\"EQUIPE\",IF(IFERROR(VLOOKUP(Y90,'Clubes Participantes'!A:B,1,FALSE),\"BOTONISTA\")=\"BOTONISTA\",\"BOTONISTA\",\"EQUIPE\"))","v":"BOTONISTA"}]
[{"v":18,"d":"018"},null,"2022-04-15",{"v":2,"d":"02"},"VASCO DA GAMA",0,"x",2,"TUPI [B]",null,{"$f":"IF(N91=\"V\",3,IF(N91=\"E\",1,0))","v":0},{"$f":"F91","v":0},{"$f":"SUM(M92:M95)","v":4},"D","V",{"$f":"SUM(P92:P95)","v":6},{"$f":"H91","v":2},{"$f":"IF(O91=\"V\",3,IF(O91=\"E\",1,0))","v":3},"--",null,"--",null,{"$f":"E91","v":"VASCO DA GAMA"},{"$f":"I91","v":"TUPI [B]"},"Rodrigo Primola",{"$f":"IF(LEFT(Y91,7)=\"AUSENTE\",\"EQUIPE\",IF(IFERROR(VLOOKUP(Y91,'Clubes Participantes'!A:B,1,FALSE),\"BOTONISTA\")=\"BOTONISTA\",\"BOTONISTA\",\"EQUIPE\"))","v":"BOTONISTA"}]
[null,{"v":69,"d":"069"},null,null,"Evandro Gomes",1,"x",1,"Paulo Ricardo Souza",{"$nulls":3},{"$f":"IF(F92&H92=\"WW\",0,IF(F92&H92=\"W0\",2,F92))","v":1},"E","E",{"$f":"IF(F92&H92=\"WW\",0,IF(F92&H92=\"0W\",2,H92))","v":1},null,null,"--",null,"--",null,{"$f":"W91","v":"VASCO DA GAMA"},"TUPI [B]","Vander Felipe",{"$f":"IF(LEFT(Y92,7)=\"AUSENTE\",\"EQUIPE\",IF(IFERROR(VLOOKUP(Y92,'Clubes Participantes'!A:B,1,FALSE),\"BOTONISTA\")=\"BOTONISTA\",\"BOTONISTA\",\"EQUIPE\"))","v":"BOTONISTA"}]
[null,{"v":70,"d":"070"},null,null,"Eder Patrocinio",2,"x",2,"Flavio Scarpelli",{"$nulls":3},2,"E","E",2,null,null,"--",null,"--",null,{"$f":"W91","v":"VASCO DA GAMA"},"TUPI [B]","MATIAS [B]",{"$f":"IF(LEFT(Y93,7)=\"AUSENTE\",\"EQUIPE\",IF(IFERROR(VLOOKUP(Y93,'Clubes Participantes'!A:B,1,FALSE),\"BOTONISTA\")=\"BOTONISTA\",\"BOTONISTA\",\"EQUIPE\"))","v":"EQUIPE"}]
[null,{"v":71,"d":"071"},null,null,"Eduardo Costa",0,"x",1,"Luiz Henrique Colla",{"$nulls":3},0,"D","V",1,null,null,"--",null,"--",null,"VASCO DA GAMA","TUPI [B]","Ailson Brites",{"$f":"IF(LEFT(Y94,7)=\"AUSENTE\",\"EQUIPE\",IF(IFERROR(VLOOKUP(Y94,'Clubes Participantes'!A:B,1,FALSE),\"BOTONISTA\")=\"BOTONISTA\",\"BOTONISTA\",\"EQUIPE\"))","v":"BOTONISTA"}]
[null,{"v":72,"d":"072"},null,null,"Fernando Ferreira",1,"x",2,"Leandro Benicio",{"$nulls":3},1,"D","V",2,null,null,"--",null,"--",null,"VASCO DA GAMA","TUPI [B]","Eber Chapinotti",{"$f":"IF(LEFT(Y95,7)=\"AUSENTE\",\"EQUIPE\",IF(IFERROR(VLOOKUP(Y95,'Clubes Participantes'!A:B,1,FALSE),\"BOTONISTA\")=\"BOTONISTA\",\"BOTONISTA\",\"EQUIPE\"))","v":"BOTONISTA"}]
[{"v":19,"d":"019"},null,"2022-04-15",{"v":1,"d":"01"},"COMARY",1,"x",1,"GRÊMIO MINEIRO",null,{"$f":"IF(N96=\"V\",3,IF(N96=\"E\",1,0))","v":1},{"$f":"F96","v":1},{"$f":"SUM(M97:M100)","v":4},"E","E",{"$f":"SUM(P97:P100)","v":4},{"$f":"H96","v":1},{"$f":"IF(O96=\"V\",3,IF(O96=\"E\",1,0))","v":1},"--",null,"--",null,{"$f":"E96","v":"COMARY"},{"$f":"I96","v":"GRÊMIO MINEIRO"},"Humberto Ramos",{"$f":"IF(LEFT(Y96,7)=\"AUSENTE\",\"EQUIPE\",IF(IFERROR(VLOOKUP(Y96,'Clubes Participantes'!A:B,1,FALSE),\"BOTONISTA\")=\"BOTONISTA\",\"BOTONISTA\",\"EQUIPE\"))","v":"BOTONISTA"}]
[null,{"v":73,"d":"073"},null,null,"Igor Guarilha",1,"x",2,"Vander Felipe",{"$nulls":3},{"$f":"IF(F97&H97=\"WW\",0,IF(F97&H97=\"W0\",2,F97))","v":1},"D","V",{"$f":"IF(F97&H97=\"WW\",0,IF(F97&H97=\"0W\",2,H97))","v":2},null,null,"--",null,"--",null,{"$f":"W96","v":"COMARY"},"GRÊMIO MINEIRO","Mario Cleber",{"$f":"IF(LEFT(Y97,7)=\"AUSENTE\",\"EQUIPE\",IF(IFERROR(VLOOKUP(Y97,'Clubes Participantes'!A:B,1,FALSE),\"BOTONISTA\")=\"BOTONISTA\",\"BOTONISTA\",\"EQUIPE\"))","v":"BOTONISTA"}]
[null,{"v":74,"d":"074"},null,null,"Pablo Sidarta",1,"x",1,"Gustavo Lopes",{"$nulls":3},1,"E","E",1,null,null,"--",null,"--",null,{"$f":"W96","v":"COMARY"},"GRÊMIO MINEIRO","Ricardo Sartine",{"$f":"IF(LEFT(Y98,7)=\"AUSENTE\",\"EQUIPE\",IF(IFERROR(VLOOKUP(Y98,'Clubes Participantes'!A:B,1,FALSE),\"BOTONISTA\")=\"BOTONISTA\",\"BOTONISTA\",\"EQUIPE\"))","v":"BOTONISTA"}]
[null,{"v":75,"d":"075"},null,null,"Marco Andre Veloso",1,"x",0,"Fernando Vianna",{"$nulls":3},1,"V","D",0,null,null,"--",null,"--",null,"COMARY","GRÊMIO MINEIRO","Romualdo Piccinini",{"$f":"IF(LEFT(Y99,7)=\"AUSENTE\",\"EQUIPE\",IF(IFERROR(VLOOKUP(Y99,'Clubes Participantes'!A:B,1,FALSE),\"BOTONISTA\")=\"BOTONISTA\",\"BOTONISTA\",\"EQUIPE\"))","v":"BOTONISTA"}]
[null,{"v":76,"d":"076"},null,null,"Claudio Figueiredo",1,"x",1,"Rodrigo Primola",{"$nulls":3},1,"E","E",1,null,null,"--",null,"--",null,"COMARY","GRÊMIO MINEIRO","CHACAL [B]",{"$f":"IF(LEFT(Y100,7)=\"AUSENTE\",\"EQUIPE\",IF(IFERROR(VLOOKUP(Y100,'Clubes Participantes'!A:B,1,FALSE),\"BOTONISTA\")=\"BOTONISTA\",\"BOTONISTA\",\"EQUIPE\"))","v":"EQUIPE"}]
[{"v":20,"d":"020"},null,"2022-04-15",{"v":1,"d":"01"},"BOTAFOGO",2,"x",2,"AABB/ACAFUMA [A]",null,{"$f":"IF(N101=\"V\",3,IF(N101=\"E\",1,0))","v":1},{"$f":"F101","v":2},{"$f":"SUM(M102:M105)","v":5},"E","E",{"$f":"SUM(P102:P105)","v":4},{"$f":"H101","v":2},{"$f":"IF(O101=\"V\",3,IF(O101=\"E\",1,0))","v":1},"--",null,"--",null,{"$f":"E101","v":"BOTAFOGO"},{"$f":"I101","v":"AABB/ACAFUMA [A]"},"Everton Costa",{"$f":"IF(LEFT(Y101,7)=\"AUSENTE\",\"EQUIPE\",IF(IFERROR(VLOOKUP(Y101,'Clubes Participantes'!A:B,1,FALSE),\"BOTONISTA\")=\"BOTONISTA\",\"BOTONISTA\",\"EQUIPE\"))","v":"BOTONISTA"}]
[null,{"v":77,"d":"077"},null,null,"Bruno Machado",0,"x",1,"Luiz Claudio Caruso",{"$nulls":3},{"$f":"IF(F102&H102=\"WW\",0,IF(F102&H102=\"W0\",2,F102))","v":0},"D","V",{"$f":"IF(F102&H102=\"WW\",0,IF(F102&H102=\"0W\",2,H102))","v":1},null,null,"--",null,"--",null,{"$f":"W101","v":"BOTAFOGO"},"AABB/ACAFUMA [A]","Heman Junior",{"$f":"IF(LEFT(Y102,7)=\"AUSENTE\",\"EQUIPE\",IF(IFERROR(VLOOKUP(Y102,'Clubes Participantes'!A:B,1,FALSE),\"BOTONISTA\")=\"BOTONISTA\",\"BOTONISTA\",\"EQUIPE\"))","v":"BOTONISTA"}]
[null,{"v":78,"d":"078"},null,null,"Renato Negreiros",0,"x",2,"Paulo Caruso",{"$nulls":3},0,"D","V",2,null,null,"--",null,"--",null,{"$f":"W101","v":"BOTAFOGO"},"AABB/ACAFUMA [A]","Jefferson Rosa",{"$f":"IF(LEFT(Y103,7)=\"AUSENTE\",\"EQUIPE\",IF(IFERROR(VLOOKUP(Y103,'Clubes Participantes'!A:B,1,FALSE),\"BOTONISTA\")=\"BOTONISTA\",\"BOTONISTA\",\"EQUIPE\"))","v":"BOTONISTA"}]
[null,{"v":79,"d":"079"},null,null,"Altanir Junior",3,"x",1,"Antonio Carlos Almeida",{"$nulls":3},3,"V","D",1,null,null,"--",null,"--",null,"BOTAFOGO","AABB/ACAFUMA [A]","Lucas Luna",{"$f":"IF(LEFT(Y104,7)=\"AUSENTE\",\"EQUIPE\",IF(IFERROR(VLOOKUP(Y104,'Clubes Participantes'!A:B,1,FALSE),\"BOTONISTA\")=\"BOTONISTA\",\"BOTONISTA\",\"EQUIPE\"))","v":"BOTONISTA"}]
[null,{"v":80,"d":"080"},null,null,"Diego Americo",2,"x",0,"Tarcizio Dinoa Junior",{"$nulls":3},2,"V","D",0,null,null,"--",null,"--",null,"BOTAFOGO","AABB/ACAFUMA [A]","Pablino Colen",{"$f":"IF(LEFT(Y105,7)=\"AUSENTE\",\"EQUIPE\",IF(IFERROR(VLOOKUP(Y105,'Clubes Participantes'!A:B,1,FALSE),\"BOTONISTA\")=\"BOTONISTA\",\"BOTONISTA\",\"EQUIPE\"))","v":"BOTONISTA"}]
[{"v":21,"d":"021"},null,"2022-04-15",{"v":2,"d":"02"},"ELDORADO",0,"x",3,"LIBERDADE [A]",null,{"$f":"IF(N106=\"V\",3,IF(N106=\"E\",1,0))","v":0},{"$f":"F106","v":0},{"$f":"SUM(M107:M110)","v":0},"D","V",{"$f":"SUM(P107:P110)","v":5},{"$f":"H106","v":3},{"$f":"IF(O106=\"V\",3,IF(O106=\"E\",1,0))","v":3},"--",null,"--",null,{"$f":"E106","v":"ELDORADO"},{"$f":"I106","v":"LIBERDADE [A]"},"Rodolfo Magalhaes",{"$f":"IF(LEFT(Y106,7)=\"AUSENTE\",\"EQUIPE\",IF(IFERROR(VLOOKUP(Y106,'Clubes Participantes'!A:B,1,FALSE),\"BOTONISTA\")=\"BOTONISTA\",\"BOTONISTA\",\"EQUIPE\"))","v":"BOTONISTA"}]
[null,{"v":81,"d":"081"},null,null,"Bernardo Pires",0,"x",1,"Breno Ribeiro",{"$nulls":3},{"$f":"IF(F107&H107=\"WW\",0,IF(F107&H107=\"W0\",2,F107))","v":0},"D","V",{"$f":"IF(F107&H107=\"WW\",0,IF(F107&H107=\"0W\",2,H107))","v":1},null,null,"--",null,"--",null,{"$f":"W106","v":"ELDORADO"},"LIBERDADE [A]","Vanderley da Silva",{"$f":"IF(LEFT(Y107,7)=\"AUSENTE\",\"EQUIPE\",IF(IFERROR(VLOOKUP(Y107,'Clubes Participantes'!A:B,1,FALSE),\"BOTONISTA\")=\"BOTONISTA\",\"BOTONISTA\",\"EQUIPE\"))","v":"BOTONISTA"}]
[null,{"v":82,"d":"082"},null,null,"Jorge Dias",0,"x",3,"Carlos Henrique Garcia",{"$nulls":3},0,"D","V",3,null,null,"--",null,"--",null,{"$f":"W106","v":"ELDORADO"},"LIBERDADE [A]"]
[null,{"v":83,"d":"083"},null,null,"Jose Pires",0,"x",0,"Wendel Cordeiro",{"$nulls":3},0,"E","E",0,null,null,"--",null,"--",null,"ELDORADO","LIBERDADE [A]"]
[null,{"v":84,"d":"084"},null,null,"Alex Lage",0,"x",1,"Leonardo Duguet",{"$nulls":3},0,"D","V",1,null,null,"--",null,"--",null,"ELDORADO","LIBERDADE [A]"]
[{"v":22,"d":"022"},null,"2022-04-15",{"v":2,"d":"02"},"CHACAL [B]",0,"x",4,"MATIAS [A]",null,{"$f":"IF(N111=\"V\",3,IF(N111=\"E\",1,0))","v":0},{"$f":"F111","v":0},{"$f":"SUM(M112:M115)","v":1},"D","V",{"$f":"SUM(P112:P115)","v":8},{"$f":"H111","v":4},{"$f":"IF(O111=\"V\",3,IF(O111=\"E\",1,0))","v":3},"--",null,"--",null,{"$f":"E111","v":"CHACAL [B]"},{"$f":"I111","v":"MATIAS [A]"}]
[null,{"v":85,"d":"085"},null,null,"Pablino Colen",0,"x",2,"Jose Lessa",{"$nulls":3},{"$f":"IF(F112&H112=\"WW\",0,IF(F112&H112=\"W0\",2,F112))","v":0},"D","V",{"$f":"IF(F112&H112=\"WW\",0,IF(F112&H112=\"0W\",2,H112))","v":2},null,null,"--",null,"--",null,{"$f":"W111","v":"CHACAL [B]"},"MATIAS [A]"]
[null,{"v":86,"d":"086"},null,null,"Lucas Luna",1,"x",2,"Leonardo de Oliveira",{"$nulls":3},1,"D","V",2,null,null,"--",null,"--",null,{"$f":"W111","v":"CHACAL [B]"},"MATIAS [A]"]
[null,{"v":87,"d":"087"},null,null,"Everton Costa",0,"x",2,"Marcelo Henrique",{"$nulls":3},0,"D","V",2,null,null,"--",null,"--",null,"CHACAL [B]","MATIAS [A]"]
[null,{"v":88,"d":"088"},null,null,"Rodolfo Magalhaes",0,"x",2,"Brunno Gill",{"$nulls":3},0,"D","V",2,null,null,"--",null,"--",null,"CHACAL [B]","MATIAS [A]"]
[{"v":23,"d":"023"},null,"2022-04-15",{"v":1,"d":"01"},"MATIAS [B]",0,"x",2,"AABB/ACAFUMA [C]",null,{"$f":"IF(N116=\"V\",3,IF(N116=\"E\",1,0))","v":0},{"$f":"F116","v":0},{"$f":"SUM(M117:M120)","v":2},"D","V",{"$f":"SUM(P117:P120)","v":6},{"$f":"H116","v":2},{"$f":"IF(O116=\"V\",3,IF(O116=\"E\",1,0))","v":3},"--",null,"--",null,{"$f":"E116","v":"MATIAS [B]"},{"$f":"I116","v":"AABB/ACAFUMA [C]"}]
[null,{"v":89,"d":"089"},null,null,"Romualdo Piccinini",0,"x",2,"Andre Brandao",{"$nulls":3},{"$f":"IF(F117&H117=\"WW\",0,IF(F117&H117=\"W0\",2,F117))","v":0},"D","V",{"$f":"IF(F117&H117=\"WW\",0,IF(F117&H117=\"0W\",2,H117))","v":2},null,null,"--",null,"--",null,{"$f":"W116","v":"MATIAS [B]"},"AABB/ACAFUMA [C]"]
[null,{"v":90,"d":"090"},null,null,"Ailson Brites",1,"x",1,"Simplicio Santos",{"$nulls":3},1,"E","E",1,null,null,"--",null,"--",null,{"$f":"W116","v":"MATIAS [B]"},"AABB/ACAFUMA [C]"]
[null,{"v":91,"d":"091"},null,null,"Mario Cleber",0,"x",2,"Paulo Airton Junior",{"$nulls":3},0,"D","V",2,null,null,"--",null,"--",null,"MATIAS [B]","AABB/ACAFUMA [C]"]
[null,{"v":92,"d":"092"},null,null,"Eber Chapinotti",1,"x",1,"Marcelo Silva",{"$nulls":3},1,"E","E",1,null,null,"--",null,"--",null,"MATIAS [B]","AABB/ACAFUMA [C]"]
[{"v":24,"d":"024"},null,"2022-04-15",{"v":1,"d":"01"},"LIBERDADE [B]",0,"x",3,"BOTAFOGO",null,{"$f":"IF(N121=\"V\",3,IF(N121=\"E\",1,0))","v":0},{"$f":"F121","v":0},{"$f":"SUM(M122:M125)","v":2},"D","V",{"$f":"SUM(P122:P125)","v":7},{"$f":"H121","v":3},{"$f":"IF(O121=\"V\",3,IF(O121=\"E\",1,0))","v":3},"--",null,"--",null,{"$f":"E121","v":"LIBERDADE [B]"},{"$f":"I121","v":"BOTAFOGO"}]
[null,{"v":93,"d":"093"},null,null,"Marcelo Virgilio",0,"x",0,"Diego Americo",{"$nulls":3},{"$f":"IF(F122&H122=\"WW\",0,IF(F122&H122=\"W0\",2,F122))","v":0},"E","E",{"$f":"IF(F122&H122=\"WW\",0,IF(F122&H122=\"0W\",2,H122))","v":0},null,null,"--",null,"--",null,{"$f":"W121","v":"LIBERDADE [B]"},"BOTAFOGO"]
[null,{"v":94,"d":"094"},null,null,"Luiz Carlos Guerra",1,"x",2,"Sergio Falcometa",{"$nulls":3},1,"D","V",2,null,null,"--",null,"--",null,{"$f":"W121","v":"LIBERDADE [B]"},"BOTAFOGO"]
[null,{"v":95,"d":"095"},null,null,"Daniel Oliveira",0,"x",2,"Marcos Ferreira",{"$nulls":3},0,"D","V",2,null,null,"--",null,"--",null,"LIBERDADE [B]","BOTAFOGO"]
[null,{"v":96,"d":"096"},null,null,"Joao Eduardo Pereira",1,"x",3,"Altanir Junior",{"$nulls":3},1,"D","V",3,null,null,"--",null,"--",null,"LIBERDADE [B]","BOTAFOGO"]
[{"v":25,"d":"025"},null,"2022-04-15",{"v":1,"d":"01"},"TUPI [A]",2,"x",1,"COMARY",null,{"$f":"IF(N126=\"V\",3,IF(N126=\"E\",1,0))","v":3},{"$f":"F126","v":2},{"$f":"SUM(M127:M130)","v":7},"V","D",{"$f":"SUM(P127:P130)","v":7},{"$f":"H126","v":1},{"$f":"IF(O126=\"V\",3,IF(O126=\"E\",1,0))","v":0},"--",null,"--",null,{"$f":"E126","v":"TUPI [A]"},{"$f":"I126","v":"COMARY"}]
[null,{"v":97,"d":"097"},null,null,"Leonardo Stumpf",3,"x",3,"Marco Andre Veloso",{"$nulls":3},{"$f":"IF(F127&H127=\"WW\",0,IF(F127&H127=\"W0\",2,F127))","v":3},"E","E",{"$f":"IF(F127&H127=\"WW\",0,IF(F127&H127=\"0W\",2,H127))","v":3},null,null,"--",null,"--",null,{"$f":"W126","v":"TUPI [A]"},"COMARY"]
[null,{"v":98,"d":"098"},null,null,"Marcus Monteiro",2,"x",1,"Ricardo Machado",{"$nulls":3},2,"V","D",1,null,null,"--",null,"--",null,{"$f":"W126","v":"TUPI [A]"},"COMARY"]
[null,{"v":99,"d":"099"},null,null,"Paulo Marcos de França",0,"x",2,"Pablo Sidarta",{"$nulls":3},0,"D","V",2,null,null,"--",null,"--",null,"TUPI [A]","COMARY"]
[null,100,null,null,"Carlos Antonio Miranda",2,"x",1,"Eduardo Tavares",{"$nulls":3},2,"V","D",1,null,null,"--",null,"--",null,"TUPI [A]","COMARY"]
[{"v":26,"d":"026"},null,"2022-04-15",{"v":1,"d":"01"},"CHACAL [A]",2,"x",0,"MATIAS [B]",null,{"$f":"IF(N131=\"V\",3,IF(N131=\"E\",1,0))","v":3},{"$f":"F131","v":2},{"$f":"SUM(M132:M135)","v":6},"V","D",{"$f":"SUM(P132:P135)","v":2},{"$f":"H131","v":0},{"$f":"IF(O131=\"V\",3,IF(O131=\"E\",1,0))","v":0},"--",null,"--",null,{"$f":"E131","v":"CHACAL [A]"},{"$f":"I131","v":"MATIAS [B]"}]
[null,101,null,null,"Thiago Stephan",3,"x",0,"Humberto Ramos",{"$nulls":3},{"$f":"IF(F132&H132=\"WW\",0,IF(F132&H132=\"W0\",2,F132))","v":3},"V","D",{"$f":"IF(F132&H132=\"WW\",0,IF(F132&H132=\"0W\",2,H132))","v":0},null,null,"--",null,"--",null,{"$f":"W131","v":"CHACAL [A]"},"MATIAS [B]"]
[null,102,null,null,"Janilson Pereira",2,"x",1,"Ailson Brites",{"$nulls":3},2,"V","D",1,null,null,"--",null,"--",null,{"$f":"W131","v":"CHACAL [A]"},"MATIAS [B]"]
[null,103,null,null,"Julio Celio Braga",1,"x",1,"Romualdo Piccinini",{"$nulls":3},1,"E","E",1,null,null,"--",null,{"$f":"IF($X$3=\"BOTONISTA\",(IF($U$3=E134,$U$3,IF($U$3=I134,$U$3,\"--\"))),IF($X$3=\"EQUIPE\",(IF($U$3=W134,$U$3,IF($U$3=X134,$U$3,\"--\"))),\"--\"))","v":"--"},null,"CHACAL [A]","MATIAS [B]"]
[null,104,null,null,"Paulo Mangia",0,"x",0,"Eber Chapinotti",{"$nulls":3},0,"E","E",0,null,null,{"$f":"IF(LEFT(E135,7)=\"\",\"AUS\"&+IF(B135>0,\"IND\",\"\"),IF(LEFT(I135,7)=\"\",\"AUS\"&+IF(B135>0,\"IND\",\"\"),IF(LEFT(E135,7)=\"Ausente\",\"AUS\"&+IF(B135>0,\"IND\",\"\"),IF(LEFT(I135,7)=\"Ausente\",\"AUS\"&+IF(B135>0,\"IND\",\"\"),IF(RIGHT(F135,1)=\"*\",\"NULO\"&+IF(B135>0,\"IND\",\"\"),IF(F135&H135=\"----\",\"NULO\"&+IF(B135>0,\"IND\",\"\"),IF(F135&H135=\"W0\",\"W0\"&+IF(B135>0,\"IND\",\"\"),IF(F135&H135=\"0W\",\"W0\"&+IF(B135>0,\"IND\",\"\"),IF(F135&H135=\"WW\",\"WW\"&+IF(B135>0,\"IND\",\"\"),\"--\")))))))))","v":"--"},null,"--",null,"CHACAL [A]","MATIAS [B]"]
[{"v":27,"d":"027"},null,"2022-04-15",{"v":1,"d":"01"},"GRÊMIO MINEIRO",1,"x",3,"TUPI [A]",null,{"$f":"IF(N136=\"V\",3,IF(N136=\"E\",1,0))","v":0},{"$f":"F136","v":1},{"$f":"SUM(M137:M140)","v":4},"D","V",{"$f":"SUM(P137:P140)","v":9},{"$f":"H136","v":3},{"$f":"IF(O136=\"V\",3,IF(O136=\"E\",1,0))","v":3},"--",null,"--",null,{"$f":"E136","v":"GRÊMIO MINEIRO"},{"$f":"I136","v":"TUPI [A]"}]
[null,105,null,null,"Vander Felipe",2,"x",1,"Leonardo Stumpf",{"$nulls":3},{"$f":"IF(F137&H137=\"WW\",0,IF(F137&H137=\"W0\",2,F137))","v":2},"V","D",{"$f":"IF(F137&H137=\"WW\",0,IF(F137&H137=\"0W\",2,H137))","v":1},null,null,"--",null,"--",null,{"$f":"W136","v":"GRÊMIO MINEIRO"},"TUPI [A]"]
[null,106,null,null,"Gustavo Lopes",0,"x",2,"Marcus Monteiro",{"$nulls":3},0,"D","V",2,null,null,"--",null,"--",null,{"$f":"W136","v":"GRÊMIO MINEIRO"},"TUPI [A]"]
[null,107,null,null,"Fernando Vianna",1,"x",2,"Carlos Antonio Miranda",{"$nulls":3},1,"D","V",2,null,null,"--",null,"--",null,"GRÊMIO MINEIRO","TUPI [A]"]
[null,108,null,null,"Rodrigo Primola",1,"x",4,"Eduardo Guerra",{"$nulls":3},1,{"$f":"IF(F140&+H140=\"WW\",\"D\",IF(F140>H140,\"V\",IF(F140=H140,\"E\",\"D\")))","v":"D"},{"$f":"IF(F140&+H140=\"WW\",\"D\",IF(F140<H140,\"V\",IF(F140=H140,\"E\",\"D\")))","v":"V"},4,null,null,"--",null,"--",null,"GRÊMIO MINEIRO","TUPI [A]"]
[{"v":28,"d":"028"},null,"2022-04-15",{"v":1,"d":"01"},"AABB/ACAFUMA [A]",1,"x",2,"LIBERDADE [B]",null,{"$f":"IF(N141=\"V\",3,IF(N141=\"E\",1,0))","v":0},{"$f":"F141","v":1},{"$f":"SUM(M142:M145)","v":4},"D","V",{"$f":"SUM(P142:P145)","v":5},{"$f":"H141","v":2},{"$f":"IF(O141=\"V\",3,IF(O141=\"E\",1,0))","v":3},"--",null,"--",null,{"$f":"E141","v":"AABB/ACAFUMA [A]"},{"$f":"I141","v":"LIBERDADE [B]"}]
[null,109,null,null,"Luiz Claudio Caruso",2,"x",1,"Rafael Pena",{"$nulls":3},{"$f":"IF(F142&H142=\"WW\",0,IF(F142&H142=\"W0\",2,F142))","v":2},"V","D",{"$f":"IF(F142&H142=\"WW\",0,IF(F142&H142=\"0W\",2,H142))","v":1},null,null,"--",null,"--",null,{"$f":"W141","v":"AABB/ACAFUMA [A]"},"LIBERDADE [B]"]
[null,110,null,null,"Paulo Caruso",0,"x",1,"Marcelo Virgilio",{"$nulls":3},0,"D","V",1,null,null,"--",null,"--",null,{"$f":"W141","v":"AABB/ACAFUMA [A]"},"LIBERDADE [B]"]
[null,111,null,null,"Antonio Carlos Almeida",1,"x",2,"Luiz Carlos Guerra",{"$nulls":3},1,"D","V",2,null,null,"--",null,"--",null,"AABB/ACAFUMA [A]","LIBERDADE [B]"]
[null,112,null,null,"Tarcizio Dinoa Junior",1,"x",1,"Joao Eduardo Pereira",{"$nulls":3},1,"E","E",1,null,null,"--",null,"--",null,"AABB/ACAFUMA [A]","LIBERDADE [B]"]
[{"v":29,"d":"029"},null,"2022-04-15",{"v":2,"d":"02"},"MATIAS [A]",1,"x",3,"VASCO DA GAMA",null,{"$f":"IF(N146=\"V\",3,IF(N146=\"E\",1,0))","v":0},{"$f":"F146","v":1},{"$f":"SUM(M147:M150)","v":2},"D","V",{"$f":"SUM(P147:P150)","v":7},{"$f":"H146","v":3},{"$f":"IF(O146=\"V\",3,IF(O146=\"E\",1,0))","v":3},"--",null,"--",null,{"$f":"E146","v":"MATIAS [A]"},{"$f":"I146","v":"VASCO DA GAMA"}]
[null,113,null,null,"Brunno Gill",1,"x",2,"Eder Patrocinio",{"$nulls":3},{"$f":"IF(F147&H147=\"WW\",0,IF(F147&H147=\"W0\",2,F147))","v":1},"D","V",{"$f":"IF(F147&H147=\"WW\",0,IF(F147&H147=\"0W\",2,H147))","v":2},null,null,"--",null,"--",null,{"$f":"W146","v":"MATIAS [A]"},"VASCO DA GAMA"]
[null,114,null,null,"Leonardo de Oliveira",1,"x",0,"Valmir Silva",{"$nulls":3},1,"V","D",0,null,null,"--",null,"--",null,{"$f":"W146","v":"MATIAS [A]"},"VASCO DA GAMA"]
[null,115,null,null,"Marcelo Henrique",0,"x",2,"Fernando Ferreira",{"$nulls":3},0,"D","V",2,null,null,"--",null,"--",null,"MATIAS [A]","VASCO DA GAMA"]
[null,116,null,null,"Jose Lessa",0,"x",3,"Marcelo Lima",{"$nulls":3},0,"D","V",3,null,null,"--",null,"--",null,"MATIAS [A]","VASCO DA GAMA"]
[{"v":30,"d":"030"},null,"2022-04-15",{"v":2,"d":"02"},"TUPI [B]",0,"x",1,"AABB/ACAFUMA [B]",null,{"$f":"IF(N151=\"V\",3,IF(N151=\"E\",1,0))","v":0},{"$f":"F151","v":0},{"$f":"SUM(M152:M155)","v":1},"D","V",{"$f":"SUM(P152:P155)","v":3},{"$f":"H151","v":1},{"$f":"IF(O151=\"V\",3,IF(O151=\"E\",1,0))","v":3},"--",null,"--",null,{"$f":"E151","v":"TUPI [B]"},{"$f":"I151","v":"AABB/ACAFUMA [B]"}]
[null,117,null,null,"Luiz Henrique Colla",1,"x",1,"Alcides Figueira",{"$nulls":3},{"$f":"IF(F152&H152=\"WW\",0,IF(F152&H152=\"W0\",2,F152))","v":1},"E","E",{"$f":"IF(F152&H152=\"WW\",0,IF(F152&H152=\"0W\",2,H152))","v":1},null,null,"--",null,"--",null,{"$f":"W151","v":"TUPI [B]"},"AABB/ACAFUMA [B]"]
[null,118,null,null,"Flavio Scarpelli",0,"x",2,"Adolpho Parente",{"$nulls":3},0,"D","V",2,null,null,"--",null,"--",null,{"$f":"W151","v":"TUPI [B]"},"AABB/ACAFUMA [B]"]
[null,119,null,null,"Leandro Benicio",0,"x",0,"Rodrigo Caruso",{"$nulls":3},0,"E","E",0,null,null,"--",null,"--",null,"TUPI [B]","AABB/ACAFUMA [B]"]
[null,120,null,null,"Paulo Ricardo Souza",0,"x",0,"Marcelo Ferreira",{"$nulls":3},0,"E","E",0,null,null,"--",null,"--",null,"TUPI [B]","AABB/ACAFUMA [B]"]
[{"v":31,"d":"031"},null,"2022-04-16",{"v":1,"d":"01"},"BOTAFOGO",3,"x",1,"AABB/ACAFUMA [C]",null,{"$f":"IF(N156=\"V\",3,IF(N156=\"E\",1,0))","v":3},{"$f":"F156","v":3},{"$f":"SUM(M157:M160)","v":6},"V","D",{"$f":"SUM(P157:P160)","v":1},{"$f":"H156","v":1},{"$f":"IF(O156=\"V\",3,IF(O156=\"E\",1,0))","v":0},"--",null,"--",null,{"$f":"E156","v":"BOTAFOGO"},{"$f":"I156","v":"AABB/ACAFUMA [C]"}]
[null,121,null,null,"Sergio Falcometa",1,"x",0,"Simplicio Santos",{"$nulls":3},{"$f":"IF(F157&H157=\"WW\",0,IF(F157&H157=\"W0\",2,F157))","v":1},"V","D",{"$f":"IF(F157&H157=\"WW\",0,IF(F157&H157=\"0W\",2,H157))","v":0},null,null,"--",null,"--",null,{"$f":"W156","v":"BOTAFOGO"},"AABB/ACAFUMA [C]"]
[null,122,null,null,"Altanir Junior",3,"x",0,"Andre Brandao",{"$nulls":3},3,"V","D",0,null,null,"--",null,"--",null,{"$f":"W156","v":"BOTAFOGO"},"AABB/ACAFUMA [C]"]
[null,123,null,null,"Diego Americo",2,"x",0,"Marcelo Silva",{"$nulls":3},2,"V","D",0,null,null,"--",null,"--",null,"BOTAFOGO","AABB/ACAFUMA [C]"]
[null,124,null,null,"Renato Negreiros",0,"x",1,"Paulo Airton Junior",{"$nulls":3},0,"D","V",1,null,null,"--",null,"--",null,"BOTAFOGO","AABB/ACAFUMA [C]"]
[{"v":32,"d":"032"},null,"2022-04-16",{"v":2,"d":"02"},"TUPI [B]",3,"x",0,"CHACAL [B]",null,{"$f":"IF(N161=\"V\",3,IF(N161=\"E\",1,0))","v":3},{"$f":"F161","v":3},{"$f":"SUM(M162:M165)","v":7},"V","D",{"$f":"SUM(P162:P165)","v":0},{"$f":"H161","v":0},{"$f":"IF(O161=\"V\",3,IF(O161=\"E\",1,0))","v":0},"--",null,"--",null,{"$f":"E161","v":"TUPI [B]"},{"$f":"I161","v":"CHACAL [B]"}]
[null,125,null,null,"Paulo Ricardo Souza",3,"x",0,"Vanderley da Silva",{"$nulls":3},{"$f":"IF(F162&H162=\"WW\",0,IF(F162&H162=\"W0\",2,F162))","v":3},"V","D",{"$f":"IF(F162&H162=\"WW\",0,IF(F162&H162=\"0W\",2,H162))","v":0},null,null,"--",null,"--",null,{"$f":"W161","v":"TUPI [B]"},"CHACAL [B]"]
[null,126,null,null,"Luiz Henrique Colla",3,"x",0,"Everton Costa",{"$nulls":3},3,"V","D",0,null,null,"--",null,"--",null,{"$f":"W161","v":"TUPI [B]"},"CHACAL [B]"]
[null,127,null,null,"Flavio Scarpelli",0,"x",0,"Rodolfo Magalhaes",{"$nulls":3},0,"E","E",0,null,null,"--",null,"--",null,"TUPI [B]","CHACAL [B]"]
[null,128,null,null,"Leandro Benicio",1,"x",0,"Lucas Luna",{"$nulls":3},1,"V","D",0,null,null,"--",null,"--",null,"TUPI [B]","CHACAL [B]"]
[{"v":33,"d":"033"},null,"2022-04-16",{"v":2,"d":"02"},"MATIAS [A]",3,"x",1,"ELDORADO",null,{"$f":"IF(N166=\"V\",3,IF(N166=\"E\",1,0))","v":3},{"$f":"F166","v":3},{"$f":"SUM(M167:M170)","v":5},"V","D",{"$f":"SUM(P167:P170)","v":1},{"$f":"H166","v":1},{"$f":"IF(O166=\"V\",3,IF(O166=\"E\",1,0))","v":0},"--",null,"--",null,{"$f":"E166","v":"MATIAS [A]"},{"$f":"I166","v":"ELDORADO"}]
[null,129,null,null,"Leonardo de Oliveira",0,"x",1,"Alex Lage",{"$nulls":3},{"$f":"IF(F167&H167=\"WW\",0,IF(F167&H167=\"W0\",2,F167))","v":0},"D","V",{"$f":"IF(F167&H167=\"WW\",0,IF(F167&H167=\"0W\",2,H167))","v":1},null,null,"--",null,"--",null,{"$f":"W166","v":"MATIAS [A]"},"ELDORADO"]
[null,130,null,null,"Brunno Gill",1,"x",0,"Bernardo Pires",{"$nulls":3},1,"V","D",0,null,null,"--",null,"--",null,{"$f":"W166","v":"MATIAS [A]"},"ELDORADO"]
[null,131,null,null,"Marcelo Henrique",3,"x",0,"Jose Pires",{"$nulls":3},3,"V","D",0,null,null,"--",null,"--",null,"MATIAS [A]","ELDORADO"]
[null,132,null,null,"Jose Lessa",1,"x",0,"Jorge Dias",{"$nulls":3},1,"V","D",0,null,null,"--",null,"--",null,"MATIAS [A]","ELDORADO"]
[{"v":34,"d":"034"},null,"2022-04-16",{"v":1,"d":"01"},"MATIAS [B]",0,"x",4,"TUPI [A]",null,{"$f":"IF(N171=\"V\",3,IF(N171=\"E\",1,0))","v":0},{"$f":"F171","v":0},{"$f":"SUM(M172:M175)","v":1},"D","V",{"$f":"SUM(P172:P175)","v":8},{"$f":"H171","v":4},{"$f":"IF(O171=\"V\",3,IF(O171=\"E\",1,0))","v":3},"--",null,"--",null,{"$f":"E171","v":"MATIAS [B]"},{"$f":"I171","v":"TUPI [A]"}]
[null,133,null,null,"Ailson Brites",1,"x",2,"Eduardo Guerra",{"$nulls":3},{"$f":"IF(F172&H172=\"WW\",0,IF(F172&H172=\"W0\",2,F172))","v":1},"D","V",{"$f":"IF(F172&H172=\"WW\",0,IF(F172&H172=\"0W\",2,H172))","v":2},null,null,"--",null,"--",null,{"$f":"W171","v":"MATIAS [B]"},"TUPI [A]"]
[null,134,null,null,"Mario Cleber",0,"x",3,"Leonardo Stumpf",{"$nulls":3},0,"D","V",3,null,null,"--",null,"--",null,{"$f":"W171","v":"MATIAS [B]"},"TUPI [A]"]
[null,135,null,null,"Eber Chapinotti",0,"x",2,"Marcus Monteiro",{"$nulls":3},0,"D","V",2,null,null,"--",null,"--",null,"MATIAS [B]","TUPI [A]"]
[null,136,null,null,"Romualdo Piccinini",0,"x",1,"Paulo Marcos de França",{"$nulls":3},0,"D","V",1,null,null,"--",null,"--",null,"MATIAS [B]","TUPI [A]"]
[{"v":35,"d":"035"},null,"2022-04-16",{"v":1,"d":"01"},"GRÊMIO MINEIRO",0,"x",3,"AABB/ACAFUMA [A]",null,{"$f":"IF(N176=\"V\",3,IF(N176=\"E\",1,0))","v":0},{"$f":"F176","v":0},{"$f":"SUM(M177:M180)","v":2},"D","V",{"$f":"SUM(P177:P180)","v":9},{"$f":"H176","v":3},{"$f":"IF(O176=\"V\",3,IF(O176=\"E\",1,0))","v":3},"--",null,"--",null,{"$f":"E176","v":"GRÊMIO MINEIRO"},{"$f":"I176","v":"AABB/ACAFUMA [A]"}]
[null,137,null,null,"Vander Felipe",1,"x",4,"Luiz Claudio Caruso",{"$nulls":3},{"$f":"IF(F177&H177=\"WW\",0,IF(F177&H177=\"W0\",2,F177))","v":1},"D","V",{"$f":"IF(F177&H177=\"WW\",0,IF(F177&H177=\"0W\",2,H177))","v":4},null,null,"--",null,"--",null,{"$f":"W176","v":"GRÊMIO MINEIRO"},"AABB/ACAFUMA [A]"]
[null,138,null,null,"Gustavo Lopes",0,"x",0,"Paulo Caruso",{"$nulls":3},0,"E","E",0,null,null,"--",null,"--",null,{"$f":"W176","v":"GRÊMIO MINEIRO"},"AABB/ACAFUMA [A]"]
[null,139,null,null,"Fernando Vianna",1,"x",3,"Antonio Carlos Almeida",{"$nulls":3},1,"D","V",3,null,null,"--",null,"--",null,"GRÊMIO MINEIRO","AABB/ACAFUMA [A]"]
[null,140,null,null,"Rodrigo Primola",0,"x",2,"Tarcizio Dinoa Junior",{"$nulls":3},0,"D","V",2,null,null,"--",null,"--",null,"GRÊMIO MINEIRO","AABB/ACAFUMA [A]"]
[{"v":36,"d":"036"},null,"2022-04-16",{"v":2,"d":"02"},"TUPI [B]",3,"x",1,"MATIAS [A]",null,{"$f":"IF(N181=\"V\",3,IF(N181=\"E\",1,0))","v":3},{"$f":"F181","v":3},{"$f":"SUM(M182:M185)","v":7},"V","D",{"$f":"SUM(P182:P185)","v":4},{"$f":"H181","v":1},{"$f":"IF(O181=\"V\",3,IF(O181=\"E\",1,0))","v":0},"--",null,"--",null,{"$f":"E181","v":"TUPI [B]"},{"$f":"I181","v":"MATIAS [A]"}]
[null,141,null,null,"Luiz Henrique Colla",1,"x",0,"Brunno Gill",{"$nulls":3},{"$f":"IF(F182&H182=\"WW\",0,IF(F182&H182=\"W0\",2,F182))","v":1},"V","D",{"$f":"IF(F182&H182=\"WW\",0,IF(F182&H182=\"0W\",2,H182))","v":0},null,null,"--",null,"--",null,{"$f":"W181","v":"TUPI [B]"},"MATIAS [A]"]
[null,142,null,null,"Leandro Benicio",2,"x",3,"Jose Lessa",{"$nulls":3},2,"D","V",3,null,null,"--",null,"--",null,{"$f":"W181","v":"TUPI [B]"},"MATIAS [A]"]
[null,143,null,null,"Flavio Scarpelli",1,"x",0,"Marcelo Henrique",{"$nulls":3},1,"V","D",0,null,null,"--",null,"--",null,"TUPI [B]","MATIAS [A]"]
[null,144,null,null,"Paulo Ricardo Souza",3,"x",1,"Leonardo de Oliveira",{"$nulls":3},3,"V","D",1,null,null,"--",null,"--",null,"TUPI [B]","MATIAS [A]"]
[{"v":37,"d":"037"},null,"2022-04-16",{"v":1,"d":"01"},"COMARY",2,"x",0,"BOTAFOGO",null,{"$f":"IF(N186=\"V\",3,IF(N186=\"E\",1,0))","v":3},{"$f":"F186","v":2},{"$f":"SUM(M187:M190)","v":5},"V","D",{"$f":"SUM(P187:P190)","v":2},{"$f":"H186","v":0},{"$f":"IF(O186=\"V\",3,IF(O186=\"E\",1,0))","v":0},"--",null,"--",null,{"$f":"E186","v":"COMARY"},{"$f":"I186","v":"BOTAFOGO"}]
[null,145,null,null,"Eduardo Tavares",2,"x",0,"Sergio Falcometa",{"$nulls":3},{"$f":"IF(F187&H187=\"WW\",0,IF(F187&H187=\"W0\",2,F187))","v":2},"V","D",{"$f":"IF(F187&H187=\"WW\",0,IF(F187&H187=\"0W\",2,H187))","v":0},null,null,"--",null,"--",null,{"$f":"W186","v":"COMARY"},"BOTAFOGO"]
[null,146,null,null,"Marco Andre Veloso",2,"x",1,"Altanir Junior",{"$nulls":3},2,"V","D",1,null,null,"--",null,"--",null,{"$f":"W186","v":"COMARY"},"BOTAFOGO"]
[null,147,null,null,"Igor Guarilha",0,"x",0,"Diego Americo",{"$nulls":3},0,"E","E",0,null,null,"--",null,"--",null,"COMARY","BOTAFOGO"]
[null,148,null,null,"Pablo Sidarta",1,"x",1,"Renato Negreiros",{"$nulls":3},1,"E","E",1,null,null,"--",null,"--",null,"COMARY","BOTAFOGO"]
[{"v":38,"d":"038"},null,"2022-04-16",{"v":1,"d":"01"},"LIBERDADE [B]",3,"x",1,"MATIAS [B]",null,{"$f":"IF(N191=\"V\",3,IF(N191=\"E\",1,0))","v":3},{"$f":"F191","v":3},{"$f":"SUM(M192:M195)","v":6},"V","D",{"$f":"SUM(P192:P195)","v":2},{"$f":"H191","v":1},{"$f":"IF(O191=\"V\",3,IF(O191=\"E\",1,0))","v":0},"--",null,"--",null,{"$f":"E191","v":"LIBERDADE [B]"},{"$f":"I191","v":"MATIAS [B]"}]
[null,149,null,null,"Marcelo Virgilio",1,"x",2,"Eber Chapinotti",{"$nulls":3},{"$f":"IF(F192&H192=\"WW\",0,IF(F192&H192=\"W0\",2,F192))","v":1},"D","V",{"$f":"IF(F192&H192=\"WW\",0,IF(F192&H192=\"0W\",2,H192))","v":2},null,null,"--",null,"--",null,{"$f":"W191","v":"LIBERDADE [B]"},"MATIAS [B]"]
[null,150,null,null,"Luiz Carlos Guerra",2,"x",0,"Ricardo Sartine",{"$nulls":3},2,"V","D",0,null,null,"--",null,"--",null,{"$f":"W191","v":"LIBERDADE [B]"},"MATIAS [B]"]
[null,151,null,null,"Joao Eduardo Pereira",1,"x",0,"Ailson Brites",{"$nulls":3},1,"V","D",0,null,null,"--",null,"--",null,"LIBERDADE [B]","MATIAS [B]"]
[null,152,null,null,"Rafael Pena",2,"x",0,"Romualdo Piccinini",{"$nulls":3},2,"V","D",0,null,null,"--",null,"--",null,"LIBERDADE [B]","MATIAS [B]"]
[{"v":39,"d":"039"},null,"2022-04-16",{"v":1,"d":"01"},"CHACAL [A]",1,"x",2,"GRÊMIO MINEIRO",null,{"$f":"IF(N196=\"V\",3,IF(N196=\"E\",1,0))","v":0},{"$f":"F196","v":1},{"$f":"SUM(M197:M200)","v":5},"D","V",{"$f":"SUM(P197:P200)","v":5},{"$f":"H196","v":2},{"$f":"IF(O196=\"V\",3,IF(O196=\"E\",1,0))","v":3},"--",null,"--",null,{"$f":"E196","v":"CHACAL [A]"},{"$f":"I196","v":"GRÊMIO MINEIRO"}]
[null,153,null,null,"Thiago Stephan",4,"x",1,"Rodrigo Primola",{"$nulls":3},{"$f":"IF(F197&H197=\"WW\",0,IF(F197&H197=\"W0\",2,F197))","v":4},"V","D",{"$f":"IF(F197&H197=\"WW\",0,IF(F197&H197=\"0W\",2,H197))","v":1},null,null,"--",null,"--",null,{"$f":"W196","v":"CHACAL [A]"},"GRÊMIO MINEIRO"]
[null,154,null,null,"Janilson Pereira",1,"x",3,"Vander Felipe",{"$nulls":3},1,"D","V",3,null,null,"--",null,"--",null,{"$f":"W196","v":"CHACAL [A]"},"GRÊMIO MINEIRO"]
[null,155,null,null,"Julio Celio Braga",0,"x",1,"Gustavo Lopes",{"$nulls":3},0,"D","V",1,null,null,"--",null,"--",null,"CHACAL [A]","GRÊMIO MINEIRO"]
[null,156,null,null,"Paulo Mangia",0,"x",0,"Fernando Vianna",{"$nulls":3},0,"E","E",0,null,null,"--",null,"--",null,"CHACAL [A]","GRÊMIO MINEIRO"]
[{"v":40,"d":"040"},null,"2022-04-16",{"v":2,"d":"02"},"LIBERDADE [A]",2,"x",0,"UNIÃO INDEPENDENTE/UBERABA",null,{"$f":"IF(N201=\"V\",3,IF(N201=\"E\",1,0))","v":3},{"$f":"F201","v":2},{"$f":"SUM(M202:M205)","v":6},"V","D",{"$f":"SUM(P202:P205)","v":3},{"$f":"H201","v":0},{"$f":"IF(O201=\"V\",3,IF(O201=\"E\",1,0))","v":0},"--",null,"--",null,{"$f":"E201","v":"LIBERDADE [A]"},{"$f":"I201","v":"UNIÃO INDEPENDENTE/UBERABA"}]
[null,157,null,null,"Lorival Ribeiro",1,"x",1,"Luiz Humberto",{"$nulls":3},{"$f":"IF(F202&H202=\"WW\",0,IF(F202&H202=\"W0\",2,F202))","v":1},"E","E",{"$f":"IF(F202&H202=\"WW\",0,IF(F202&H202=\"0W\",2,H202))","v":1},null,null,"--",null,"--",null,{"$f":"W201","v":"LIBERDADE [A]"},"UNIÃO INDEPENDENTE/UBERABA"]
[null,158,null,null,"Carlos Henrique Garcia",0,"x",0,"Emerson Claudino",{"$nulls":3},0,"E","E",0,null,null,"--",null,"--",null,{"$f":"W201","v":"LIBERDADE [A]"},"UNIÃO INDEPENDENTE/UBERABA"]
[null,159,null,null,"Leonardo Duguet",3,"x",1,"Juliano Gomes",{"$nulls":3},3,{"$f":"IF(F204&+H204=\"WW\",\"D\",IF(F204>H204,\"V\",IF(F204=H204,\"E\",\"D\")))","v":"V"},{"$f":"IF(F204&+H204=\"WW\",\"D\",IF(F204<H204,\"V\",IF(F204=H204,\"E\",\"D\")))","v":"D"},1,null,null,"--",null,"--",null,"LIBERDADE [A]","UNIÃO INDEPENDENTE/UBERABA"]
[null,160,null,null,"Breno Ribeiro",2,"x",1,"Constancio Moura",{"$nulls":3},2,"V","D",1,null,null,"--",null,"--",null,"LIBERDADE [A]","UNIÃO INDEPENDENTE/UBERABA"]
[{"v":41,"d":"041"},null,"2022-04-16",{"v":2,"d":"02"},"AABB/ACAFUMA [B]",0,"x",2,"VASCO DA GAMA",null,{"$f":"IF(N206=\"V\",3,IF(N206=\"E\",1,0))","v":0},{"$f":"F206","v":0},{"$f":"SUM(M207:M210)","v":1},"D","V",{"$f":"SUM(P207:P210)","v":5},{"$f":"H206","v":2},{"$f":"IF(O206=\"V\",3,IF(O206=\"E\",1,0))","v":3},"--",null,"--",null,{"$f":"E206","v":"AABB/ACAFUMA [B]"},{"$f":"I206","v":"VASCO DA GAMA"}]
[null,161,null,null,"Rodrigo Caruso",0,"x",2,"Fernando Ferreira",{"$nulls":3},{"$f":"IF(F207&H207=\"WW\",0,IF(F207&H207=\"W0\",2,F207))","v":0},"D","V",{"$f":"IF(F207&H207=\"WW\",0,IF(F207&H207=\"0W\",2,H207))","v":2},null,null,"--",null,"--",null,{"$f":"W206","v":"AABB/ACAFUMA [B]"},"VASCO DA GAMA"]
[null,162,null,null,"Marcelo Ferreira",0,"x",2,"Henrique Madeira",{"$nulls":3},0,"D","V",2,null,null,"--",null,"--",null,{"$f":"W206","v":"AABB/ACAFUMA [B]"},"VASCO DA GAMA"]
[null,163,null,null,"Alcides Figueira",1,"x",1,"Marcelo Lima",{"$nulls":3},1,"E","E",1,null,null,"--",null,"--",null,"AABB/ACAFUMA [B]","VASCO DA GAMA"]
[null,164,null,null,"Adolpho Parente",0,"x",0,"Valmir Silva",{"$nulls":3},0,"E","E",0,null,null,"--",null,"--",null,"AABB/ACAFUMA [B]","VASCO DA GAMA"]
[{"v":42,"d":"042"},null,"2022-04-16",{"v":1,"d":"01"},"AABB/ACAFUMA [C]",3,"x",0,"GRÊMIO MINEIRO",null,{"$f":"IF(N211=\"V\",3,IF(N211=\"E\",1,0))","v":3},{"$f":"F211","v":3},{"$f":"SUM(M212:M215)","v":9},"V","D",{"$f":"SUM(P212:P215)","v":4},{"$f":"H211","v":0},{"$f":"IF(O211=\"V\",3,IF(O211=\"E\",1,0))","v":0},"--",null,"--",null,{"$f":"E211","v":"AABB/ACAFUMA [C]"},{"$f":"I211","v":"GRÊMIO MINEIRO"}]
[null,165,null,null,"Marcelo Silva",1,"x",0,"Fernando Vianna",{"$nulls":3},{"$f":"IF(F212&H212=\"WW\",0,IF(F212&H212=\"W0\",2,F212))","v":1},"V","D",{"$f":"IF(F212&H212=\"WW\",0,IF(F212&H212=\"0W\",2,H212))","v":0},null,null,"--",null,"--",null,{"$f":"W211","v":"AABB/ACAFUMA [C]"},"GRÊMIO MINEIRO"]
[null,166,null,null,"Paulo Airton Junior",3,"x",0,"Rodrigo Primola",{"$nulls":3},3,"V","D",0,null,null,"--",null,"--",null,{"$f":"W211","v":"AABB/ACAFUMA [C]"},"GRÊMIO MINEIRO"]
[null,167,null,null,"Andre Brandao",4,"x",3,"Vander Felipe",{"$nulls":3},4,"V","D",3,null,null,"--",null,"--",null,"AABB/ACAFUMA [C]","GRÊMIO MINEIRO"]
[null,168,null,null,"Simplicio Santos",1,"x",1,"Gustavo Lopes",{"$nulls":3},1,"E","E",1,null,null,"--",null,"--",null,"AABB/ACAFUMA [C]","GRÊMIO MINEIRO"]
[{"v":43,"d":"043"},null,"2022-04-16",{"v":1,"d":"01"},"BOTAFOGO",2,"x",0,"CHACAL [A]",null,{"$f":"IF(N216=\"V\",3,IF(N216=\"E\",1,0))","v":3},{"$f":"F216","v":2},{"$f":"SUM(M217:M220)","v":7},"V","D",{"$f":"SUM(P217:P220)","v":4},{"$f":"H216","v":0},{"$f":"IF(O216=\"V\",3,IF(O216=\"E\",1,0))","v":0},"--",null,"--",null,{"$f":"E216","v":"BOTAFOGO"},{"$f":"I216","v":"CHACAL [A]"}]
[null,169,null,null,"Diego Americo",3,"x",1,"Julio Celio Braga",{"$nulls":3},{"$f":"IF(F217&H217=\"WW\",0,IF(F217&H217=\"W0\",2,F217))","v":3},"V","D",{"$f":"IF(F217&H217=\"WW\",0,IF(F217&H217=\"0W\",2,H217))","v":1},null,null,"--",null,"--",null,{"$f":"W216","v":"BOTAFOGO"},"CHACAL [A]"]
[null,170,null,null,"Renato Negreiros",2,"x",2,"Thiago Stephan",{"$nulls":3},2,"E","E",2,null,null,"--",null,{"$f":"IF($X$3=\"BOTONISTA\",(IF($U$3=E218,$U$3,IF($U$3=I218,$U$3,\"--\"))),IF($X$3=\"EQUIPE\",(IF($U$3=W218,$U$3,IF($U$3=X218,$U$3,\"--\"))),\"--\"))","v":"--"},null,{"$f":"W216","v":"BOTAFOGO"},"CHACAL [A]"]
[null,171,null,null,"Sergio Falcometa",2,"x",1,"Paulo Mangia",{"$nulls":3},2,"V","D",1,null,null,{"$f":"IF(LEFT(E219,7)=\"\",\"AUS\"&+IF(B219>0,\"IND\",\"\"),IF(LEFT(I219,7)=\"\",\"AUS\"&+IF(B219>0,\"IND\",\"\"),IF(LEFT(E219,7)=\"Ausente\",\"AUS\"&+IF(B219>0,\"IND\",\"\"),IF(LEFT(I219,7)=\"Ausente\",\"AUS\"&+IF(B219>0,\"IND\",\"\"),IF(RIGHT(F219,1)=\"*\",\"NULO\"&+IF(B219>0,\"IND\",\"\"),IF(F219&H219=\"----\",\"NULO\"&+IF(B219>0,\"IND\",\"\"),IF(F219&H219=\"W0\",\"W0\"&+IF(B219>0,\"IND\",\"\"),IF(F219&H219=\"0W\",\"W0\"&+IF(B219>0,\"IND\",\"\"),IF(F219&H219=\"WW\",\"WW\"&+IF(B219>0,\"IND\",\"\"),\"--\")))))))))","v":"--"},null,"--",null,"BOTAFOGO","CHACAL [A]"]
[null,172,null,null,"Altanir Junior",0,"x",0,"Janilson Pereira",{"$nulls":3},0,"E","E",0,null,null,"--",null,"--",null,"BOTAFOGO","CHACAL [A]"]
[{"v":44,"d":"044"},null,"2022-04-16",{"v":1,"d":"01"},"COMARY",0,"x",3,"AABB/ACAFUMA [A]",null,{"$f":"IF(N221=\"V\",3,IF(N221=\"E\",1,0))","v":0},{"$f":"F221","v":0},{"$f":"SUM(M222:M225)","v":0},"D","V",{"$f":"SUM(P222:P225)","v":10},{"$f":"H221","v":3},{"$f":"IF(O221=\"V\",3,IF(O221=\"E\",1,0))","v":3},"--",null,"--",null,{"$f":"E221","v":"COMARY"},{"$f":"I221","v":"AABB/ACAFUMA [A]"}]
[null,173,null,null,"Claudio Figueiredo",0,"x",4,"Paulo Caruso",{"$nulls":3},{"$f":"IF(F222&H222=\"WW\",0,IF(F222&H222=\"W0\",2,F222))","v":0},"D","V",{"$f":"IF(F222&H222=\"WW\",0,IF(F222&H222=\"0W\",2,H222))","v":4},null,null,"--",null,"--",null,{"$f":"W221","v":"COMARY"},"AABB/ACAFUMA [A]"]
[null,174,null,null,"Pablo Sidarta",0,"x",4,"Antonio Carlos Almeida",{"$nulls":3},0,"D","V",4,null,null,"--",null,"--",null,{"$f":"W221","v":"COMARY"},"AABB/ACAFUMA [A]"]
[null,175,null,null,"Igor Guarilha",0,"x",0,"Luiz Claudio Caruso",{"$nulls":3},0,"E","E",0,null,null,"--",null,"--",null,"COMARY","AABB/ACAFUMA [A]"]
[null,176,null,null,"Eduardo Tavares",0,"x",2,"Tarcizio Dinoa Junior",{"$nulls":3},0,"D","V",2,null,null,"--",null,"--",null,"COMARY","AABB/ACAFUMA [A]"]
[{"v":45,"d":"045"},null,"2022-04-16",{"v":2,"d":"02"},"CHACAL [B]",1,"x",2,"ELDORADO",null,{"$f":"IF(N226=\"V\",3,IF(N226=\"E\",1,0))","v":0},{"$f":"F226","v":1},{"$f":"SUM(M227:M230)","v":3},"D","V",{"$f":"SUM(P227:P230)","v":6},{"$f":"H226","v":2},{"$f":"IF(O226=\"V\",3,IF(O226=\"E\",1,0))","v":3},"--",null,"--",null,{"$f":"E226","v":"CHACAL [B]"},{"$f":"I226","v":"ELDORADO"}]
[null,177,null,null,"Lucas Luna",0,"x",2,"Jose Pires",{"$nulls":3},{"$f":"IF(F227&H227=\"WW\",0,IF(F227&H227=\"W0\",2,F227))","v":0},"D","V",{"$f":"IF(F227&H227=\"WW\",0,IF(F227&H227=\"0W\",2,H227))","v":2},null,null,"--",null,"--",null,{"$f":"W226","v":"CHACAL [B]"},"ELDORADO"]
[null,178,null,null,"Everton Costa",0,"x",2,"Jorge Dias",{"$nulls":3},0,"D","V",2,null,null,"--",null,"--",null,{"$f":"W226","v":"CHACAL [B]"},"ELDORADO"]
[null,179,null,null,"Heman Junior",1,"x",1,"Alex Lage",{"$nulls":3},1,"E","E",1,null,null,"--",null,"--",null,"CHACAL [B]","ELDORADO"]
[null,180,null,null,"Jefferson Rosa",2,"x",1,"Bernardo Pires",{"$nulls":3},2,"V","D",1,null,null,"--",null,"--",null,"CHACAL [B]","ELDORADO"]
[{"v":46,"d":"046"},null,"2022-04-16",{"v":1,"d":"01"},"TUPI [A]",3,"x",0,"LIBERDADE [B]",null,{"$f":"IF(N231=\"V\",3,IF(N231=\"E\",1,0))","v":3},{"$f":"F231","v":3},{"$f":"SUM(M232:M235)","v":7},"V","D",{"$f":"SUM(P232:P235)","v":2},{"$f":"H231","v":0},{"$f":"IF(O231=\"V\",3,IF(O231=\"E\",1,0))","v":0},"--",null,"--",null,{"$f":"E231","v":"TUPI [A]"},{"$f":"I231","v":"LIBERDADE [B]"}]
[null,181,null,null,"Carlos Antonio Miranda",2,"x",0,"Daniel Oliveira",{"$nulls":3},{"$f":"IF(F232&H232=\"WW\",0,IF(F232&H232=\"W0\",2,F232))","v":2},"V","D",{"$f":"IF(F232&H232=\"WW\",0,IF(F232&H232=\"0W\",2,H232))","v":0},null,null,"--",null,"--",null,{"$f":"W231","v":"TUPI [A]"},"LIBERDADE [B]"]
[null,182,null,null,"Leonardo Stumpf",2,"x",0,"Rafael Pena",{"$nulls":3},2,"V","D",0,null,null,"--",null,"--",null,{"$f":"W231","v":"TUPI [A]"},"LIBERDADE [B]"]
[null,183,null,null,"Marcus Monteiro",2,"x",2,"Joao Eduardo Pereira",{"$nulls":3},2,"E","E",2,null,null,"--",null,"--",null,"TUPI [A]","LIBERDADE [B]"]
[null,184,null,null,"Paulo Marcos de França",1,"x",0,"Luiz Carlos Guerra",{"$nulls":3},1,"V","D",0,null,null,"--",null,"--",null,"TUPI [A]","LIBERDADE [B]"]
[{"v":47,"d":"047"},null,"2022-04-16",{"v":2,"d":"02"},"UNIÃO INDEPENDENTE/UBERABA",3,"x",0,"ELDORADO",null,{"$f":"IF(N236=\"V\",3,IF(N236=\"E\",1,0))","v":3},{"$f":"F236","v":3},{"$f":"SUM(M237:M240)","v":6},"V","D",{"$f":"SUM(P237:P240)","v":0},{"$f":"H236","v":0},{"$f":"IF(O236=\"V\",3,IF(O236=\"E\",1,0))","v":0},"--",null,"--",null,{"$f":"E236","v":"UNIÃO INDEPENDENTE/UBERABA"},{"$f":"I236","v":"ELDORADO"}]
[null,185,null,null,"Luiz Humberto",1,"x",0,"Jorge Dias",{"$nulls":3},{"$f":"IF(F237&H237=\"WW\",0,IF(F237&H237=\"W0\",2,F237))","v":1},"V","D",{"$f":"IF(F237&H237=\"WW\",0,IF(F237&H237=\"0W\",2,H237))","v":0},null,null,"--",null,"--",null,{"$f":"W236","v":"UNIÃO INDEPENDENTE/UBERABA"},"ELDORADO"]
[null,186,null,null,"Emerson Claudino",3,"x",0,"Alex Lage",{"$nulls":3},3,"V","D",0,null,null,"--",null,"--",null,{"$f":"W236","v":"UNIÃO INDEPENDENTE/UBERABA"},"ELDORADO"]
[null,187,null,null,"Juliano Gomes",2,"x",0,"Bernardo Pires",{"$nulls":3},2,"V","D",0,null,null,"--",null,"--",null,"UNIÃO INDEPENDENTE/UBERABA","ELDORADO"]
[null,188,null,null,"Constancio Moura",0,"x",0,"Jose Pires",{"$nulls":3},0,"E","E",0,null,null,"--",null,"--",null,"UNIÃO INDEPENDENTE/UBERABA","ELDORADO"]
[{"v":48,"d":"048"},null,"2022-04-16",{"v":1,"d":"01"},"AABB/ACAFUMA [C]",1,"x",2,"COMARY",null,{"$f":"IF(N241=\"V\",3,IF(N241=\"E\",1,0))","v":0},{"$f":"F241","v":1},{"$f":"SUM(M242:M245)","v":3},"D","V",{"$f":"SUM(P242:P245)","v":4},{"$f":"H241","v":2},{"$f":"IF(O241=\"V\",3,IF(O241=\"E\",1,0))","v":3},"--",null,"--",null,{"$f":"E241","v":"AABB/ACAFUMA [C]"},{"$f":"I241","v":"COMARY"}]
[null,189,null,null,"Simplicio Santos",1,"x",3,"Igor Guarilha",{"$nulls":3},{"$f":"IF(F242&H242=\"WW\",0,IF(F242&H242=\"W0\",2,F242))","v":1},"D","V",{"$f":"IF(F242&H242=\"WW\",0,IF(F242&H242=\"0W\",2,H242))","v":3},null,null,"--",null,"--",null,{"$f":"W241","v":"AABB/ACAFUMA [C]"},"COMARY"]
[null,190,null,null,"Andre Brandao",2,"x",0,"Marco Andre Veloso",{"$nulls":3},2,"V","D",0,null,null,"--",null,"--",null,{"$f":"W241","v":"AABB/ACAFUMA [C]"},"COMARY"]
[null,191,null,null,"Paulo Airton Junior",0,"x",1,"Ricardo Machado",{"$nulls":3},0,"D","V",1,null,null,"--",null,"--",null,"AABB/ACAFUMA [C]","COMARY"]
[null,192,null,null,"Marcelo Silva",0,"x",0,"Pablo Sidarta",{"$nulls":3},0,"E","E",0,null,null,"--",null,"--",null,"AABB/ACAFUMA [C]","COMARY"]
[{"v":49,"d":"049"},null,"2022-04-16",{"v":2,"d":"02"},"LIBERDADE [A]",3,"x",1,"CHACAL [B]",null,{"$f":"IF(N246=\"V\",3,IF(N246=\"E\",1,0))","v":3},{"$f":"F246","v":3},{"$f":"SUM(M247:M250)","v":12},"V","D",{"$f":"SUM(P247:P250)","v":2},{"$f":"H246","v":1},{"$f":"IF(O246=\"V\",3,IF(O246=\"E\",1,0))","v":0},"--",null,"--",null,{"$f":"E246","v":"LIBERDADE [A]"},{"$f":"I246","v":"CHACAL [B]"}]
[null,193,null,null,"Carlos Henrique Garcia",4,"x",0,"Jefferson Rosa",{"$nulls":3},{"$f":"IF(F247&H247=\"WW\",0,IF(F247&H247=\"W0\",2,F247))","v":4},"V","D",{"$f":"IF(F247&H247=\"WW\",0,IF(F247&H247=\"0W\",2,H247))","v":0},null,null,"--",null,"--",null,{"$f":"W246","v":"LIBERDADE [A]"},"CHACAL [B]"]
[null,194,null,null,"Lorival Ribeiro",6,"x",0,"Vanderley da Silva",{"$nulls":3},6,"V","D",0,null,null,"--",null,"--",null,{"$f":"W246","v":"LIBERDADE [A]"},"CHACAL [B]"]
[null,195,null,null,"Wendel Cordeiro",0,"x",2,"Lucas Luna",{"$nulls":3},0,"D","V",2,null,null,"--",null,"--",null,"LIBERDADE [A]","CHACAL [B]"]
[null,196,null,null,"Breno Ribeiro",2,"x",0,"Heman Junior",{"$nulls":3},2,"V","D",0,null,null,"--",null,"--",null,"LIBERDADE [A]","CHACAL [B]"]
[{"v":50,"d":"050"},null,"2022-04-16",{"v":1,"d":"01"},"AABB/ACAFUMA [A]",3,"x",0,"CHACAL [A]",null,{"$f":"IF(N251=\"V\",3,IF(N251=\"E\",1,0))","v":3},{"$f":"F251","v":3},{"$f":"SUM(M252:M255)","v":9},"V","D",{"$f":"SUM(P252:P255)","v":0},{"$f":"H251","v":0},{"$f":"IF(O251=\"V\",3,IF(O251=\"E\",1,0))","v":0},"--",null,"--",null,{"$f":"E251","v":"AABB/ACAFUMA [A]"},{"$f":"I251","v":"CHACAL [A]"}]
[null,197,null,null,"Tarcizio Dinoa Junior",3,"x",0,"Paulo Mangia",{"$nulls":3},{"$f":"IF(F252&H252=\"WW\",0,IF(F252&H252=\"W0\",2,F252))","v":3},"V","D",{"$f":"IF(F252&H252=\"WW\",0,IF(F252&H252=\"0W\",2,H252))","v":0},null,null,"--",null,"--",null,{"$f":"W251","v":"AABB/ACAFUMA [A]"},"CHACAL [A]"]
[null,198,null,null,"Luiz Claudio Caruso",4,"x",0,"Thiago Stephan",{"$nulls":3},4,"V","D",0,null,null,"--",null,"--",null,{"$f":"W251","v":"AABB/ACAFUMA [A]"},"CHACAL [A]"]
[null,199,null,null,"Paulo Caruso",2,"x",0,"Janilson Pereira",{"$nulls":3},2,"V","D",0,null,null,"--",null,"--",null,"AABB/ACAFUMA [A]","CHACAL [A]"]
[null,200,null,null,"Antonio Carlos Almeida",0,"x",0,"Julio Celio Braga",{"$nulls":3},0,"E","E",0,null,null,"--",null,"--",null,"AABB/ACAFUMA [A]","CHACAL [A]"]
[{"v":51,"d":"051"},null,"2022-04-16",{"v":2,"d":"02"},"AABB/ACAFUMA [B]",3,"x",0,"CHACAL [B]",null,{"$f":"IF(N256=\"V\",3,IF(N256=\"E\",1,0))","v":3},{"$f":"F256","v":3},{"$f":"SUM(M257:M260)","v":9},"V","D",{"$f":"SUM(P257:P260)","v":2},{"$f":"H256","v":0},{"$f":"IF(O256=\"V\",3,IF(O256=\"E\",1,0))","v":0},"--",null,"--",null,{"$f":"E256","v":"AABB/ACAFUMA [B]"},{"$f":"I256","v":"CHACAL [B]"}]
[null,201,null,null,"Rodrigo Caruso",1,"x",1,"Everton Costa",{"$nulls":3},{"$f":"IF(F257&H257=\"WW\",0,IF(F257&H257=\"W0\",2,F257))","v":1},"E","E",{"$f":"IF(F257&H257=\"WW\",0,IF(F257&H257=\"0W\",2,H257))","v":1},null,null,"--",null,"--",null,{"$f":"W256","v":"AABB/ACAFUMA [B]"},"CHACAL [B]"]
[null,202,null,null,"Alcides Figueira",5,"x",1,"Lucas Luna",{"$nulls":3},5,"V","D",1,null,null,"--",null,"--",null,{"$f":"W256","v":"AABB/ACAFUMA [B]"},"CHACAL [B]"]
[null,203,null,null,"Adolpho Parente",2,"x",0,"Rodolfo Magalhaes",{"$nulls":3},2,"V","D",0,null,null,"--",null,"--",null,"AABB/ACAFUMA [B]","CHACAL [B]"]
[null,204,null,null,"Paulo Cesar Faria",1,"x",0,"Pablino Colen",{"$nulls":3},1,"V","D",0,null,null,"--",null,"--",null,"AABB/ACAFUMA [B]","CHACAL [B]"]
[{"v":52,"d":"052"},null,"2022-04-16",{"v":2,"d":"02"},"ELDORADO",1,"x",1,"VASCO DA GAMA",null,{"$f":"IF(N261=\"V\",3,IF(N261=\"E\",1,0))","v":1},{"$f":"F261","v":1},{"$f":"SUM(M262:M265)","v":2},"E","E",{"$f":"SUM(P262:P265)","v":3},{"$f":"H261","v":1},{"$f":"IF(O261=\"V\",3,IF(O261=\"E\",1,0))","v":1},"--",null,"--",null,{"$f":"E261","v":"ELDORADO"},{"$f":"I261","v":"VASCO DA GAMA"}]
[null,205,null,null,"Alex Lage",0,"x",2,"Fernando Ferreira",{"$nulls":3},{"$f":"IF(F262&H262=\"WW\",0,IF(F262&H262=\"W0\",2,F262))","v":0},"D","V",{"$f":"IF(F262&H262=\"WW\",0,IF(F262&H262=\"0W\",2,H262))","v":2},null,null,"--",null,"--",null,{"$f":"W261","v":"ELDORADO"},"VASCO DA GAMA"]
[null,206,null,null,"Bernardo Pires",0,"x",0,"Marcelo Lima",{"$nulls":3},0,"E","E",0,null,null,"--",null,"--",null,{"$f":"W261","v":"ELDORADO"},"VASCO DA GAMA"]
[null,207,null,null,"Jose Pires",1,"x",0,"Henrique Madeira",{"$nulls":3},1,"V","D",0,null,null,"--",null,"--",null,"ELDORADO","VASCO DA GAMA"]
[null,208,null,null,"Jorge Dias",1,"x",1,"Valmir Silva",{"$nulls":3},1,"E","E",1,null,null,"--",null,"--",null,"ELDORADO","VASCO DA GAMA"]
[{"v":53,"d":"053"},null,"2022-04-16",{"v":2,"d":"02"},"UNIÃO INDEPENDENTE/UBERABA",1,"x",3,"MATIAS [A]",null,{"$f":"IF(N266=\"V\",3,IF(N266=\"E\",1,0))","v":0},{"$f":"F266","v":1},{"$f":"SUM(M267:M270)","v":2},"D","V",{"$f":"SUM(P267:P270)","v":6},{"$f":"H266","v":3},{"$f":"IF(O266=\"V\",3,IF(O266=\"E\",1,0))","v":3},"--",null,"--",null,{"$f":"E266","v":"UNIÃO INDEPENDENTE/UBERABA"},{"$f":"I266","v":"MATIAS [A]"}]
[null,209,null,null,"Emerson Claudino",0,"x",2,"Jose Lessa",{"$nulls":3},{"$f":"IF(F267&H267=\"WW\",0,IF(F267&H267=\"W0\",2,F267))","v":0},"D","V",{"$f":"IF(F267&H267=\"WW\",0,IF(F267&H267=\"0W\",2,H267))","v":2},null,null,"--",null,"--",null,{"$f":"W266","v":"UNIÃO INDEPENDENTE/UBERABA"},"MATIAS [A]"]
[null,210,null,null,"Juliano Gomes",1,"x",0,"Marcelo Henrique",{"$nulls":3},1,{"$f":"IF(F268&+H268=\"WW\",\"D\",IF(F268>H268,\"V\",IF(F268=H268,\"E\",\"D\")))","v":"V"},{"$f":"IF(F268&+H268=\"WW\",\"D\",IF(F268<H268,\"V\",IF(F268=H268,\"E\",\"D\")))","v":"D"},0,null,null,"--",null,"--",null,{"$f":"W266","v":"UNIÃO INDEPENDENTE/UBERABA"},"MATIAS [A]"]
[null,211,null,null,"Constancio Moura",1,"x",3,"Brunno Gill",{"$nulls":3},1,"D","V",3,null,null,"--",null,"--",null,"UNIÃO INDEPENDENTE/UBERABA","MATIAS [A]"]
[null,212,null,null,"Luiz Humberto",0,"x",1,"Leonardo de Oliveira",{"$nulls":3},0,"D","V",1,null,null,"--",null,"--",null,"UNIÃO INDEPENDENTE/UBERABA","MATIAS [A]"]
[{"v":54,"d":"054"},null,"2022-04-16",{"v":2,"d":"02"},"TUPI [B]",1,"x",3,"LIBERDADE [A]",null,{"$f":"IF(N271=\"V\",3,IF(N271=\"E\",1,0))","v":0},{"$f":"F271","v":1},{"$f":"SUM(M272:M275)","v":4},"D","V",{"$f":"SUM(P272:P275)","v":6},{"$f":"H271","v":3},{"$f":"IF(O271=\"V\",3,IF(O271=\"E\",1,0))","v":3},"--",null,"--",null,{"$f":"E271","v":"TUPI [B]"},{"$f":"I271","v":"LIBERDADE [A]"}]
[null,213,null,null,"Leandro Benicio",3,"x",1,"Leonardo Duguet",{"$nulls":3},{"$f":"IF(F272&H272=\"WW\",0,IF(F272&H272=\"W0\",2,F272))","v":3},"V","D",{"$f":"IF(F272&H272=\"WW\",0,IF(F272&H272=\"0W\",2,H272))","v":1},null,null,"--",null,"--",null,{"$f":"W271","v":"TUPI [B]"},"LIBERDADE [A]"]
[null,214,null,null,"Luiz Henrique Colla",1,"x",3,"Carlos Henrique Garcia",{"$nulls":3},1,"D","V",3,null,null,"--",null,"--",null,{"$f":"W271","v":"TUPI [B]"},"LIBERDADE [A]"]
[null,215,null,null,"Flavio Scarpelli",0,"x",1,"Breno Ribeiro",{"$nulls":3},0,"D","V",1,null,null,"--",null,"--",null,"TUPI [B]","LIBERDADE [A]"]
[null,216,null,null,"Paulo Ricardo Souza",0,"x",1,"Lorival Ribeiro",{"$nulls":3},0,"D","V",1,null,null,"--",null,"--",null,"TUPI [B]","LIBERDADE [A]"]
[{"v":55,"d":"055"},null,"2022-04-16",{"v":1,"d":"01"},"MATIAS [B]",1,"x",3,"COMARY",null,{"$f":"IF(N276=\"V\",3,IF(N276=\"E\",1,0))","v":0},{"$f":"F276","v":1},{"$f":"SUM(M277:M280)","v":2},"D","V",{"$f":"SUM(P277:P280)","v":8},{"$f":"H276","v":3},{"$f":"IF(O276=\"V\",3,IF(O276=\"E\",1,0))","v":3},"--",null,"--",null,{"$f":"E276","v":"MATIAS [B]"},{"$f":"I276","v":"COMARY"}]
[null,217,null,null,"Ailson Brites",0,"x",2,"Igor Guarilha",{"$nulls":3},{"$f":"IF(F277&H277=\"WW\",0,IF(F277&H277=\"W0\",2,F277))","v":0},"D","V",{"$f":"IF(F277&H277=\"WW\",0,IF(F277&H277=\"0W\",2,H277))","v":2},null,null,"--",null,"--",null,{"$f":"W276","v":"MATIAS [B]"},"COMARY"]
[null,218,null,null,"Ricardo Sartine",0,"x",4,"Pablo Sidarta",{"$nulls":3},0,"D","V",4,null,null,"--",null,"--",null,{"$f":"W276","v":"MATIAS [B]"},"COMARY"]
[null,219,null,null,"Romualdo Piccinini",2,"x",0,"Eduardo Tavares",{"$nulls":3},2,"V","D",0,null,null,"--",null,"--",null,"MATIAS [B]","COMARY"]
[null,220,null,null,"Mario Cleber",0,"x",2,"Claudio Figueiredo",{"$nulls":3},0,"D","V",2,null,null,"--",null,"--",null,"MATIAS [B]","COMARY"]
[{"v":56,"d":"056"},null,"2022-04-16",{"v":2,"d":"02"},"MATIAS [A]",2,"x",2,"LIBERDADE [A]",null,{"$f":"IF(N281=\"V\",3,IF(N281=\"E\",1,0))","v":1},{"$f":"F281","v":2},{"$f":"SUM(M282:M285)","v":5},"E","E",{"$f":"SUM(P282:P285)","v":4},{"$f":"H281","v":2},{"$f":"IF(O281=\"V\",3,IF(O281=\"E\",1,0))","v":1},"--",null,"--",null,{"$f":"E281","v":"MATIAS [A]"},{"$f":"I281","v":"LIBERDADE [A]"}]
[null,221,null,null,"Marcelo Henrique",0,"x",1,"Lorival Ribeiro",{"$nulls":3},{"$f":"IF(F282&H282=\"WW\",0,IF(F282&H282=\"W0\",2,F282))","v":0},"D","V",{"$f":"IF(F282&H282=\"WW\",0,IF(F282&H282=\"0W\",2,H282))","v":1},null,null,"--",null,{"$f":"IF($X$3=\"BOTONISTA\",(IF($U$3=E282,$U$3,IF($U$3=I282,$U$3,\"--\"))),IF($X$3=\"EQUIPE\",(IF($U$3=W282,$U$3,IF($U$3=X282,$U$3,\"--\"))),\"--\"))","v":"--"},null,{"$f":"W281","v":"MATIAS [A]"},"LIBERDADE [A]"]
[null,222,null,null,"Jose Lessa",3,"x",1,"Breno Ribeiro",{"$nulls":3},3,"V","D",1,null,null,{"$f":"IF(LEFT(E283,7)=\"\",\"AUS\"&+IF(B283>0,\"IND\",\"\"),IF(LEFT(I283,7)=\"\",\"AUS\"&+IF(B283>0,\"IND\",\"\"),IF(LEFT(E283,7)=\"Ausente\",\"AUS\"&+IF(B283>0,\"IND\",\"\"),IF(LEFT(I283,7)=\"Ausente\",\"AUS\"&+IF(B283>0,\"IND\",\"\"),IF(RIGHT(F283,1)=\"*\",\"NULO\"&+IF(B283>0,\"IND\",\"\"),IF(F283&H283=\"----\",\"NULO\"&+IF(B283>0,\"IND\",\"\"),IF(F283&H283=\"W0\",\"W0\"&+IF(B283>0,\"IND\",\"\"),IF(F283&H283=\"0W\",\"W0\"&+IF(B283>0,\"IND\",\"\"),IF(F283&H283=\"WW\",\"WW\"&+IF(B283>0,\"IND\",\"\"),\"--\")))))))))","v":"--"},null,"--",null,{"$f":"W281","v":"MATIAS [A]"},"LIBERDADE [A]"]
[null,223,null,null,"Brunno Gill",2,"x",1,"Carlos Henrique Garcia",{"$nulls":3},2,"V","D",1,null,null,"--",null,"--",null,"MATIAS [A]","LIBERDADE [A]"]
[null,224,null,null,"Leonardo de Oliveira",0,"x",1,"Leonardo Duguet",{"$nulls":3},0,"D","V",1,null,null,"--",null,"--",null,"MATIAS [A]","LIBERDADE [A]"]
[{"v":57,"d":"057"},null,"2022-04-16",{"v":2,"d":"02"},"UNIÃO INDEPENDENTE/UBERABA",2,"x",0,"TUPI [B]",null,{"$f":"IF(N286=\"V\",3,IF(N286=\"E\",1,0))","v":3},{"$f":"F286","v":2},{"$f":"SUM(M287:M290)","v":7},"V","D",{"$f":"SUM(P287:P290)","v":3},{"$f":"H286","v":0},{"$f":"IF(O286=\"V\",3,IF(O286=\"E\",1,0))","v":0},"--",null,"--",null,{"$f":"E286","v":"UNIÃO INDEPENDENTE/UBERABA"},{"$f":"I286","v":"TUPI [B]"}]
[null,225,null,null,"Emerson Claudino",0,"x",0,"Luiz Henrique Colla",{"$nulls":3},{"$f":"IF(F287&H287=\"WW\",0,IF(F287&H287=\"W0\",2,F287))","v":0},"E","E",{"$f":"IF(F287&H287=\"WW\",0,IF(F287&H287=\"0W\",2,H287))","v":0},null,null,"--",null,"--",null,{"$f":"W286","v":"UNIÃO INDEPENDENTE/UBERABA"},"TUPI [B]"]
[null,226,null,null,"Juliano Gomes",3,"x",1,"Flavio Scarpelli",{"$nulls":3},3,"V","D",1,null,null,"--",null,"--",null,{"$f":"W286","v":"UNIÃO INDEPENDENTE/UBERABA"},"TUPI [B]"]
[null,227,null,null,"Constancio Moura",3,"x",1,"Leandro Benicio",{"$nulls":3},3,"V","D",1,null,null,"--",null,"--",null,"UNIÃO INDEPENDENTE/UBERABA","TUPI [B]"]
[null,228,null,null,"Luiz Humberto",1,"x",1,"Paulo Ricardo Souza",{"$nulls":3},1,"E","E",1,null,null,"--",null,"--",null,"UNIÃO INDEPENDENTE/UBERABA","TUPI [B]"]
[{"v":58,"d":"058"},null,"2022-04-16",{"v":1,"d":"01"},"LIBERDADE [B]",1,"x",3,"AABB/ACAFUMA [C]",null,{"$f":"IF(N291=\"V\",3,IF(N291=\"E\",1,0))","v":0},{"$f":"F291","v":1},{"$f":"SUM(M292:M295)","v":3},"D","V",{"$f":"SUM(P292:P295)","v":4},{"$f":"H291","v":3},{"$f":"IF(O291=\"V\",3,IF(O291=\"E\",1,0))","v":3},"--",null,"--",null,{"$f":"E291","v":"LIBERDADE [B]"},{"$f":"I291","v":"AABB/ACAFUMA [C]"}]
[null,229,null,null,"Rafael Pena",0,"x",1,"Andre Brandao",{"$nulls":3},{"$f":"IF(F292&H292=\"WW\",0,IF(F292&H292=\"W0\",2,F292))","v":0},"D","V",{"$f":"IF(F292&H292=\"WW\",0,IF(F292&H292=\"0W\",2,H292))","v":1},null,null,"--",null,"--",null,{"$f":"W291","v":"LIBERDADE [B]"},"AABB/ACAFUMA [C]"]
[null,230,null,null,"Marcelo Virgilio",0,"x",1,"Paulo Airton Junior",{"$nulls":3},0,"D","V",1,null,null,"--",null,"--",null,{"$f":"W291","v":"LIBERDADE [B]"},"AABB/ACAFUMA [C]"]
[null,231,null,null,"Luiz Carlos Guerra",2,"x",0,"Simplicio Santos",{"$nulls":3},2,"V","D",0,null,null,"--",null,"--",null,"LIBERDADE [B]","AABB/ACAFUMA [C]"]
[null,232,null,null,"Daniel Oliveira",1,"x",2,"Marcelo Silva",{"$nulls":3},1,"D","V",2,null,null,"--",null,"--",null,"LIBERDADE [B]","AABB/ACAFUMA [C]"]
[{"v":59,"d":"059"},null,"2022-04-16",{"v":1,"d":"01"},"TUPI [A]",2,"x",0,"BOTAFOGO",null,{"$f":"IF(N296=\"V\",3,IF(N296=\"E\",1,0))","v":3},{"$f":"F296","v":2},{"$f":"SUM(M297:M300)","v":4},"V","D",{"$f":"SUM(P297:P300)","v":2},{"$f":"H296","v":0},{"$f":"IF(O296=\"V\",3,IF(O296=\"E\",1,0))","v":0},"--",null,"--",null,{"$f":"E296","v":"TUPI [A]"},{"$f":"I296","v":"BOTAFOGO"}]
[null,233,null,null,"Leonardo Stumpf",1,"x",0,"Sergio Falcometa",{"$nulls":3},{"$f":"IF(F297&H297=\"WW\",0,IF(F297&H297=\"W0\",2,F297))","v":1},"V","D",{"$f":"IF(F297&H297=\"WW\",0,IF(F297&H297=\"0W\",2,H297))","v":0},null,null,"--",null,"--",null,{"$f":"W296","v":"TUPI [A]"},"BOTAFOGO"]
[null,234,null,null,"Marcus Monteiro",1,"x",0,"Altanir Junior",{"$nulls":3},1,"V","D",0,null,null,"--",null,"--",null,{"$f":"W296","v":"TUPI [A]"},"BOTAFOGO"]
[null,235,null,null,"Paulo Marcos de França",1,"x",1,"Diego Americo",{"$nulls":3},1,"E","E",1,null,null,"--",null,"--",null,"TUPI [A]","BOTAFOGO"]
[null,236,null,null,"Carlos Antonio Miranda",1,"x",1,"Renato Negreiros",{"$nulls":3},1,"E","E",1,null,null,"--",null,"--",null,"TUPI [A]","BOTAFOGO"]
[{"v":60,"d":"060"},null,"2022-04-16",{"v":2,"d":"02"},"VASCO DA GAMA",2,"x",0,"CHACAL [B]",null,{"$f":"IF(N301=\"V\",3,IF(N301=\"E\",1,0))","v":3},{"$f":"F301","v":2},{"$f":"SUM(M302:M305)","v":5},"V","D",{"$f":"SUM(P302:P305)","v":1},{"$f":"H301","v":0},{"$f":"IF(O301=\"V\",3,IF(O301=\"E\",1,0))","v":0},"--",null,"--",null,{"$f":"E301","v":"VASCO DA GAMA"},{"$f":"I301","v":"CHACAL [B]"}]
[null,237,null,null,"Henrique Madeira",2,"x",0,"Heman Junior",{"$nulls":3},{"$f":"IF(F302&H302=\"WW\",0,IF(F302&H302=\"W0\",2,F302))","v":2},"V","D",{"$f":"IF(F302&H302=\"WW\",0,IF(F302&H302=\"0W\",2,H302))","v":0},null,null,"--",null,"--",null,{"$f":"W301","v":"VASCO DA GAMA"},"CHACAL [B]"]
[null,238,null,null,"Marcelo Lima",0,"x",0,"Everton Costa",{"$nulls":3},0,"E","E",0,null,null,"--",null,"--",null,{"$f":"W301","v":"VASCO DA GAMA"},"CHACAL [B]"]
[null,239,null,null,"Fernando Ferreira",1,"x",1,"Rodolfo Magalhaes",{"$nulls":3},1,"E","E",1,null,null,"--",null,"--",null,"VASCO DA GAMA","CHACAL [B]"]
[null,240,null,null,"Valmir Silva",2,"x",0,"Jefferson Rosa",{"$nulls":3},2,"V","D",0,null,null,"--",null,"--",null,"VASCO DA GAMA","CHACAL [B]"]
[{"v":61,"d":"061"},null,"2022-04-16",{"v":1,"d":"01"},"AABB/ACAFUMA [A]",3,"x",0,"MATIAS [B]",null,{"$f":"IF(N306=\"V\",3,IF(N306=\"E\",1,0))","v":3},{"$f":"F306","v":3},{"$f":"SUM(M307:M310)","v":9},"V","D",{"$f":"SUM(P307:P310)","v":0},{"$f":"H306","v":0},{"$f":"IF(O306=\"V\",3,IF(O306=\"E\",1,0))","v":0},"--",null,"--",null,{"$f":"E306","v":"AABB/ACAFUMA [A]"},{"$f":"I306","v":"MATIAS [B]"}]
[null,241,null,null,"Luiz Claudio Caruso",2,"x",0,"Ailson Brites",{"$nulls":3},{"$f":"IF(F307&H307=\"WW\",0,IF(F307&H307=\"W0\",2,F307))","v":2},"V","D",{"$f":"IF(F307&H307=\"WW\",0,IF(F307&H307=\"0W\",2,H307))","v":0},null,null,"--",null,"--",null,{"$f":"W306","v":"AABB/ACAFUMA [A]"},"MATIAS [B]"]
[null,242,null,null,"Paulo Caruso",2,"x",0,"Ricardo Sartine",{"$nulls":3},2,"V","D",0,null,null,"--",null,"--",null,{"$f":"W306","v":"AABB/ACAFUMA [A]"},"MATIAS [B]"]
[null,243,null,null,"Antonio Carlos Almeida",0,"x",0,"Romualdo Piccinini",{"$nulls":3},0,"E","E",0,null,null,"--",null,"--",null,"AABB/ACAFUMA [A]","MATIAS [B]"]
[null,244,null,null,"Tarcizio Dinoa Junior",5,"x",0,"Humberto Ramos",{"$nulls":3},5,"V","D",0,null,null,"--",null,"--",null,"AABB/ACAFUMA [A]","MATIAS [B]"]
[{"v":62,"d":"062"},null,"2022-04-16",{"v":1,"d":"01"},"GRÊMIO MINEIRO",0,"x",3,"LIBERDADE [B]",null,{"$f":"IF(N311=\"V\",3,IF(N311=\"E\",1,0))","v":0},{"$f":"F311","v":0},{"$f":"SUM(M312:M315)","v":2},"D","V",{"$f":"SUM(P312:P315)","v":6},{"$f":"H311","v":3},{"$f":"IF(O311=\"V\",3,IF(O311=\"E\",1,0))","v":3},"--",null,"--",null,{"$f":"E311","v":"GRÊMIO MINEIRO"},{"$f":"I311","v":"LIBERDADE [B]"}]
[null,245,null,null,"Vander Felipe",0,"x",1,"Rafael Pena",{"$nulls":3},{"$f":"IF(F312&H312=\"WW\",0,IF(F312&H312=\"W0\",2,F312))","v":0},"D","V",{"$f":"IF(F312&H312=\"WW\",0,IF(F312&H312=\"0W\",2,H312))","v":1},null,null,"--",null,"--",null,{"$f":"W311","v":"GRÊMIO MINEIRO"},"LIBERDADE [B]"]
[null,246,null,null,"Gustavo Lopes",0,"x",1,"Marcelo Virgilio",{"$nulls":3},0,"D","V",1,null,null,"--",null,"--",null,{"$f":"W311","v":"GRÊMIO MINEIRO"},"LIBERDADE [B]"]
[null,247,null,null,"Fernando Vianna",2,"x",2,"Luiz Carlos Guerra",{"$nulls":3},2,"E","E",2,null,null,"--",null,"--",null,"GRÊMIO MINEIRO","LIBERDADE [B]"]
[null,248,null,null,"Rodrigo Primola",0,"x",2,"Daniel Oliveira",{"$nulls":3},0,"D","V",2,null,null,"--",null,"--",null,"GRÊMIO MINEIRO","LIBERDADE [B]"]
[{"v":63,"d":"063"},null,"2022-04-16",{"v":1,"d":"01"},"CHACAL [A]",0,"x",2,"TUPI [A]",null,{"$f":"IF(N316=\"V\",3,IF(N316=\"E\",1,0))","v":0},{"$f":"F316","v":0},{"$f":"SUM(M317:M320)","v":5},"D","V",{"$f":"SUM(P317:P320)","v":7},{"$f":"H316","v":2},{"$f":"IF(O316=\"V\",3,IF(O316=\"E\",1,0))","v":3},"--",null,"--",null,{"$f":"E316","v":"CHACAL [A]"},{"$f":"I316","v":"TUPI [A]"}]
[null,249,null,null,"Thiago Stephan",1,"x",2,"Marcus Monteiro",{"$nulls":3},{"$f":"IF(F317&H317=\"WW\",0,IF(F317&H317=\"W0\",2,F317))","v":1},"D","V",{"$f":"IF(F317&H317=\"WW\",0,IF(F317&H317=\"0W\",2,H317))","v":2},null,null,"--",null,"--",null,{"$f":"W316","v":"CHACAL [A]"},"TUPI [A]"]
[null,250,null,null,"Janilson Pereira",1,"x",2,"Leonardo Stumpf",{"$nulls":3},1,"D","V",2,null,null,"--",null,"--",null,{"$f":"W316","v":"CHACAL [A]"},"TUPI [A]"]
[null,251,null,null,"Julio Celio Braga",2,"x",2,"Carlos Antonio Miranda",{"$nulls":3},2,"E","E",2,null,null,"--",null,"--",null,"CHACAL [A]","TUPI [A]"]
[null,252,null,null,"Paulo Mangia",1,"x",1,"Eduardo Guerra",{"$nulls":3},1,"E","E",1,null,null,"--",null,"--",null,"CHACAL [A]","TUPI [A]"]
[{"v":64,"d":"064"},null,"2022-04-16",{"v":2,"d":"02"},"ELDORADO",0,"x",3,"AABB/ACAFUMA [B]",null,{"$f":"IF(N321=\"V\",3,IF(N321=\"E\",1,0))","v":0},{"$f":"F321","v":0},{"$f":"SUM(M322:M325)","v":3},"D","V",{"$f":"SUM(P322:P325)","v":9},{"$f":"H321","v":3},{"$f":"IF(O321=\"V\",3,IF(O321=\"E\",1,0))","v":3},"--",null,"--",null,{"$f":"E321","v":"ELDORADO"},{"$f":"I321","v":"AABB/ACAFUMA [B]"}]
[null,253,null,null,"Alex Lage",2,"x",3,"Alcides Figueira",{"$nulls":3},{"$f":"IF(F322&H322=\"WW\",0,IF(F322&H322=\"W0\",2,F322))","v":2},"D","V",{"$f":"IF(F322&H322=\"WW\",0,IF(F322&H322=\"0W\",2,H322))","v":3},null,null,"--",null,"--",null,{"$f":"W321","v":"ELDORADO"},"AABB/ACAFUMA [B]"]
[null,254,null,null,"Bernardo Pires",0,"x",4,"Adolpho Parente",{"$nulls":3},0,"D","V",4,null,null,"--",null,"--",null,{"$f":"W321","v":"ELDORADO"},"AABB/ACAFUMA [B]"]
[null,255,null,null,"Jose Pires",1,"x",1,"Paulo Cesar Faria",{"$nulls":3},1,"E","E",1,null,null,"--",null,"--",null,"ELDORADO","AABB/ACAFUMA [B]"]
[null,256,null,null,"Jorge Dias",0,"x",1,"Marcelo Ferreira",{"$nulls":3},0,"D","V",1,null,null,"--",null,"--",null,"ELDORADO","AABB/ACAFUMA [B]"]
[{"v":65,"d":"065"},null,"2022-04-17","TP.01","ELDORADO",2,"x",0,"MATIAS [B]",null,{"$f":"IF(N326=\"V\",3,IF(N326=\"E\",1,0))","v":3},{"$f":"F326","v":2},{"$f":"SUM(M327:M330)","v":6},"V","D",{"$f":"SUM(P327:P330)","v":1},{"$f":"H326","v":0},{"$f":"IF(O326=\"V\",3,IF(O326=\"E\",1,0))","v":0},"--",null,"--",null,{"$f":"E326","v":"ELDORADO"},{"$f":"I326","v":"MATIAS [B]"}]
[null,257,null,null,"Bernardo Pires",0,"x",0,"Romualdo Piccinini",{"$nulls":3},{"$f":"IF(F327&H327=\"WW\",0,IF(F327&H327=\"W0\",2,F327))","v":0},"E","E",{"$f":"IF(F327&H327=\"WW\",0,IF(F327&H327=\"0W\",2,H327))","v":0},null,null,"--",null,"--",null,{"$f":"W326","v":"ELDORADO"},"MATIAS [B]"]
[null,258,null,null,"Jose Pires",2,"x",0,"Eber Chapinotti",{"$nulls":3},2,"V","D",0,null,null,"--",null,"--",null,{"$f":"W326","v":"ELDORADO"},"MATIAS [B]"]
[null,259,null,null,"Jorge Dias",3,"x",0,"Mario Cleber",{"$nulls":3},3,"V","D",0,null,null,"--",null,"--",null,"ELDORADO","MATIAS [B]"]
[null,260,null,null,"Alex Lage",1,"x",1,"Ailson Brites",{"$nulls":3},1,"E","E",1,null,null,"--",null,"--",null,"ELDORADO","MATIAS [B]"]
[{"v":66,"d":"066"},null,"2022-04-17",{"v":3,"d":"03"},"AABB/ACAFUMA [A]",0,"x",4,"VASCO DA GAMA",null,{"$f":"IF(N331=\"V\",3,IF(N331=\"E\",1,0))","v":0},{"$f":"F331","v":0},{"$f":"SUM(M332:M335)","v":1},"D","V",{"$f":"SUM(P332:P335)","v":11},{"$f":"H331","v":4},{"$f":"IF(O331=\"V\",3,IF(O331=\"E\",1,0))","v":3},"--",null,"--",null,{"$f":"E331","v":"AABB/ACAFUMA [A]"},{"$f":"I331","v":"VASCO DA GAMA"}]
[null,261,null,null,"Paulo Caruso",0,"x",3,"Eder Patrocinio",{"$nulls":3},{"$f":"IF(F332&H332=\"WW\",0,IF(F332&H332=\"W0\",2,F332))","v":0},{"$f":"IF(F332&+H332=\"WW\",\"D\",IF(F332>H332,\"V\",IF(F332=H332,\"E\",\"D\")))","v":"D"},{"$f":"IF(F332&+H332=\"WW\",\"D\",IF(F332<H332,\"V\",IF(F332=H332,\"E\",\"D\")))","v":"V"},{"$f":"IF(F332&H332=\"WW\",0,IF(F332&H332=\"0W\",2,H332))","v":3},null,null,"--",null,"--",null,{"$f":"W331","v":"AABB/ACAFUMA [A]"},"VASCO DA GAMA"]
[null,262,null,null,"Antonio Carlos Almeida",0,"x",2,"Eduardo Costa",{"$nulls":3},0,"D","V",2,null,null,"--",null,"--",null,{"$f":"W331","v":"AABB/ACAFUMA [A]"},"VASCO DA GAMA"]
[null,263,null,null,"Tarcizio Dinoa Junior",0,"x",4,"Evandro Gomes",{"$nulls":3},0,"D","V",4,null,null,"--",null,"--",null,"AABB/ACAFUMA [A]","VASCO DA GAMA"]
[null,264,null,null,"Luiz Claudio Caruso",1,"x",2,"Fernando Ferreira",{"$nulls":3},1,"D","V",2,null,null,"--",null,"--",null,"AABB/ACAFUMA [A]","VASCO DA GAMA"]
[{"v":67,"d":"067"},null,"2022-04-17",{"v":4,"d":"04"},"TUPI [B]",1,"x",2,"AABB/ACAFUMA [C]",null,{"$f":"IF(N336=\"V\",3,IF(N336=\"E\",1,0))","v":0},{"$f":"F336","v":1},{"$f":"SUM(M337:M340)","v":7},"D","V",{"$f":"SUM(P337:P340)","v":4},{"$f":"H336","v":2},{"$f":"IF(O336=\"V\",3,IF(O336=\"E\",1,0))","v":3},"--",null,"--",null,{"$f":"E336","v":"TUPI [B]"},{"$f":"I336","v":"AABB/ACAFUMA [C]"}]
[null,265,null,null,"Flavio Scarpelli",5,"x",0,"Andre Brandao",{"$nulls":3},{"$f":"IF(F337&H337=\"WW\",0,IF(F337&H337=\"W0\",2,F337))","v":5},"V","D",{"$f":"IF(F337&H337=\"WW\",0,IF(F337&H337=\"0W\",2,H337))","v":0},null,null,"--",null,"--",null,{"$f":"W336","v":"TUPI [B]"},"AABB/ACAFUMA [C]"]
[null,266,null,null,"Paulo Ricardo Souza",1,"x",1,"Paulo Airton Junior",{"$nulls":3},1,"E","E",1,null,null,"--",null,"--",null,{"$f":"W336","v":"TUPI [B]"},"AABB/ACAFUMA [C]"]
[null,267,null,null,"Leandro Benicio",1,"x",2,"Simplicio Santos",{"$nulls":3},1,"D","V",2,null,null,"--",null,"--",null,"TUPI [B]","AABB/ACAFUMA [C]"]
[null,268,null,null,"Luiz Henrique Colla",0,"x",1,"Marcelo Silva",{"$nulls":3},0,"D","V",1,null,null,"--",null,"--",null,"TUPI [B]","AABB/ACAFUMA [C]"]
[{"v":68,"d":"068"},null,"2022-04-17","TP.02","CHACAL [A]",3,"x",0,"CHACAL [B]",null,{"$f":"IF(N341=\"V\",3,IF(N341=\"E\",1,0))","v":3},{"$f":"F341","v":3},{"$f":"SUM(M342:M345)","v":13},"V","D",{"$f":"SUM(P342:P345)","v":1},{"$f":"H341","v":0},{"$f":"IF(O341=\"V\",3,IF(O341=\"E\",1,0))","v":0},"--",null,"--",null,{"$f":"E341","v":"CHACAL [A]"},{"$f":"I341","v":"CHACAL [B]"}]
[null,269,null,null,"Janilson Pereira",4,"x",0,"Jefferson Rosa",{"$nulls":3},{"$f":"IF(F342&H342=\"WW\",0,IF(F342&H342=\"W0\",2,F342))","v":4},"V","D",{"$f":"IF(F342&H342=\"WW\",0,IF(F342&H342=\"0W\",2,H342))","v":0},null,null,"--",null,"--",null,{"$f":"W341","v":"CHACAL [A]"},"CHACAL [B]"]
[null,270,null,null,"Julio Celio Braga",5,"x",0,"Lucas Luna",{"$nulls":3},5,"V","D",0,null,null,"--",null,"--",null,{"$f":"W341","v":"CHACAL [A]"},"CHACAL [B]"]
[null,271,null,null,"Paulo Mangia",1,"x",1,"Rodolfo Magalhaes",{"$nulls":3},1,"E","E",1,null,null,"--",null,"--",null,"CHACAL [A]","CHACAL [B]"]
[null,272,null,null,"Thiago Stephan",3,"x",0,"Vanderley da Silva",{"$nulls":3},3,"V","D",0,null,null,"--",null,"--",null,"CHACAL [A]","CHACAL [B]"]
[{"v":69,"d":"069"},null,"2022-04-17","TP.03","AABB/ACAFUMA [B]",2,"x",1,"GRÊMIO MINEIRO",null,{"$f":"IF(N346=\"V\",3,IF(N346=\"E\",1,0))","v":3},{"$f":"F346","v":2},{"$f":"SUM(M347:M350)","v":7},"V","D",{"$f":"SUM(P347:P350)","v":2},{"$f":"H346","v":1},{"$f":"IF(O346=\"V\",3,IF(O346=\"E\",1,0))","v":0},"--",null,{"$f":"IF($X$3=\"BOTONISTA\",(IF($U$3=E346,$U$3,IF($U$3=I346,$U$3,\"--\"))),IF($X$3=\"EQUIPE\",(IF($U$3=W346,$U$3,IF($U$3=X346,$U$3,\"--\"))),\"--\"))","v":"--"},null,{"$f":"E346","v":"AABB/ACAFUMA [B]"},{"$f":"I346","v":"GRÊMIO MINEIRO"}]
[null,273,null,null,"Adolpho Parente",2,"x",1,"Vander Felipe",{"$nulls":3},{"$f":"IF(F347&H347=\"WW\",0,IF(F347&H347=\"W0\",2,F347))","v":2},"V","D",{"$f":"IF(F347&H347=\"WW\",0,IF(F347&H347=\"0W\",2,H347))","v":1},null,null,{"$f":"IF(LEFT(E347,7)=\"\",\"AUS\"&+IF(B347>0,\"IND\",\"\"),IF(LEFT(I347,7)=\"\",\"AUS\"&+IF(B347>0,\"IND\",\"\"),IF(LEFT(E347,7)=\"Ausente\",\"AUS\"&+IF(B347>0,\"IND\",\"\"),IF(LEFT(I347,7)=\"Ausente\",\"AUS\"&+IF(B347>0,\"IND\",\"\"),IF(RIGHT(F347,1)=\"*\",\"NULO\"&+IF(B347>0,\"IND\",\"\"),IF(F347&H347=\"----\",\"NULO\"&+IF(B347>0,\"IND\",\"\"),IF(F347&H347=\"W0\",\"W0\"&+IF(B347>0,\"IND\",\"\"),IF(F347&H347=\"0W\",\"W0\"&+IF(B347>0,\"IND\",\"\"),IF(F347&H347=\"WW\",\"WW\"&+IF(B347>0,\"IND\",\"\"),\"--\")))))))))","v":"--"},null,"--",null,{"$f":"W346","v":"AABB/ACAFUMA [B]"},"GRÊMIO MINEIRO"]
[null,274,null,null,"Paulo Cesar Faria",0,"x",0,"Gustavo Lopes",{"$nulls":3},0,"E","E",0,null,null,"--",null,"--",null,{"$f":"W346","v":"AABB/ACAFUMA [B]"},"GRÊMIO MINEIRO"]
[null,275,null,null,"Rodrigo Caruso",0,"x",1,"Fernando Vianna",{"$nulls":3},0,"D","V",1,null,null,"--",null,"--",null,"AABB/ACAFUMA [B]","GRÊMIO MINEIRO"]
[null,276,null,null,"Alcides Figueira",5,"x",0,"Rodrigo Primola",{"$nulls":3},5,"V","D",0,null,null,"--",null,"--",null,"AABB/ACAFUMA [B]","GRÊMIO MINEIRO"]
[{"v":70,"d":"070"},null,"2022-04-17",{"v":5,"d":"05"},"TUPI [A]",3,"x",1,"AABB/ACAFUMA [C]",null,{"$f":"IF(N351=\"V\",3,IF(N351=\"E\",1,0))","v":3},{"$f":"F351","v":3},{"$f":"SUM(M352:M355)","v":8},"V","D",{"$f":"SUM(P352:P355)","v":4},{"$f":"H351","v":1},{"$f":"IF(O351=\"V\",3,IF(O351=\"E\",1,0))","v":0},"--",null,"--",null,{"$f":"E351","v":"TUPI [A]"},{"$f":"I351","v":"AABB/ACAFUMA [C]"}]
[null,277,null,null,"Paulo Marcos de França",2,"x",0,"Andre Brandao",{"$nulls":3},{"$f":"IF(F352&H352=\"WW\",0,IF(F352&H352=\"W0\",2,F352))","v":2},"V","D",{"$f":"IF(F352&H352=\"WW\",0,IF(F352&H352=\"0W\",2,H352))","v":0},null,null,"--",null,"--",null,{"$f":"W351","v":"TUPI [A]"},"AABB/ACAFUMA [C]"]
[null,278,null,null,"Carlos Antonio Miranda",2,"x",1,"Paulo Airton Junior",{"$nulls":3},2,"V","D",1,null,null,"--",null,"--",null,{"$f":"W351","v":"TUPI [A]"},"AABB/ACAFUMA [C]"]
[null,279,null,null,"Marcus Monteiro",1,"x",3,"Simplicio Santos",{"$nulls":3},1,"D","V",3,null,null,"--",null,"--",null,"TUPI [A]","AABB/ACAFUMA [C]"]
[null,280,null,null,"Leonardo Stumpf",3,"x",0,"Marcelo Silva",{"$nulls":3},3,"V","D",0,null,null,"--",null,"--",null,"TUPI [A]","AABB/ACAFUMA [C]"]
[{"v":71,"d":"071"},null,"2022-04-17",{"v":6,"d":"06"},"LIBERDADE [A]",1,"x",0,"VASCO DA GAMA",null,{"$f":"IF(N356=\"V\",3,IF(N356=\"E\",1,0))","v":3},{"$f":"F356","v":1},{"$f":"SUM(M357:M360)","v":3},"V","D",{"$f":"SUM(P357:P360)","v":2},{"$f":"H356","v":0},{"$f":"IF(O356=\"V\",3,IF(O356=\"E\",1,0))","v":0},{"$f":"IF(LEFT(E356,7)=\"\",\"AUS\"&+IF(B356>0,\"IND\",\"\"),IF(LEFT(I356,7)=\"\",\"AUS\"&+IF(B356>0,\"IND\",\"\"),IF(LEFT(E356,7)=\"Ausente\",\"AUS\"&+IF(B356>0,\"IND\",\"\"),IF(LEFT(I356,7)=\"Ausente\",\"AUS\"&+IF(B356>0,\"IND\",\"\"),IF(RIGHT(F356,1)=\"*\",\"NULO\"&+IF(B356>0,\"IND\",\"\"),IF(F356&H356=\"----\",\"NULO\"&+IF(B356>0,\"IND\",\"\"),IF(F356&H356=\"W0\",\"W0\"&+IF(B356>0,\"IND\",\"\"),IF(F356&H356=\"0W\",\"W0\"&+IF(B356>0,\"IND\",\"\"),IF(F356&H356=\"WW\",\"WW\"&+IF(B356>0,\"IND\",\"\"),\"--\")))))))))","v":"--"},null,{"$f":"IF($X$3=\"BOTONISTA\",(IF($U$3=E356,$U$3,IF($U$3=I356,$U$3,\"--\"))),IF($X$3=\"EQUIPE\",(IF($U$3=W356,$U$3,IF($U$3=X356,$U$3,\"--\"))),\"--\"))","v":"--"},null,{"$f":"E356","v":"LIBERDADE [A]"},{"$f":"I356","v":"VASCO DA GAMA"}]
[null,281,null,null,"Lorival Ribeiro",1,"x",1,"Eder Patrocinio",{"$nulls":3},{"$f":"IF(F357&H357=\"WW\",0,IF(F357&H357=\"W0\",2,F357))","v":1},"E","E",{"$f":"IF(F357&H357=\"WW\",0,IF(F357&H357=\"0W\",2,H357))","v":1},null,null,"--",null,"--",null,{"$f":"W356","v":"LIBERDADE [A]"},"VASCO DA GAMA"]
[null,282,null,null,"Carlos Henrique Garcia",1,"x",1,"Fernando Ferreira",{"$nulls":3},1,"E","E",1,null,null,"--",null,"--",null,{"$f":"W356","v":"LIBERDADE [A]"},"VASCO DA GAMA"]
[null,283,null,null,"Breno Ribeiro",1,"x",0,"Evandro Gomes",{"$nulls":3},1,"V","D",0,null,null,"--",null,"--",null,{"$f":"W357","v":"LIBERDADE [A]"},"VASCO DA GAMA"]
[null,284,null,null,"Leonardo Duguet",0,"x",0,"Eduardo Costa",{"$nulls":3},0,"E","E",0,null,null,"--",null,"--",null,{"$f":"W358","v":"LIBERDADE [A]"},"VASCO DA GAMA"]
[{"v":72,"d":"072"},null,"2022-04-17",{"v":7,"d":"07"},"BOTAFOGO",1,"x",2,"MATIAS [A]",null,{"$f":"IF(N361=\"V\",3,IF(N361=\"E\",1,0))","v":0},{"$f":"F361","v":1},{"$f":"SUM(M362:M365)","v":3},"D","V",{"$f":"SUM(P362:P365)","v":5},{"$f":"H361","v":2},{"$f":"IF(O361=\"V\",3,IF(O361=\"E\",1,0))","v":3},"--",null,"--",null,{"$f":"E361","v":"BOTAFOGO"},{"$f":"I361","v":"MATIAS [A]"}]
[null,285,null,null,"Sergio Falcometa",3,"x",2,"Leonardo de Oliveira",{"$nulls":3},{"$f":"IF(F362&H362=\"WW\",0,IF(F362&H362=\"W0\",2,F362))","v":3},"V","D",{"$f":"IF(F362&H362=\"WW\",0,IF(F362&H362=\"0W\",2,H362))","v":2},null,null,"--",null,"--",null,{"$f":"W361","v":"BOTAFOGO"},"MATIAS [A]"]
[null,286,null,null,"Altanir Junior",0,"x",2,"Brunno Gill",{"$nulls":3},0,"D","V",2,null,null,"--",null,"--",null,{"$f":"W361","v":"BOTAFOGO"},"MATIAS [A]"]
[null,287,null,null,"Diego Americo",0,"x",0,"Marcelo Henrique",{"$nulls":3},0,"E","E",0,null,null,"--",null,"--",null,{"$f":"W362","v":"BOTAFOGO"},"MATIAS [A]"]
[null,288,null,null,"Renato Negreiros",0,"x",1,"Jose Lessa",{"$nulls":3},0,"D","V",1,null,null,"--",null,"--",null,{"$f":"W363","v":"BOTAFOGO"},"MATIAS [A]"]
[{"v":73,"d":"073"},null,"2022-04-17",{"v":8,"d":"08"},"UNIÃO INDEPENDENTE/UBERABA",1,"x",1,"LIBERDADE [B]",null,{"$f":"IF(N366=\"V\",3,IF(N366=\"E\",1,0))","v":1},{"$f":"F366","v":1},{"$f":"SUM(M367:M370)","v":2},"E","E",{"$f":"SUM(P367:P370)","v":2},{"$f":"H366","v":1},{"$f":"IF(O366=\"V\",3,IF(O366=\"E\",1,0))","v":1},"--",null,"--",null,{"$f":"E366","v":"UNIÃO INDEPENDENTE/UBERABA"},{"$f":"I366","v":"LIBERDADE [B]"}]
[null,289,null,null,"Emerson Claudino",0,"x",0,"Rafael Pena",{"$nulls":3},{"$f":"IF(F367&H367=\"WW\",0,IF(F367&H367=\"W0\",2,F367))","v":0},"E","E",{"$f":"IF(F367&H367=\"WW\",0,IF(F367&H367=\"0W\",2,H367))","v":0},null,null,"--",null,"--",null,{"$f":"W366","v":"UNIÃO INDEPENDENTE/UBERABA"},"LIBERDADE [B]"]
[null,290,null,null,"Juliano Gomes",1,"x",1,"Luiz Carlos Guerra",{"$nulls":3},1,"E","E",1,null,null,"--",null,"--",null,{"$f":"W366","v":"UNIÃO INDEPENDENTE/UBERABA"},"LIBERDADE [B]"]
[null,291,null,null,"Constancio Moura",1,"x",0,"Marcelo Virgilio",{"$nulls":3},1,"V","D",0,null,null,"--",null,"--",null,{"$f":"W367","v":"UNIÃO INDEPENDENTE/UBERABA"},"LIBERDADE [B]"]
[null,292,null,null,"Luiz Humberto",0,"x",1,"Joao Eduardo Pereira",{"$nulls":3},0,"D","V",1,null,null,"--",null,"--",null,{"$f":"W368","v":"UNIÃO INDEPENDENTE/UBERABA"},"LIBERDADE [B]"]
[{"v":74,"d":"074"},null,"2022-04-17",{"v":9,"d":"09"},"TUPI [A]",2,"x",0,"UNIÃO INDEPENDENTE/UBERABA",null,{"$f":"IF(N371=\"V\",3,IF(N371=\"E\",1,0))","v":3},{"$f":"F371","v":2},{"$f":"SUM(M372:M375)","v":2},"V","D",{"$f":"SUM(P372:P375)","v":0},{"$f":"H371","v":0},{"$f":"IF(O371=\"V\",3,IF(O371=\"E\",1,0))","v":0},"--",null,"--",null,{"$f":"E371","v":"TUPI [A]"},{"$f":"I371","v":"UNIÃO INDEPENDENTE/UBERABA"}]
[null,293,null,null,"Leonardo Stumpf",1,"x",0,"Juliano Gomes",{"$nulls":3},{"$f":"IF(F372&H372=\"WW\",0,IF(F372&H372=\"W0\",2,F372))","v":1},"V","D",{"$f":"IF(F372&H372=\"WW\",0,IF(F372&H372=\"0W\",2,H372))","v":0},null,null,"--",null,"--",null,{"$f":"W371","v":"TUPI [A]"},"UNIÃO INDEPENDENTE/UBERABA"]
[null,294,null,null,"Paulo Marcos de França",0,"x",0,"Constancio Moura",{"$nulls":3},0,"E","E",0,null,null,"--",null,"--",null,{"$f":"W371","v":"TUPI [A]"},"UNIÃO INDEPENDENTE/UBERABA"]
[null,295,null,null,"Marcus Monteiro",0,"x",0,"Luiz Humberto",{"$nulls":3},0,"E","E",0,null,null,"--",null,"--",null,{"$f":"W372","v":"TUPI [A]"},"UNIÃO INDEPENDENTE/UBERABA"]
[null,296,null,null,"Carlos Antonio Miranda",1,"x",0,"Emerson Claudino",{"$nulls":3},1,"V","D",0,null,null,"--",null,"--",null,{"$f":"W373","v":"TUPI [A]"},"UNIÃO INDEPENDENTE/UBERABA"]
[{"v":75,"d":"075"},null,"2022-04-17",10,"LIBERDADE [A]",3,"x",0,"MATIAS [A]",null,{"$f":"IF(N376=\"V\",3,IF(N376=\"E\",1,0))","v":3},{"$f":"F376","v":3},{"$f":"SUM(M377:M380)","v":4},"V","D",{"$f":"SUM(P377:P380)","v":0},{"$f":"H376","v":0},{"$f":"IF(O376=\"V\",3,IF(O376=\"E\",1,0))","v":0},"--",null,"--",null,{"$f":"E376","v":"LIBERDADE [A]"},{"$f":"I376","v":"MATIAS [A]"}]
[null,297,null,null,"Lorival Ribeiro",1,"x",0,"Leonardo de Oliveira",{"$nulls":3},{"$f":"IF(F377&H377=\"WW\",0,IF(F377&H377=\"W0\",2,F377))","v":1},"V","D",{"$f":"IF(F377&H377=\"WW\",0,IF(F377&H377=\"0W\",2,H377))","v":0},null,null,"--",null,"--",null,{"$f":"W376","v":"LIBERDADE [A]"},"MATIAS [A]"]
[null,298,null,null,"Breno Ribeiro",0,"x",0,"Jose Lessa",{"$nulls":3},0,"E","E",0,null,null,"--",null,"--",null,{"$f":"W376","v":"LIBERDADE [A]"},"MATIAS [A]"]
[null,299,null,null,"Carlos Henrique Garcia",2,"x",0,"Marcelo Henrique",{"$nulls":3},2,"V","D",0,null,null,"--",null,"--",null,{"$f":"W377","v":"LIBERDADE [A]"},"MATIAS [A]"]
[null,300,null,null,"Leonardo Duguet",1,"x",0,"Brunno Gill",{"$nulls":3},1,"V","D",0,null,null,"--",null,"--",null,{"$f":"W378","v":"LIBERDADE [A]"},"MATIAS [A]"]
[{"v":76,"d":"076"},null,"2022-04-17","TP.04","COMARY",2,"x",0,"ELDORADO",null,{"$f":"IF(N381=\"V\",3,IF(N381=\"E\",1,0))","v":3},{"$f":"F381","v":2},{"$f":"SUM(M382:M385)","v":5},"V","D",{"$f":"SUM(P382:P385)","v":3},{"$f":"H381","v":0},{"$f":"IF(O381=\"V\",3,IF(O381=\"E\",1,0))","v":0},"--",null,"--",null,{"$f":"E381","v":"COMARY"},{"$f":"I381","v":"ELDORADO"}]
[null,301,null,null,"Eduardo Tavares",1,"x",0,"Bernardo Pires",{"$nulls":3},{"$f":"IF(F382&H382=\"WW\",0,IF(F382&H382=\"W0\",2,F382))","v":1},"V","D",{"$f":"IF(F382&H382=\"WW\",0,IF(F382&H382=\"0W\",2,H382))","v":0},null,null,"--",null,"--",null,{"$f":"W381","v":"COMARY"},"ELDORADO"]
[null,302,null,null,"Igor Guarilha",1,"x",0,"Jose Pires",{"$nulls":3},1,"V","D",0,null,null,"--",null,"--",null,{"$f":"W381","v":"COMARY"},"ELDORADO"]
[null,303,null,null,"Ricardo Machado",1,"x",1,"Jorge Dias",{"$nulls":3},1,"E","E",1,null,null,"--",null,"--",null,{"$f":"W382","v":"COMARY"},"ELDORADO"]
[null,304,null,null,"Pablo Sidarta",2,"x",2,"Alex Lage",{"$nulls":3},2,"E","E",2,null,null,"--",null,"--",null,{"$f":"W383","v":"COMARY"},"ELDORADO"]
[{"v":77,"d":"077"},null,"2022-04-17","TP.05","AABB/ACAFUMA [B]",3,"x",1,"CHACAL [A]",null,{"$f":"IF(N386=\"V\",3,IF(N386=\"E\",1,0))","v":3},{"$f":"F386","v":3},{"$f":"SUM(M387:M390)","v":7},"V","D",{"$f":"SUM(P387:P390)","v":3},{"$f":"H386","v":1},{"$f":"IF(O386=\"V\",3,IF(O386=\"E\",1,0))","v":0},"--",null,"--",null,{"$f":"E386","v":"AABB/ACAFUMA [B]"},{"$f":"I386","v":"CHACAL [A]"}]
[null,305,null,null,"Adolpho Parente",0,"x",1,"Thiago Stephan",{"$nulls":3},{"$f":"IF(F387&H387=\"WW\",0,IF(F387&H387=\"W0\",2,F387))","v":0},"D","V",{"$f":"IF(F387&H387=\"WW\",0,IF(F387&H387=\"0W\",2,H387))","v":1},null,null,"--",null,"--",null,{"$f":"W386","v":"AABB/ACAFUMA [B]"},"CHACAL [A]"]
[null,306,null,null,"Paulo Cesar Faria",2,"x",1,"Janilson Pereira",{"$nulls":3},2,"V","D",1,null,null,"--",null,"--",null,{"$f":"W386","v":"AABB/ACAFUMA [B]"},"CHACAL [A]"]
[null,307,null,null,"Marcelo Ferreira",1,"x",0,"Paulo Mangia",{"$nulls":3},1,"V","D",0,null,null,"--",null,"--",null,{"$f":"W387","v":"AABB/ACAFUMA [B]"},"CHACAL [A]"]
[null,308,null,null,"Alcides Figueira",4,"x",1,"Julio Celio Braga",{"$nulls":3},4,"V","D",1,null,null,"--",null,"--",null,{"$f":"W388","v":"AABB/ACAFUMA [B]"},"CHACAL [A]"]
[{"v":78,"d":"078"},null,"2022-04-17","TP.06","COMARY",0,"x",3,"AABB/ACAFUMA [B]",null,{"$f":"IF(N391=\"V\",3,IF(N391=\"E\",1,0))","v":0},{"$f":"F391","v":0},{"$f":"SUM(M392:M395)","v":3},"D","V",{"$f":"SUM(P392:P395)","v":7},{"$f":"H391","v":3},{"$f":"IF(O391=\"V\",3,IF(O391=\"E\",1,0))","v":3},"--",null,"--",null,{"$f":"E391","v":"COMARY"},{"$f":"I391","v":"AABB/ACAFUMA [B]"}]
[null,309,null,null,"Marco Andre Veloso",0,"x",1,"Paulo Cesar Faria",{"$nulls":3},{"$f":"IF(F392&H392=\"WW\",0,IF(F392&H392=\"W0\",2,F392))","v":0},"D","V",{"$f":"IF(F392&H392=\"WW\",0,IF(F392&H392=\"0W\",2,H392))","v":1},null,null,"--",null,"--",null,{"$f":"W391","v":"COMARY"},"AABB/ACAFUMA [B]"]
[null,310,null,null,"Igor Guarilha",1,"x",3,"Alcides Figueira",{"$nulls":3},1,"D","V",3,null,null,"--",null,"--",null,{"$f":"W391","v":"COMARY"},"AABB/ACAFUMA [B]"]
[null,311,null,null,"Pablo Sidarta",1,"x",2,"Adolpho Parente",{"$nulls":3},1,"D","V",2,null,null,"--",null,"--",null,{"$f":"W392","v":"COMARY"},"AABB/ACAFUMA [B]"]
[null,312,null,null,"Eduardo Tavares",1,"x",1,"Marcelo Ferreira",{"$nulls":3},1,"E","E",1,null,null,"--",null,"--",null,{"$f":"W393","v":"COMARY"},"AABB/ACAFUMA [B]"]
[{"v":79,"d":"079"},null,"2022-04-17",11,"TUPI [A]",1,"x",2,"LIBERDADE [A]",null,{"$f":"IF(N396=\"V\",3,IF(N396=\"E\",1,0))","v":0},{"$f":"F396","v":1},{"$f":"SUM(M397:M400)","v":5},{"$f":"IF(F396&+H396=\"WW\",\"D\",IF(F396>H396,\"V\",IF(F396=H396,\"E\",\"D\")))","v":"D"},{"$f":"IF(F396&+H396=\"WW\",\"D\",IF(F396<H396,\"V\",IF(F396=H396,\"E\",\"D\")))","v":"V"},{"$f":"SUM(P397:P400)","v":5},{"$f":"H396","v":2},{"$f":"IF(O396=\"V\",3,IF(O396=\"E\",1,0))","v":3},"--",null,"--",null,{"$f":"E396","v":"TUPI [A]"},{"$f":"I396","v":"LIBERDADE [A]"}]
[null,313,null,null,"Marcus Monteiro",1,"x",1,"Breno Ribeiro",{"$nulls":3},{"$f":"IF(F397&H397=\"WW\",0,IF(F397&H397=\"W0\",2,F397))","v":1},"E","E",{"$f":"IF(F397&H397=\"WW\",0,IF(F397&H397=\"0W\",2,H397))","v":1},null,null,"--",null,"--",null,{"$f":"W396","v":"TUPI [A]"},"LIBERDADE [A]"]
[null,314,null,null,"Paulo Marcos de França",2,"x",0,"Carlos Henrique Garcia",{"$nulls":3},2,"V","D",0,null,null,"--",null,"--",null,{"$f":"W396","v":"TUPI [A]"},"LIBERDADE [A]"]
[null,315,null,null,"Leonardo Stumpf",2,"x",3,"Lorival Ribeiro",{"$nulls":3},2,"D","V",3,null,null,"--",null,"--",null,{"$f":"W397","v":"TUPI [A]"},"LIBERDADE [A]"]
[null,316,null,null,"Carlos Antonio Miranda",0,"x",1,"Leonardo Duguet",{"$nulls":3},0,"D","V",1,null,null,"--",null,"--",null,{"$f":"W398","v":"TUPI [A]"},"LIBERDADE [A]"]

{"sheet":"ClaFIN","index":5,"n_rows":106,"n_cols":15,"rows_kept":106,"merged":[[4,0,61,0],[62,0,105,0]]}
[{"$f":"Info!A1","v":"XL CAMPEONATO BRASILEIRO INTERCLUBES / 2022"}]
[{"$f":"Info!A2","v":"Matias Barbosa / MG, 15 a 17 de abril de 2022"}]
[]
["CLASSIFICAÇÃO FINAL",null,null,"PG","V","E","D","GP","GC","SG","GPI","GCI","SGI","J","REND"]
["TAÇA DE OURO ",{"v":1,"d":"1º"},"LIBERDADE [A]",{"$f":"SUMIFS(ClaOUR!D:D,ClaOUR!$C:$C,$C5)+SUMIFS(ClaPRA!D:D,ClaPRA!$C:$C,$C5)","v":28},{"$f":"SUMIFS(ClaOUR!E:E,ClaOUR!$C:$C,$C5)+SUMIFS(ClaPRA!E:E,ClaPRA!$C:$C,$C5)","v":9},{"$f":"SUMIFS(ClaOUR!F:F,ClaOUR!$C:$C,$C5)+SUMIFS(ClaPRA!F:F,ClaPRA!$C:$C,$C5)","v":1},{"$f":"SUMIFS(ClaOUR!G:G,ClaOUR!$C:$C,$C5)+SUMIFS(ClaPRA!G:G,ClaPRA!$C:$C,$C5)","v":0},{"$f":"SUMIFS(ClaOUR!H:H,ClaOUR!$C:$C,$C5)+SUMIFS(ClaPRA!H:H,ClaPRA!$C:$C,$C5)","v":25},{"$f":"SUMIFS(ClaOUR!I:I,ClaOUR!$C:$C,$C5)+SUMIFS(ClaPRA!I:I,ClaPRA!$C:$C,$C5)","v":6},{"$f":"SUMIFS(ClaOUR!J:J,ClaOUR!$C:$C,$C5)+SUMIFS(ClaPRA!J:J,ClaPRA!$C:$C,$C5)","v":19},{"$f":"SUMIFS(ClaOUR!K:K,ClaOUR!$C:$C,$C5)+SUMIFS(ClaPRA!K:K,ClaPRA!$C:$C,$C5)","v":62},{"$f":"SUMIFS(ClaOUR!L:L,ClaOUR!$C:$C,$C5)+SUMIFS(ClaPRA!L:L,ClaPRA!$C:$C,$C5)","v":28},{"$f":"SUMIFS(ClaOUR!M:M,ClaOUR!$C:$C,$C5)+SUMIFS(ClaPRA!M:M,ClaPRA!$C:$C,$C5)","v":34},{"$f":"SUM(E5:G5)","v":10},{"$f":"D5/(N5*3)","v":{"v":0.9333333333333333,"d":"93.3%"}}]
[null,null,"Breno Ribeiro",{"$f":"IF(N6=0,-0.001,E6*3+F6)","v":20},{"$f":"COUNTIFS(Jogos!$E:$E,$C6,Jogos!$N:$N,\"V\")+COUNTIFS(Jogos!$I:$I,$C6,Jogos!$O:$O,\"V\")","v":6},{"$f":"COUNTIFS(Jogos!$E:$E,$C6,Jogos!$N:$N,\"E\")+COUNTIFS(Jogos!$I:$I,$C6,Jogos!$O:$O,\"E\")","v":2},{"$f":"COUNTIFS(Jogos!$E:$E,$C6,Jogos!$N:$N,\"D\")+COUNTIFS(Jogos!$I:$I,$C6,Jogos!$O:$O,\"D\")","v":2},{"$f":"SUMIFS(Jogos!$F:$F,Jogos!$E:$E,$C6)+SUMIFS(Jogos!$H:$H,Jogos!$I:$I,$C6)","v":13},{"$f":"SUMIFS(Jogos!$H:$H,Jogos!$E:$E,$C6)+SUMIFS(Jogos!$F:$F,Jogos!$I:$I,$C6)+COUNTIFS(Jogos!$S:$S,\"WWIND\",Jogos!$E:$E,$C6)*2+COUNTIFS(Jogos!$S:$S,\"WWIND\",Jogos!$I:$I,$C6)*2","v":7},{"$f":"H6-I6","v":6},{"$nulls":3},10,{"$f":"IF(N6=0,-0.00001,D6/(N6*3))","v":{"v":0.6666666666666666,"d":"66.7%"}}]
[null,null,"Carlos Henrique Garcia",{"$f":"IF(N7=0,-0.001,E7*3+F7)","v":20},{"$f":"COUNTIFS(Jogos!$E:$E,$C7,Jogos!$N:$N,\"V\")+COUNTIFS(Jogos!$I:$I,$C7,Jogos!$O:$O,\"V\")","v":6},{"$f":"COUNTIFS(Jogos!$E:$E,$C7,Jogos!$N:$N,\"E\")+COUNTIFS(Jogos!$I:$I,$C7,Jogos!$O:$O,\"E\")","v":2},{"$f":"COUNTIFS(Jogos!$E:$E,$C7,Jogos!$N:$N,\"D\")+COUNTIFS(Jogos!$I:$I,$C7,Jogos!$O:$O,\"D\")","v":2},{"$f":"SUMIFS(Jogos!$F:$F,Jogos!$E:$E,$C7)+SUMIFS(Jogos!$H:$H,Jogos!$I:$I,$C7)","v":19},{"$f":"SUMIFS(Jogos!$H:$H,Jogos!$E:$E,$C7)+SUMIFS(Jogos!$F:$F,Jogos!$I:$I,$C7)+COUNTIFS(Jogos!$S:$S,\"WWIND\",Jogos!$E:$E,$C7)*2+COUNTIFS(Jogos!$S:$S,\"WWIND\",Jogos!$I:$I,$C7)*2","v":7},{"$f":"H7-I7","v":12},{"$nulls":3},10,{"$f":"IF(N7=0,-0.00001,D7/(N7*3))","v":{"v":0.6666666666666666,"d":"66.7%"}}]
[null,null,"Leonardo Duguet",{"$f":"IF(N8=0,-0.001,E8*3+F8)","v":19},{"$f":"COUNTIFS(Jogos!$E:$E,$C8,Jogos!$N:$N,\"V\")+COUNTIFS(Jogos!$I:$I,$C8,Jogos!$O:$O,\"V\")","v":6},{"$f":"COUNTIFS(Jogos!$E:$E,$C8,Jogos!$N:$N,\"E\")+COUNTIFS(Jogos!$I:$I,$C8,Jogos!$O:$O,\"E\")","v":1},{"$f":"COUNTIFS(Jogos!$E:$E,$C8,Jogos!$N:$N,\"D\")+COUNTIFS(Jogos!$I:$I,$C8,Jogos!$O:$O,\"D\")","v":1},{"$f":"SUMIFS(Jogos!$F:$F,Jogos!$E:$E,$C8)+SUMIFS(Jogos!$H:$H,Jogos!$I:$I,$C8)","v":10},{"$f":"SUMIFS(Jogos!$H:$H,Jogos!$E:$E,$C8)+SUMIFS(Jogos!$F:$F,Jogos!$I:$I,$C8)+COUNTIFS(Jogos!$S:$S,\"WWIND\",Jogos!$E:$E,$C8)*2+COUNTIFS(Jogos!$S:$S,\"WWIND\",Jogos!$I:$I,$C8)*2","v":5},{"$f":"H8-I8","v":5},{"$nulls":3},8,{"$f":"IF(N8=0,-0.00001,D8/(N8*3))","v":{"v":0.7916666666666666,"d":"79.2%"}}]
[null,null,"Lorival Ribeiro",{"$f":"IF(N9=0,-0.001,E9*3+F9)","v":23},{"$f":"COUNTIFS(Jogos!$E:$E,$C9,Jogos!$N:$N,\"V\")+COUNTIFS(Jogos!$I:$I,$C9,Jogos!$O:$O,\"V\")","v":7},{"$f":"COUNTIFS(Jogos!$E:$E,$C9,Jogos!$N:$N,\"E\")+COUNTIFS(Jogos!$I:$I,$C9,Jogos!$O:$O,\"E\")","v":2},{"$f":"COUNTIFS(Jogos!$E:$E,$C9,Jogos!$N:$N,\"D\")+COUNTIFS(Jogos!$I:$I,$C9,Jogos!$O:$O,\"D\")","v":0},{"$f":"SUMIFS(Jogos!$F:$F,Jogos!$E:$E,$C9)+SUMIFS(Jogos!$H:$H,Jogos!$I:$I,$C9)","v":19},{"$f":"SUMIFS(Jogos!$H:$H,Jogos!$E:$E,$C9)+SUMIFS(Jogos!$F:$F,Jogos!$I:$I,$C9)+COUNTIFS(Jogos!$S:$S,\"WWIND\",Jogos!$E:$E,$C9)*2+COUNTIFS(Jogos!$S:$S,\"WWIND\",Jogos!$I:$I,$C9)*2","v":6},{"$f":"H9-I9","v":13},{"$nulls":3},9,{"$f":"IF(N9=0,-0.00001,D9/(N9*3))","v":{"v":0.8518518518518519,"d":"85.2%"}}]
[null,null,"Wendel Cordeiro",{"$f":"IF(N10=0,-0.001,E10*3+F10)","v":2},{"$f":"COUNTIFS(Jogos!$E:$E,$C10,Jogos!$N:$N,\"V\")+COUNTIFS(Jogos!$I:$I,$C10,Jogos!$O:$O,\"V\")","v":0},{"$f":"COUNTIFS(Jogos!$E:$E,$C10,Jogos!$N:$N,\"E\")+COUNTIFS(Jogos!$I:$I,$C10,Jogos!$O:$O,\"E\")","v":2},{"$f":"COUNTIFS(Jogos!$E:$E,$C10,Jogos!$N:$N,\"D\")+COUNTIFS(Jogos!$I:$I,$C10,Jogos!$O:$O,\"D\")","v":1},{"$f":"SUMIFS(Jogos!$F:$F,Jogos!$E:$E,$C10)+SUMIFS(Jogos!$H:$H,Jogos!$I:$I,$C10)","v":1},{"$f":"SUMIFS(Jogos!$H:$H,Jogos!$E:$E,$C10)+SUMIFS(Jogos!$F:$F,Jogos!$I:$I,$C10)+COUNTIFS(Jogos!$S:$S,\"WWIND\",Jogos!$E:$E,$C10)*2+COUNTIFS(Jogos!$S:$S,\"WWIND\",Jogos!$I:$I,$C10)*2","v":3},{"$f":"H10-I10","v":-2},{"$nulls":3},3,{"$f":"IF(N10=0,-0.00001,D10/(N10*3))","v":{"v":0.2222222222222222,"d":"22.2%"}}]
[null,{"v":2,"d":"2º"},"TUPI [A]",{"$f":"SUMIFS(ClaOUR!D:D,ClaOUR!$C:$C,$C11)+SUMIFS(ClaPRA!D:D,ClaPRA!$C:$C,$C11)","v":30},{"$f":"SUMIFS(ClaOUR!E:E,ClaOUR!$C:$C,$C11)+SUMIFS(ClaPRA!E:E,ClaPRA!$C:$C,$C11)","v":10},{"$f":"SUMIFS(ClaOUR!F:F,ClaOUR!$C:$C,$C11)+SUMIFS(ClaPRA!F:F,ClaPRA!$C:$C,$C11)","v":0},{"$f":"SUMIFS(ClaOUR!G:G,ClaOUR!$C:$C,$C11)+SUMIFS(ClaPRA!G:G,ClaPRA!$C:$C,$C11)","v":1},{"$f":"SUMIFS(ClaOUR!H:H,ClaOUR!$C:$C,$C11)+SUMIFS(ClaPRA!H:H,ClaPRA!$C:$C,$C11)","v":27},{"$f":"SUMIFS(ClaOUR!I:I,ClaOUR!$C:$C,$C11)+SUMIFS(ClaPRA!I:I,ClaPRA!$C:$C,$C11)","v":5},{"$f":"SUMIFS(ClaOUR!J:J,ClaOUR!$C:$C,$C11)+SUMIFS(ClaPRA!J:J,ClaPRA!$C:$C,$C11)","v":22},{"$f":"SUMIFS(ClaOUR!K:K,ClaOUR!$C:$C,$C11)+SUMIFS(ClaPRA!K:K,ClaPRA!$C:$C,$C11)","v":72},{"$f":"SUMIFS(ClaOUR!L:L,ClaOUR!$C:$C,$C11)+SUMIFS(ClaPRA!L:L,ClaPRA!$C:$C,$C11)","v":31},{"$f":"SUMIFS(ClaOUR!M:M,ClaOUR!$C:$C,$C11)+SUMIFS(ClaPRA!M:M,ClaPRA!$C:$C,$C11)","v":41},{"$f":"SUM(E11:G11)","v":11},{"$f":"D11/(N11*3)","v":{"v":0.9090909090909091,"d":"90.9%"}}]
[null,null,"Carlos Antonio Miranda",{"$f":"IF(N12=0,-0.001,E12*3+F12)","v":20},{"$f":"COUNTIFS(Jogos!$E:$E,$C12,Jogos!$N:$N,\"V\")+COUNTIFS(Jogos!$I:$I,$C12,Jogos!$O:$O,\"V\")","v":6},{"$f":"COUNTIFS(Jogos!$E:$E,$C12,Jogos!$N:$N,\"E\")+COUNTIFS(Jogos!$I:$I,$C12,Jogos!$O:$O,\"E\")","v":2},{"$f":"COUNTIFS(Jogos!$E:$E,$C12,Jogos!$N:$N,\"D\")+COUNTIFS(Jogos!$I:$I,$C12,Jogos!$O:$O,\"D\")","v":1},{"$f":"SUMIFS(Jogos!$F:$F,Jogos!$E:$E,$C12)+SUMIFS(Jogos!$H:$H,Jogos!$I:$I,$C12)","v":14},{"$f":"SUMIFS(Jogos!$H:$H,Jogos!$E:$E,$C12)+SUMIFS(Jogos!$F:$F,Jogos!$I:$I,$C12)+COUNTIFS(Jogos!$S:$S,\"WWIND\",Jogos!$E:$E,$C12)*2+COUNTIFS(Jogos!$S:$S,\"WWIND\",Jogos!$I:$I,$C12)*2","v":7},{"$f":"H12-I12","v":7},{"$nulls":3},9,{"$f":"IF(N12=0,-0.00001,D12/(N12*3))","v":{"v":0.7407407407407407,"d":"74.1%"}}]
[null,null,"Eduardo Guerra",{"$f":"IF(N13=0,-0.001,E13*3+F13)","v":10},{"$f":"COUNTIFS(Jogos!$E:$E,$C13,Jogos!$N:$N,\"V\")+COUNTIFS(Jogos!$I:$I,$C13,Jogos!$O:$O,\"V\")","v":3},{"$f":"COUNTIFS(Jogos!$E:$E,$C13,Jogos!$N:$N,\"E\")+COUNTIFS(Jogos!$I:$I,$C13,Jogos!$O:$O,\"E\")","v":1},{"$f":"COUNTIFS(Jogos!$E:$E,$C13,Jogos!$N:$N,\"D\")+COUNTIFS(Jogos!$I:$I,$C13,Jogos!$O:$O,\"D\")","v":0},{"$f":"SUMIFS(Jogos!$F:$F,Jogos!$E:$E,$C13)+SUMIFS(Jogos!$H:$H,Jogos!$I:$I,$C13)","v":9},{"$f":"SUMIFS(Jogos!$H:$H,Jogos!$E:$E,$C13)+SUMIFS(Jogos!$F:$F,Jogos!$I:$I,$C13)+COUNTIFS(Jogos!$S:$S,\"WWIND\",Jogos!$E:$E,$C13)*2+COUNTIFS(Jogos!$S:$S,\"WWIND\",Jogos!$I:$I,$C13)*2","v":3},{"$f":"H13-I13","v":6},{"$nulls":3},4,{"$f":"IF(N13=0,-0.00001,D13/(N13*3))","v":{"v":0.8333333333333334,"d":"83.3%"}}]
[null,null,"Leonardo Stumpf",{"$f":"IF(N14=0,-0.001,E14*3+F14)","v":23},{"$f":"COUNTIFS(Jogos!$E:$E,$C14,Jogos!$N:$N,\"V\")+COUNTIFS(Jogos!$I:$I,$C14,Jogos!$O:$O,\"V\")","v":7},{"$f":"COUNTIFS(Jogos!$E:$E,$C14,Jogos!$N:$N,\"E\")+COUNTIFS(Jogos!$I:$I,$C14,Jogos!$O:$O,\"E\")","v":2},{"$f":"COUNTIFS(Jogos!$E:$E,$C14,Jogos!$N:$N,\"D\")+COUNTIFS(Jogos!$I:$I,$C14,Jogos!$O:$O,\"D\")","v":2},{"$f":"SUMIFS(Jogos!$F:$F,Jogos!$E:$E,$C14)+SUMIFS(Jogos!$H:$H,Jogos!$I:$I,$C14)","v":23},{"$f":"SUMIFS(Jogos!$H:$H,Jogos!$E:$E,$C14)+SUMIFS(Jogos!$F:$F,Jogos!$I:$I,$C14)+COUNTIFS(Jogos!$S:$S,\"WWIND\",Jogos!$E:$E,$C14)*2+COUNTIFS(Jogos!$S:$S,\"WWIND\",Jogos!$I:$I,$C14)*2","v":9},{"$f":"H14-I14","v":14},{"$nulls":3},{"$f":"SUM(E14:G14)","v":11},{"$f":"IF(N14=0,-0.00001,D14/(N14*3))","v":{"v":0.696969696969697,"d":"69.7%"}}]
[null,null,"Marcus Monteiro",22,{"$f":"COUNTIFS(Jogos!$E:$E,$C15,Jogos!$N:$N,\"V\")+COUNTIFS(Jogos!$I:$I,$C15,Jogos!$O:$O,\"V\")","v":6},{"$f":"COUNTIFS(Jogos!$E:$E,$C15,Jogos!$N:$N,\"E\")+COUNTIFS(Jogos!$I:$I,$C15,Jogos!$O:$O,\"E\")","v":4},{"$f":"COUNTIFS(Jogos!$E:$E,$C15,Jogos!$N:$N,\"D\")+COUNTIFS(Jogos!$I:$I,$C15,Jogos!$O:$O,\"D\")","v":1},{"$f":"SUMIFS(Jogos!$F:$F,Jogos!$E:$E,$C15)+SUMIFS(Jogos!$H:$H,Jogos!$I:$I,$C15)","v":17},{"$f":"SUMIFS(Jogos!$H:$H,Jogos!$E:$E,$C15)+SUMIFS(Jogos!$F:$F,Jogos!$I:$I,$C15)+COUNTIFS(Jogos!$S:$S,\"WWIND\",Jogos!$E:$E,$C15)*2+COUNTIFS(Jogos!$S:$S,\"WWIND\",Jogos!$I:$I,$C15)*2","v":9},8,{"$nulls":3},11,{"v":0.6666666666666666,"d":"66.7%"}]
[null,null,"Paulo Marcos de França",18,{"$f":"COUNTIFS(Jogos!$E:$E,$C16,Jogos!$N:$N,\"V\")+COUNTIFS(Jogos!$I:$I,$C16,Jogos!$O:$O,\"V\")","v":5},{"$f":"COUNTIFS(Jogos!$E:$E,$C16,Jogos!$N:$N,\"E\")+COUNTIFS(Jogos!$I:$I,$C16,Jogos!$O:$O,\"E\")","v":3},{"$f":"COUNTIFS(Jogos!$E:$E,$C16,Jogos!$N:$N,\"D\")+COUNTIFS(Jogos!$I:$I,$C16,Jogos!$O:$O,\"D\")","v":1},{"$f":"SUMIFS(Jogos!$F:$F,Jogos!$E:$E,$C16)+SUMIFS(Jogos!$H:$H,Jogos!$I:$I,$C16)","v":9},{"$f":"SUMIFS(Jogos!$H:$H,Jogos!$E:$E,$C16)+SUMIFS(Jogos!$F:$F,Jogos!$I:$I,$C16)+COUNTIFS(Jogos!$S:$S,\"WWIND\",Jogos!$E:$E,$C16)*2+COUNTIFS(Jogos!$S:$S,\"WWIND\",Jogos!$I:$I,$C16)*2","v":3},6,{"$nulls":3},9,{"v":0.6666666666666666,"d":"66.7%"}]
[null,{"v":3,"d":"3º"},"MATIAS [A]",{"$f":"SUMIFS(ClaOUR!D:D,ClaOUR!$C:$C,$C17)+SUMIFS(ClaPRA!D:D,ClaPRA!$C:$C,$C17)","v":16},{"$f":"SUMIFS(ClaOUR!E:E,ClaOUR!$C:$C,$C17)+SUMIFS(ClaPRA!E:E,ClaPRA!$C:$C,$C17)","v":5},{"$f":"SUMIFS(ClaOUR!F:F,ClaOUR!$C:$C,$C17)+SUMIFS(ClaPRA!F:F,ClaPRA!$C:$C,$C17)","v":1},{"$f":"SUMIFS(ClaOUR!G:G,ClaOUR!$C:$C,$C17)+SUMIFS(ClaPRA!G:G,ClaPRA!$C:$C,$C17)","v":3},{"$f":"SUMIFS(ClaOUR!H:H,ClaOUR!$C:$C,$C17)+SUMIFS(ClaPRA!H:H,ClaPRA!$C:$C,$C17)","v":18},{"$f":"SUMIFS(ClaOUR!I:I,ClaOUR!$C:$C,$C17)+SUMIFS(ClaPRA!I:I,ClaPRA!$C:$C,$C17)","v":15},{"$f":"SUMIFS(ClaOUR!J:J,ClaOUR!$C:$C,$C17)+SUMIFS(ClaPRA!J:J,ClaPRA!$C:$C,$C17)","v":3},{"$f":"SUMIFS(ClaOUR!K:K,ClaOUR!$C:$C,$C17)+SUMIFS(ClaPRA!K:K,ClaPRA!$C:$C,$C17)","v":39},{"$f":"SUMIFS(ClaOUR!L:L,ClaOUR!$C:$C,$C17)+SUMIFS(ClaPRA!L:L,ClaPRA!$C:$C,$C17)","v":31},{"$f":"SUMIFS(ClaOUR!M:M,ClaOUR!$C:$C,$C17)+SUMIFS(ClaPRA!M:M,ClaPRA!$C:$C,$C17)","v":8},{"$f":"SUM(E17:G17)","v":9},{"$f":"D17/(N17*3)","v":{"v":0.5925925925925926,"d":"59.3%"}}]
[null,null,"Brunno Gill",{"$f":"IF(N18=0,-0.001,E18*3+F18)","v":18},{"$f":"COUNTIFS(Jogos!$E:$E,$C18,Jogos!$N:$N,\"V\")+COUNTIFS(Jogos!$I:$I,$C18,Jogos!$O:$O,\"V\")","v":6},{"$f":"COUNTIFS(Jogos!$E:$E,$C18,Jogos!$N:$N,\"E\")+COUNTIFS(Jogos!$I:$I,$C18,Jogos!$O:$O,\"E\")","v":0},{"$f":"COUNTIFS(Jogos!$E:$E,$C18,Jogos!$N:$N,\"D\")+COUNTIFS(Jogos!$I:$I,$C18,Jogos!$O:$O,\"D\")","v":3},{"$f":"SUMIFS(Jogos!$F:$F,Jogos!$E:$E,$C18)+SUMIFS(Jogos!$H:$H,Jogos!$I:$I,$C18)","v":12},{"$f":"SUMIFS(Jogos!$H:$H,Jogos!$E:$E,$C18)+SUMIFS(Jogos!$F:$F,Jogos!$I:$I,$C18)+COUNTIFS(Jogos!$S:$S,\"WWIND\",Jogos!$E:$E,$C18)*2+COUNTIFS(Jogos!$S:$S,\"WWIND\",Jogos!$I:$I,$C18)*2","v":6},{"$f":"H18-I18","v":6},{"$nulls":3},{"$f":"SUM(E18:G18)","v":9},{"$f":"IF(N18=0,-0.00001,D18/(N18*3))","v":{"v":0.6666666666666666,"d":"66.7%"}}]
[null,null,"Jose Lessa",{"$f":"IF(N19=0,-0.001,E19*3+F19)","v":19},{"$f":"COUNTIFS(Jogos!$E:$E,$C19,Jogos!$N:$N,\"V\")+COUNTIFS(Jogos!$I:$I,$C19,Jogos!$O:$O,\"V\")","v":6},{"$f":"COUNTIFS(Jogos!$E:$E,$C19,Jogos!$N:$N,\"E\")+COUNTIFS(Jogos!$I:$I,$C19,Jogos!$O:$O,\"E\")","v":1},{"$f":"COUNTIFS(Jogos!$E:$E,$C19,Jogos!$N:$N,\"D\")+COUNTIFS(Jogos!$I:$I,$C19,Jogos!$O:$O,\"D\")","v":2},{"$f":"SUMIFS(Jogos!$F:$F,Jogos!$E:$E,$C19)+SUMIFS(Jogos!$H:$H,Jogos!$I:$I,$C19)","v":12},{"$f":"SUMIFS(Jogos!$H:$H,Jogos!$E:$E,$C19)+SUMIFS(Jogos!$F:$F,Jogos!$I:$I,$C19)+COUNTIFS(Jogos!$S:$S,\"WWIND\",Jogos!$E:$E,$C19)*2+COUNTIFS(Jogos!$S:$S,\"WWIND\",Jogos!$I:$I,$C19)*2","v":7},{"$f":"H19-I19","v":5},{"$nulls":3},{"$f":"SUM(E19:G19)","v":9},{"$f":"IF(N19=0,-0.00001,D19/(N19*3))","v":{"v":0.7037037037037037,"d":"70.4%"}}]
[null,null,"Leonardo de Oliveira",{"$f":"IF(N20=0,-0.001,E20*3+F20)","v":12},{"$f":"COUNTIFS(Jogos!$E:$E,$C20,Jogos!$N:$N,\"V\")+COUNTIFS(Jogos!$I:$I,$C20,Jogos!$O:$O,\"V\")","v":4},{"$f":"COUNTIFS(Jogos!$E:$E,$C20,Jogos!$N:$N,\"E\")+COUNTIFS(Jogos!$I:$I,$C20,Jogos!$O:$O,\"E\")","v":0},{"$f":"COUNTIFS(Jogos!$E:$E,$C20,Jogos!$N:$N,\"D\")+COUNTIFS(Jogos!$I:$I,$C20,Jogos!$O:$O,\"D\")","v":5},{"$f":"SUMIFS(Jogos!$F:$F,Jogos!$E:$E,$C20)+SUMIFS(Jogos!$H:$H,Jogos!$I:$I,$C20)","v":10},{"$f":"SUMIFS(Jogos!$H:$H,Jogos!$E:$E,$C20)+SUMIFS(Jogos!$F:$F,Jogos!$I:$I,$C20)+COUNTIFS(Jogos!$S:$S,\"WWIND\",Jogos!$E:$E,$C20)*2+COUNTIFS(Jogos!$S:$S,\"WWIND\",Jogos!$I:$I,$C20)*2","v":11},{"$f":"H20-I20","v":-1},{"$nulls":3},{"$f":"SUM(E20:G20)","v":9},{"$f":"IF(N20=0,-0.00001,D20/(N20*3))","v":{"v":0.4444444444444444,"d":"44.4%"}}]
[null,null,"Marcelo Henrique",{"$f":"IF(N21=0,-0.001,E21*3+F21)","v":8},{"$f":"COUNTIFS(Jogos!$E:$E,$C21,Jogos!$N:$N,\"V\")+COUNTIFS(Jogos!$I:$I,$C21,Jogos!$O:$O,\"V\")","v":2},{"$f":"COUNTIFS(Jogos!$E:$E,$C21,Jogos!$N:$N,\"E\")+COUNTIFS(Jogos!$I:$I,$C21,Jogos!$O:$O,\"E\")","v":2},{"$f":"COUNTIFS(Jogos!$E:$E,$C21,Jogos!$N:$N,\"D\")+COUNTIFS(Jogos!$I:$I,$C21,Jogos!$O:$O,\"D\")","v":5},{"$f":"SUMIFS(Jogos!$F:$F,Jogos!$E:$E,$C21)+SUMIFS(Jogos!$H:$H,Jogos!$I:$I,$C21)","v":5},{"$f":"SUMIFS(Jogos!$H:$H,Jogos!$E:$E,$C21)+SUMIFS(Jogos!$F:$F,Jogos!$I:$I,$C21)+COUNTIFS(Jogos!$S:$S,\"WWIND\",Jogos!$E:$E,$C21)*2+COUNTIFS(Jogos!$S:$S,\"WWIND\",Jogos!$I:$I,$C21)*2","v":7},{"$f":"H21-I21","v":-2},{"$nulls":3},{"$f":"SUM(E21:G21)","v":9},{"$f":"IF(N21=0,-0.00001,D21/(N21*3))","v":{"v":0.2962962962962963,"d":"29.6%"}}]
[null,{"v":4,"d":"4º"},"UNIÃO INDEPENDENTE/UBERABA",{"$f":"SUMIFS(ClaOUR!D:D,ClaOUR!$C:$C,$C22)+SUMIFS(ClaPRA!D:D,ClaPRA!$C:$C,$C22)","v":14},{"$f":"SUMIFS(ClaOUR!E:E,ClaOUR!$C:$C,$C22)+SUMIFS(ClaPRA!E:E,ClaPRA!$C:$C,$C22)","v":4},{"$f":"SUMIFS(ClaOUR!F:F,ClaOUR!$C:$C,$C22)+SUMIFS(ClaPRA!F:F,ClaPRA!$C:$C,$C22)","v":2},{"$f":"SUMIFS(ClaOUR!G:G,ClaOUR!$C:$C,$C22)+SUMIFS(ClaPRA!G:G,ClaPRA!$C:$C,$C22)","v":3},{"$f":"SUMIFS(ClaOUR!H:H,ClaOUR!$C:$C,$C22)+SUMIFS(ClaPRA!H:H,ClaPRA!$C:$C,$C22)","v":15},{"$f":"SUMIFS(ClaOUR!I:I,ClaOUR!$C:$C,$C22)+SUMIFS(ClaPRA!I:I,ClaPRA!$C:$C,$C22)","v":10},{"$f":"SUMIFS(ClaOUR!J:J,ClaOUR!$C:$C,$C22)+SUMIFS(ClaPRA!J:J,ClaPRA!$C:$C,$C22)","v":5},{"$f":"SUMIFS(ClaOUR!K:K,ClaOUR!$C:$C,$C22)+SUMIFS(ClaPRA!K:K,ClaPRA!$C:$C,$C22)","v":40},{"$f":"SUMIFS(ClaOUR!L:L,ClaOUR!$C:$C,$C22)+SUMIFS(ClaPRA!L:L,ClaPRA!$C:$C,$C22)","v":30},{"$f":"SUMIFS(ClaOUR!M:M,ClaOUR!$C:$C,$C22)+SUMIFS(ClaPRA!M:M,ClaPRA!$C:$C,$C22)","v":10},9,{"$f":"D22/(N22*3)","v":{"v":0.5185185185185185,"d":"51.9%"}}]
[null,null,"Constancio Moura",14,{"$f":"COUNTIFS(Jogos!$E:$E,$C23,Jogos!$N:$N,\"V\")+COUNTIFS(Jogos!$I:$I,$C23,Jogos!$O:$O,\"V\")","v":4},{"$f":"COUNTIFS(Jogos!$E:$E,$C23,Jogos!$N:$N,\"E\")+COUNTIFS(Jogos!$I:$I,$C23,Jogos!$O:$O,\"E\")","v":2},{"$f":"COUNTIFS(Jogos!$E:$E,$C23,Jogos!$N:$N,\"D\")+COUNTIFS(Jogos!$I:$I,$C23,Jogos!$O:$O,\"D\")","v":3},{"$f":"SUMIFS(Jogos!$F:$F,Jogos!$E:$E,$C23)+SUMIFS(Jogos!$H:$H,Jogos!$I:$I,$C23)","v":12},{"$f":"SUMIFS(Jogos!$H:$H,Jogos!$E:$E,$C23)+SUMIFS(Jogos!$F:$F,Jogos!$I:$I,$C23)+COUNTIFS(Jogos!$S:$S,\"WWIND\",Jogos!$E:$E,$C23)*2+COUNTIFS(Jogos!$S:$S,\"WWIND\",Jogos!$I:$I,$C23)*2","v":10},2,{"$nulls":3},9,{"v":0.5185185185185185,"d":"51.9%"}]
[null,null,"Emerson Claudino",15,{"$f":"COUNTIFS(Jogos!$E:$E,$C24,Jogos!$N:$N,\"V\")+COUNTIFS(Jogos!$I:$I,$C24,Jogos!$O:$O,\"V\")","v":4},{"$f":"COUNTIFS(Jogos!$E:$E,$C24,Jogos!$N:$N,\"E\")+COUNTIFS(Jogos!$I:$I,$C24,Jogos!$O:$O,\"E\")","v":3},{"$f":"COUNTIFS(Jogos!$E:$E,$C24,Jogos!$N:$N,\"D\")+COUNTIFS(Jogos!$I:$I,$C24,Jogos!$O:$O,\"D\")","v":2},{"$f":"SUMIFS(Jogos!$F:$F,Jogos!$E:$E,$C24)+SUMIFS(Jogos!$H:$H,Jogos!$I:$I,$C24)","v":9},{"$f":"SUMIFS(Jogos!$H:$H,Jogos!$E:$E,$C24)+SUMIFS(Jogos!$F:$F,Jogos!$I:$I,$C24)+COUNTIFS(Jogos!$S:$S,\"WWIND\",Jogos!$E:$E,$C24)*2+COUNTIFS(Jogos!$S:$S,\"WWIND\",Jogos!$I:$I,$C24)*2","v":4},5,{"$nulls":3},9,{"v":0.5555555555555556,"d":"55.6%"}]
[null,null,"Juliano Gomes",14,{"$f":"COUNTIFS(Jogos!$E:$E,$C25,Jogos!$N:$N,\"V\")+COUNTIFS(Jogos!$I:$I,$C25,Jogos!$O:$O,\"V\")","v":4},{"$f":"COUNTIFS(Jogos!$E:$E,$C25,Jogos!$N:$N,\"E\")+COUNTIFS(Jogos!$I:$I,$C25,Jogos!$O:$O,\"E\")","v":2},{"$f":"COUNTIFS(Jogos!$E:$E,$C25,Jogos!$N:$N,\"D\")+COUNTIFS(Jogos!$I:$I,$C25,Jogos!$O:$O,\"D\")","v":3},{"$f":"SUMIFS(Jogos!$F:$F,Jogos!$E:$E,$C25)+SUMIFS(Jogos!$H:$H,Jogos!$I:$I,$C25)","v":12},{"$f":"SUMIFS(Jogos!$H:$H,Jogos!$E:$E,$C25)+SUMIFS(Jogos!$F:$F,Jogos!$I:$I,$C25)+COUNTIFS(Jogos!$S:$S,\"WWIND\",Jogos!$E:$E,$C25)*2+COUNTIFS(Jogos!$S:$S,\"WWIND\",Jogos!$I:$I,$C25)*2","v":11},1,{"$nulls":3},9,{"v":0.5185185185185185,"d":"51.9%"}]
[null,null,"Luiz Humberto",13,{"$f":"COUNTIFS(Jogos!$E:$E,$C26,Jogos!$N:$N,\"V\")+COUNTIFS(Jogos!$I:$I,$C26,Jogos!$O:$O,\"V\")","v":3},{"$f":"COUNTIFS(Jogos!$E:$E,$C26,Jogos!$N:$N,\"E\")+COUNTIFS(Jogos!$I:$I,$C26,Jogos!$O:$O,\"E\")","v":4},{"$f":"COUNTIFS(Jogos!$E:$E,$C26,Jogos!$N:$N,\"D\")+COUNTIFS(Jogos!$I:$I,$C26,Jogos!$O:$O,\"D\")","v":2},{"$f":"SUMIFS(Jogos!$F:$F,Jogos!$E:$E,$C26)+SUMIFS(Jogos!$H:$H,Jogos!$I:$I,$C26)","v":7},{"$f":"SUMIFS(Jogos!$H:$H,Jogos!$E:$E,$C26)+SUMIFS(Jogos!$F:$F,Jogos!$I:$I,$C26)+COUNTIFS(Jogos!$S:$S,\"WWIND\",Jogos!$E:$E,$C26)*2+COUNTIFS(Jogos!$S:$S,\"WWIND\",Jogos!$I:$I,$C26)*2","v":5},2,{"$nulls":3},9,{"v":0.48148148148148145,"d":"48.1%"}]
[null,{"v":5,"d":"5º"},"BOTAFOGO",{"$f":"SUMIFS(ClaOUR!D:D,ClaOUR!$C:$C,$C27)+SUMIFS(ClaPRA!D:D,ClaPRA!$C:$C,$C27)","v":16},{"$f":"SUMIFS(ClaOUR!E:E,ClaOUR!$C:$C,$C27)+SUMIFS(ClaPRA!E:E,ClaPRA!$C:$C,$C27)","v":5},{"$f":"SUMIFS(ClaOUR!F:F,ClaOUR!$C:$C,$C27)+SUMIFS(ClaPRA!F:F,ClaPRA!$C:$C,$C27)","v":1},{"$f":"SUMIFS(ClaOUR!G:G,ClaOUR!$C:$C,$C27)+SUMIFS(ClaPRA!G:G,ClaPRA!$C:$C,$C27)","v":3},{"$f":"SUMIFS(ClaOUR!H:H,ClaOUR!$C:$C,$C27)+SUMIFS(ClaPRA!H:H,ClaPRA!$C:$C,$C27)","v":18},{"$f":"SUMIFS(ClaOUR!I:I,ClaOUR!$C:$C,$C27)+SUMIFS(ClaPRA!I:I,ClaPRA!$C:$C,$C27)","v":9},{"$f":"SUMIFS(ClaOUR!J:J,ClaOUR!$C:$C,$C27)+SUMIFS(ClaPRA!J:J,ClaPRA!$C:$C,$C27)","v":9},{"$f":"SUMIFS(ClaOUR!K:K,ClaOUR!$C:$C,$C27)+SUMIFS(ClaPRA!K:K,ClaPRA!$C:$C,$C27)","v":44},{"$f":"SUMIFS(ClaOUR!L:L,ClaOUR!$C:$C,$C27)+SUMIFS(ClaPRA!L:L,ClaPRA!$C:$C,$C27)","v":29},{"$f":"SUMIFS(ClaOUR!M:M,ClaOUR!$C:$C,$C27)+SUMIFS(ClaPRA!M:M,ClaPRA!$C:$C,$C27)","v":15},9,{"$f":"D27/(N27*3)","v":{"v":0.5925925925925926,"d":"59.3%"}}]
[null,null,"Altanir Junior",16,{"$f":"COUNTIFS(Jogos!$E:$E,$C28,Jogos!$N:$N,\"V\")+COUNTIFS(Jogos!$I:$I,$C28,Jogos!$O:$O,\"V\")","v":5},{"$f":"COUNTIFS(Jogos!$E:$E,$C28,Jogos!$N:$N,\"E\")+COUNTIFS(Jogos!$I:$I,$C28,Jogos!$O:$O,\"E\")","v":1},{"$f":"COUNTIFS(Jogos!$E:$E,$C28,Jogos!$N:$N,\"D\")+COUNTIFS(Jogos!$I:$I,$C28,Jogos!$O:$O,\"D\")","v":3},{"$f":"SUMIFS(Jogos!$F:$F,Jogos!$E:$E,$C28)+SUMIFS(Jogos!$H:$H,Jogos!$I:$I,$C28)","v":15},{"$f":"SUMIFS(Jogos!$H:$H,Jogos!$E:$E,$C28)+SUMIFS(Jogos!$F:$F,Jogos!$I:$I,$C28)+COUNTIFS(Jogos!$S:$S,\"WWIND\",Jogos!$E:$E,$C28)*2+COUNTIFS(Jogos!$S:$S,\"WWIND\",Jogos!$I:$I,$C28)*2","v":9},6,{"$nulls":3},9,{"v":0.5925925925925926,"d":"59.3%"}]
[null,null,"Bruno Machado",0,{"$f":"COUNTIFS(Jogos!$E:$E,$C29,Jogos!$N:$N,\"V\")+COUNTIFS(Jogos!$I:$I,$C29,Jogos!$O:$O,\"V\")","v":0},{"$f":"COUNTIFS(Jogos!$E:$E,$C29,Jogos!$N:$N,\"E\")+COUNTIFS(Jogos!$I:$I,$C29,Jogos!$O:$O,\"E\")","v":0},{"$f":"COUNTIFS(Jogos!$E:$E,$C29,Jogos!$N:$N,\"D\")+COUNTIFS(Jogos!$I:$I,$C29,Jogos!$O:$O,\"D\")","v":1},{"$f":"SUMIFS(Jogos!$F:$F,Jogos!$E:$E,$C29)+SUMIFS(Jogos!$H:$H,Jogos!$I:$I,$C29)","v":0},{"$f":"SUMIFS(Jogos!$H:$H,Jogos!$E:$E,$C29)+SUMIFS(Jogos!$F:$F,Jogos!$I:$I,$C29)+COUNTIFS(Jogos!$S:$S,\"WWIND\",Jogos!$E:$E,$C29)*2+COUNTIFS(Jogos!$S:$S,\"WWIND\",Jogos!$I:$I,$C29)*2","v":1},-1,{"$nulls":3},1,{"v":0,"d":"0.0%"}]
[null,null,"Diego Americo",17,{"$f":"COUNTIFS(Jogos!$E:$E,$C30,Jogos!$N:$N,\"V\")+COUNTIFS(Jogos!$I:$I,$C30,Jogos!$O:$O,\"V\")","v":4},{"$f":"COUNTIFS(Jogos!$E:$E,$C30,Jogos!$N:$N,\"E\")+COUNTIFS(Jogos!$I:$I,$C30,Jogos!$O:$O,\"E\")","v":5},{"$f":"COUNTIFS(Jogos!$E:$E,$C30,Jogos!$N:$N,\"D\")+COUNTIFS(Jogos!$I:$I,$C30,Jogos!$O:$O,\"D\")","v":0},{"$f":"SUMIFS(Jogos!$F:$F,Jogos!$E:$E,$C30)+SUMIFS(Jogos!$H:$H,Jogos!$I:$I,$C30)","v":10},{"$f":"SUMIFS(Jogos!$H:$H,Jogos!$E:$E,$C30)+SUMIFS(Jogos!$F:$F,Jogos!$I:$I,$C30)+COUNTIFS(Jogos!$S:$S,\"WWIND\",Jogos!$E:$E,$C30)*2+COUNTIFS(Jogos!$S:$S,\"WWIND\",Jogos!$I:$I,$C30)*2","v":3},7,{"$nulls":3},9,{"v":0.6296296296296297,"d":"63.0%"}]
[null,null,"Marcos Ferreira",3,{"$f":"COUNTIFS(Jogos!$E:$E,$C31,Jogos!$N:$N,\"V\")+COUNTIFS(Jogos!$I:$I,$C31,Jogos!$O:$O,\"V\")","v":1},{"$f":"COUNTIFS(Jogos!$E:$E,$C31,Jogos!$N:$N,\"E\")+COUNTIFS(Jogos!$I:$I,$C31,Jogos!$O:$O,\"E\")","v":0},{"$f":"COUNTIFS(Jogos!$E:$E,$C31,Jogos!$N:$N,\"D\")+COUNTIFS(Jogos!$I:$I,$C31,Jogos!$O:$O,\"D\")","v":0},{"$f":"SUMIFS(Jogos!$F:$F,Jogos!$E:$E,$C31)+SUMIFS(Jogos!$H:$H,Jogos!$I:$I,$C31)","v":2},{"$f":"SUMIFS(Jogos!$H:$H,Jogos!$E:$E,$C31)+SUMIFS(Jogos!$F:$F,Jogos!$I:$I,$C31)+COUNTIFS(Jogos!$S:$S,\"WWIND\",Jogos!$E:$E,$C31)*2+COUNTIFS(Jogos!$S:$S,\"WWIND\",Jogos!$I:$I,$C31)*2","v":0},2,{"$nulls":3},1,{"v":1,"d":"100.0%"}]
[null,null,"Renato Negreiros",9,{"$f":"COUNTIFS(Jogos!$E:$E,$C32,Jogos!$N:$N,\"V\")+COUNTIFS(Jogos!$I:$I,$C32,Jogos!$O:$O,\"V\")","v":2},{"$f":"COUNTIFS(Jogos!$E:$E,$C32,Jogos!$N:$N,\"E\")+COUNTIFS(Jogos!$I:$I,$C32,Jogos!$O:$O,\"E\")","v":3},{"$f":"COUNTIFS(Jogos!$E:$E,$C32,Jogos!$N:$N,\"D\")+COUNTIFS(Jogos!$I:$I,$C32,Jogos!$O:$O,\"D\")","v":3},{"$f":"SUMIFS(Jogos!$F:$F,Jogos!$E:$E,$C32)+SUMIFS(Jogos!$H:$H,Jogos!$I:$I,$C32)","v":7},{"$f":"SUMIFS(Jogos!$H:$H,Jogos!$E:$E,$C32)+SUMIFS(Jogos!$F:$F,Jogos!$I:$I,$C32)+COUNTIFS(Jogos!$S:$S,\"WWIND\",Jogos!$E:$E,$C32)*2+COUNTIFS(Jogos!$S:$S,\"WWIND\",Jogos!$I:$I,$C32)*2","v":9},-2,{"$nulls":3},8,{"v":0.375,"d":"37.5%"}]
[null,null,"Sergio Falcometa",18,{"$f":"COUNTIFS(Jogos!$E:$E,$C33,Jogos!$N:$N,\"V\")+COUNTIFS(Jogos!$I:$I,$C33,Jogos!$O:$O,\"V\")","v":6},{"$f":"COUNTIFS(Jogos!$E:$E,$C33,Jogos!$N:$N,\"E\")+COUNTIFS(Jogos!$I:$I,$C33,Jogos!$O:$O,\"E\")","v":0},{"$f":"COUNTIFS(Jogos!$E:$E,$C33,Jogos!$N:$N,\"D\")+COUNTIFS(Jogos!$I:$I,$C33,Jogos!$O:$O,\"D\")","v":2},{"$f":"SUMIFS(Jogos!$F:$F,Jogos!$E:$E,$C33)+SUMIFS(Jogos!$H:$H,Jogos!$I:$I,$C33)","v":10},{"$f":"SUMIFS(Jogos!$H:$H,Jogos!$E:$E,$C33)+SUMIFS(Jogos!$F:$F,Jogos!$I:$I,$C33)+COUNTIFS(Jogos!$S:$S,\"WWIND\",Jogos!$E:$E,$C33)*2+COUNTIFS(Jogos!$S:$S,\"WWIND\",Jogos!$I:$I,$C33)*2","v":7},3,{"$nulls":3},8,{"v":0.75,"d":"75.0%"}]
[null,{"v":6,"d":"6º"},"LIBERDADE [B]",{"$f":"SUMIFS(ClaOUR!D:D,ClaOUR!$C:$C,$C34)+SUMIFS(ClaPRA!D:D,ClaPRA!$C:$C,$C34)","v":16},{"$f":"SUMIFS(ClaOUR!E:E,ClaOUR!$C:$C,$C34)+SUMIFS(ClaPRA!E:E,ClaPRA!$C:$C,$C34)","v":5},{"$f":"SUMIFS(ClaOUR!F:F,ClaOUR!$C:$C,$C34)+SUMIFS(ClaPRA!F:F,ClaPRA!$C:$C,$C34)","v":1},{"$f":"SUMIFS(ClaOUR!G:G,ClaOUR!$C:$C,$C34)+SUMIFS(ClaPRA!G:G,ClaPRA!$C:$C,$C34)","v":3},{"$f":"SUMIFS(ClaOUR!H:H,ClaOUR!$C:$C,$C34)+SUMIFS(ClaPRA!H:H,ClaPRA!$C:$C,$C34)","v":14},{"$f":"SUMIFS(ClaOUR!I:I,ClaOUR!$C:$C,$C34)+SUMIFS(ClaPRA!I:I,ClaPRA!$C:$C,$C34)","v":12},{"$f":"SUMIFS(ClaOUR!J:J,ClaOUR!$C:$C,$C34)+SUMIFS(ClaPRA!J:J,ClaPRA!$C:$C,$C34)","v":2},{"$f":"SUMIFS(ClaOUR!K:K,ClaOUR!$C:$C,$C34)+SUMIFS(ClaPRA!K:K,ClaPRA!$C:$C,$C34)","v":36},{"$f":"SUMIFS(ClaOUR!L:L,ClaOUR!$C:$C,$C34)+SUMIFS(ClaPRA!L:L,ClaPRA!$C:$C,$C34)","v":30},{"$f":"SUMIFS(ClaOUR!M:M,ClaOUR!$C:$C,$C34)+SUMIFS(ClaPRA!M:M,ClaPRA!$C:$C,$C34)","v":6},9,{"$f":"D34/(N34*3)","v":{"v":0.5925925925925926,"d":"59.3%"}}]
[null,null,"Daniel Oliveira",4,{"$f":"COUNTIFS(Jogos!$E:$E,$C35,Jogos!$N:$N,\"V\")+COUNTIFS(Jogos!$I:$I,$C35,Jogos!$O:$O,\"V\")","v":1},{"$f":"COUNTIFS(Jogos!$E:$E,$C35,Jogos!$N:$N,\"E\")+COUNTIFS(Jogos!$I:$I,$C35,Jogos!$O:$O,\"E\")","v":1},{"$f":"COUNTIFS(Jogos!$E:$E,$C35,Jogos!$N:$N,\"D\")+COUNTIFS(Jogos!$I:$I,$C35,Jogos!$O:$O,\"D\")","v":3},{"$f":"SUMIFS(Jogos!$F:$F,Jogos!$E:$E,$C35)+SUMIFS(Jogos!$H:$H,Jogos!$I:$I,$C35)","v":4},{"$f":"SUMIFS(Jogos!$H:$H,Jogos!$E:$E,$C35)+SUMIFS(Jogos!$F:$F,Jogos!$I:$I,$C35)+COUNTIFS(Jogos!$S:$S,\"WWIND\",Jogos!$E:$E,$C35)*2+COUNTIFS(Jogos!$S:$S,\"WWIND\",Jogos!$I:$I,$C35)*2","v":7},-3,{"$nulls":3},5,{"v":0.26666666666666666,"d":"26.7%"}]
[null,null,"Joao Eduardo Pereira",9,{"$f":"COUNTIFS(Jogos!$E:$E,$C36,Jogos!$N:$N,\"V\")+COUNTIFS(Jogos!$I:$I,$C36,Jogos!$O:$O,\"V\")","v":2},{"$f":"COUNTIFS(Jogos!$E:$E,$C36,Jogos!$N:$N,\"E\")+COUNTIFS(Jogos!$I:$I,$C36,Jogos!$O:$O,\"E\")","v":3},{"$f":"COUNTIFS(Jogos!$E:$E,$C36,Jogos!$N:$N,\"D\")+COUNTIFS(Jogos!$I:$I,$C36,Jogos!$O:$O,\"D\")","v":1},{"$f":"SUMIFS(Jogos!$F:$F,Jogos!$E:$E,$C36)+SUMIFS(Jogos!$H:$H,Jogos!$I:$I,$C36)","v":6},{"$f":"SUMIFS(Jogos!$H:$H,Jogos!$E:$E,$C36)+SUMIFS(Jogos!$F:$F,Jogos!$I:$I,$C36)+COUNTIFS(Jogos!$S:$S,\"WWIND\",Jogos!$E:$E,$C36)*2+COUNTIFS(Jogos!$S:$S,\"WWIND\",Jogos!$I:$I,$C36)*2","v":6},0,{"$nulls":3},6,{"v":0.5,"d":"50.0%"}]
[null,null,"Luiz Carlos Guerra",17,{"$f":"COUNTIFS(Jogos!$E:$E,$C37,Jogos!$N:$N,\"V\")+COUNTIFS(Jogos!$I:$I,$C37,Jogos!$O:$O,\"V\")","v":5},{"$f":"COUNTIFS(Jogos!$E:$E,$C37,Jogos!$N:$N,\"E\")+COUNTIFS(Jogos!$I:$I,$C37,Jogos!$O:$O,\"E\")","v":2},{"$f":"COUNTIFS(Jogos!$E:$E,$C37,Jogos!$N:$N,\"D\")+COUNTIFS(Jogos!$I:$I,$C37,Jogos!$O:$O,\"D\")","v":2},{"$f":"SUMIFS(Jogos!$F:$F,Jogos!$E:$E,$C37)+SUMIFS(Jogos!$H:$H,Jogos!$I:$I,$C37)","v":15},{"$f":"SUMIFS(Jogos!$H:$H,Jogos!$E:$E,$C37)+SUMIFS(Jogos!$F:$F,Jogos!$I:$I,$C37)+COUNTIFS(Jogos!$S:$S,\"WWIND\",Jogos!$E:$E,$C37)*2+COUNTIFS(Jogos!$S:$S,\"WWIND\",Jogos!$I:$I,$C37)*2","v":7},8,{"$nulls":3},9,{"v":0.6296296296296297,"d":"63.0%"}]
[null,null,"Marcelo Virgilio",13,{"$f":"COUNTIFS(Jogos!$E:$E,$C38,Jogos!$N:$N,\"V\")+COUNTIFS(Jogos!$I:$I,$C38,Jogos!$O:$O,\"V\")","v":4},{"$f":"COUNTIFS(Jogos!$E:$E,$C38,Jogos!$N:$N,\"E\")+COUNTIFS(Jogos!$I:$I,$C38,Jogos!$O:$O,\"E\")","v":1},{"$f":"COUNTIFS(Jogos!$E:$E,$C38,Jogos!$N:$N,\"D\")+COUNTIFS(Jogos!$I:$I,$C38,Jogos!$O:$O,\"D\")","v":3},{"$f":"SUMIFS(Jogos!$F:$F,Jogos!$E:$E,$C38)+SUMIFS(Jogos!$H:$H,Jogos!$I:$I,$C38)","v":6},{"$f":"SUMIFS(Jogos!$H:$H,Jogos!$E:$E,$C38)+SUMIFS(Jogos!$F:$F,Jogos!$I:$I,$C38)+COUNTIFS(Jogos!$S:$S,\"WWIND\",Jogos!$E:$E,$C38)*2+COUNTIFS(Jogos!$S:$S,\"WWIND\",Jogos!$I:$I,$C38)*2","v":4},2,{"$nulls":3},8,{"v":0.5416666666666666,"d":"54.2%"}]
[null,null,"Rafael Pena",9,{"$f":"COUNTIFS(Jogos!$E:$E,$C39,Jogos!$N:$N,\"V\")+COUNTIFS(Jogos!$I:$I,$C39,Jogos!$O:$O,\"V\")","v":2},{"$f":"COUNTIFS(Jogos!$E:$E,$C39,Jogos!$N:$N,\"E\")+COUNTIFS(Jogos!$I:$I,$C39,Jogos!$O:$O,\"E\")","v":3},{"$f":"COUNTIFS(Jogos!$E:$E,$C39,Jogos!$N:$N,\"D\")+COUNTIFS(Jogos!$I:$I,$C39,Jogos!$O:$O,\"D\")","v":3},{"$f":"SUMIFS(Jogos!$F:$F,Jogos!$E:$E,$C39)+SUMIFS(Jogos!$H:$H,Jogos!$I:$I,$C39)","v":5},{"$f":"SUMIFS(Jogos!$H:$H,Jogos!$E:$E,$C39)+SUMIFS(Jogos!$F:$F,Jogos!$I:$I,$C39)+COUNTIFS(Jogos!$S:$S,\"WWIND\",Jogos!$E:$E,$C39)*2+COUNTIFS(Jogos!$S:$S,\"WWIND\",Jogos!$I:$I,$C39)*2","v":6},-1,{"$nulls":3},8,{"v":0.375,"d":"37.5%"}]
[null,{"v":7,"d":"7º"},"VASCO DA GAMA",{"$f":"SUMIFS(ClaOUR!D:D,ClaOUR!$C:$C,$C40)+SUMIFS(ClaPRA!D:D,ClaPRA!$C:$C,$C40)","v":14},{"$f":"SUMIFS(ClaOUR!E:E,ClaOUR!$C:$C,$C40)+SUMIFS(ClaPRA!E:E,ClaPRA!$C:$C,$C40)","v":4},{"$f":"SUMIFS(ClaOUR!F:F,ClaOUR!$C:$C,$C40)+SUMIFS(ClaPRA!F:F,ClaPRA!$C:$C,$C40)","v":2},{"$f":"SUMIFS(ClaOUR!G:G,ClaOUR!$C:$C,$C40)+SUMIFS(ClaPRA!G:G,ClaPRA!$C:$C,$C40)","v":3},{"$f":"SUMIFS(ClaOUR!H:H,ClaOUR!$C:$C,$C40)+SUMIFS(ClaPRA!H:H,ClaPRA!$C:$C,$C40)","v":14},{"$f":"SUMIFS(ClaOUR!I:I,ClaOUR!$C:$C,$C40)+SUMIFS(ClaPRA!I:I,ClaPRA!$C:$C,$C40)","v":11},{"$f":"SUMIFS(ClaOUR!J:J,ClaOUR!$C:$C,$C40)+SUMIFS(ClaPRA!J:J,ClaPRA!$C:$C,$C40)","v":3},{"$f":"SUMIFS(ClaOUR!K:K,ClaOUR!$C:$C,$C40)+SUMIFS(ClaPRA!K:K,ClaPRA!$C:$C,$C40)","v":48},{"$f":"SUMIFS(ClaOUR!L:L,ClaOUR!$C:$C,$C40)+SUMIFS(ClaPRA!L:L,ClaPRA!$C:$C,$C40)","v":31},{"$f":"SUMIFS(ClaOUR!M:M,ClaOUR!$C:$C,$C40)+SUMIFS(ClaPRA!M:M,ClaPRA!$C:$C,$C40)","v":17},9,{"$f":"D40/(N40*3)","v":{"v":0.5185185185185185,"d":"51.9%"}}]
[null,null,"Eder Patrocinio",8,{"$f":"COUNTIFS(Jogos!$E:$E,$C41,Jogos!$N:$N,\"V\")+COUNTIFS(Jogos!$I:$I,$C41,Jogos!$O:$O,\"V\")","v":2},{"$f":"COUNTIFS(Jogos!$E:$E,$C41,Jogos!$N:$N,\"E\")+COUNTIFS(Jogos!$I:$I,$C41,Jogos!$O:$O,\"E\")","v":2},{"$f":"COUNTIFS(Jogos!$E:$E,$C41,Jogos!$N:$N,\"D\")+COUNTIFS(Jogos!$I:$I,$C41,Jogos!$O:$O,\"D\")","v":1},{"$f":"SUMIFS(Jogos!$F:$F,Jogos!$E:$E,$C41)+SUMIFS(Jogos!$H:$H,Jogos!$I:$I,$C41)","v":8},{"$f":"SUMIFS(Jogos!$H:$H,Jogos!$E:$E,$C41)+SUMIFS(Jogos!$F:$F,Jogos!$I:$I,$C41)+COUNTIFS(Jogos!$S:$S,\"WWIND\",Jogos!$E:$E,$C41)*2+COUNTIFS(Jogos!$S:$S,\"WWIND\",Jogos!$I:$I,$C41)*2","v":8},0,{"$nulls":3},5,{"v":0.5333333333333333,"d":"53.3%"}]
[null,null,"Eduardo Costa",7,{"$f":"COUNTIFS(Jogos!$E:$E,$C42,Jogos!$N:$N,\"V\")+COUNTIFS(Jogos!$I:$I,$C42,Jogos!$O:$O,\"V\")","v":2},{"$f":"COUNTIFS(Jogos!$E:$E,$C42,Jogos!$N:$N,\"E\")+COUNTIFS(Jogos!$I:$I,$C42,Jogos!$O:$O,\"E\")","v":1},{"$f":"COUNTIFS(Jogos!$E:$E,$C42,Jogos!$N:$N,\"D\")+COUNTIFS(Jogos!$I:$I,$C42,Jogos!$O:$O,\"D\")","v":1},{"$f":"SUMIFS(Jogos!$F:$F,Jogos!$E:$E,$C42)+SUMIFS(Jogos!$H:$H,Jogos!$I:$I,$C42)","v":5},{"$f":"SUMIFS(Jogos!$H:$H,Jogos!$E:$E,$C42)+SUMIFS(Jogos!$F:$F,Jogos!$I:$I,$C42)+COUNTIFS(Jogos!$S:$S,\"WWIND\",Jogos!$E:$E,$C42)*2+COUNTIFS(Jogos!$S:$S,\"WWIND\",Jogos!$I:$I,$C42)*2","v":1},4,{"$nulls":3},4,{"v":0.5833333333333334,"d":"58.3%"}]
[null,null,"Evandro Gomes",4,{"$f":"COUNTIFS(Jogos!$E:$E,$C43,Jogos!$N:$N,\"V\")+COUNTIFS(Jogos!$I:$I,$C43,Jogos!$O:$O,\"V\")","v":1},{"$f":"COUNTIFS(Jogos!$E:$E,$C43,Jogos!$N:$N,\"E\")+COUNTIFS(Jogos!$I:$I,$C43,Jogos!$O:$O,\"E\")","v":1},{"$f":"COUNTIFS(Jogos!$E:$E,$C43,Jogos!$N:$N,\"D\")+COUNTIFS(Jogos!$I:$I,$C43,Jogos!$O:$O,\"D\")","v":3},{"$f":"SUMIFS(Jogos!$F:$F,Jogos!$E:$E,$C43)+SUMIFS(Jogos!$H:$H,Jogos!$I:$I,$C43)","v":7},{"$f":"SUMIFS(Jogos!$H:$H,Jogos!$E:$E,$C43)+SUMIFS(Jogos!$F:$F,Jogos!$I:$I,$C43)+COUNTIFS(Jogos!$S:$S,\"WWIND\",Jogos!$E:$E,$C43)*2+COUNTIFS(Jogos!$S:$S,\"WWIND\",Jogos!$I:$I,$C43)*2","v":6},1,{"$nulls":3},5,{"v":0.26666666666666666,"d":"26.7%"}]
[null,null,"Fernando Ferreira",17,{"$f":"COUNTIFS(Jogos!$E:$E,$C44,Jogos!$N:$N,\"V\")+COUNTIFS(Jogos!$I:$I,$C44,Jogos!$O:$O,\"V\")","v":5},{"$f":"COUNTIFS(Jogos!$E:$E,$C44,Jogos!$N:$N,\"E\")+COUNTIFS(Jogos!$I:$I,$C44,Jogos!$O:$O,\"E\")","v":2},{"$f":"COUNTIFS(Jogos!$E:$E,$C44,Jogos!$N:$N,\"D\")+COUNTIFS(Jogos!$I:$I,$C44,Jogos!$O:$O,\"D\")","v":2},{"$f":"SUMIFS(Jogos!$F:$F,Jogos!$E:$E,$C44)+SUMIFS(Jogos!$H:$H,Jogos!$I:$I,$C44)","v":15},{"$f":"SUMIFS(Jogos!$H:$H,Jogos!$E:$E,$C44)+SUMIFS(Jogos!$F:$F,Jogos!$I:$I,$C44)+COUNTIFS(Jogos!$S:$S,\"WWIND\",Jogos!$E:$E,$C44)*2+COUNTIFS(Jogos!$S:$S,\"WWIND\",Jogos!$I:$I,$C44)*2","v":8},7,{"$nulls":3},9,{"v":0.6296296296296297,"d":"63.0%"}]
[null,null,"Henrique Madeira",6,{"$f":"COUNTIFS(Jogos!$E:$E,$C45,Jogos!$N:$N,\"V\")+COUNTIFS(Jogos!$I:$I,$C45,Jogos!$O:$O,\"V\")","v":2},{"$f":"COUNTIFS(Jogos!$E:$E,$C45,Jogos!$N:$N,\"E\")+COUNTIFS(Jogos!$I:$I,$C45,Jogos!$O:$O,\"E\")","v":0},{"$f":"COUNTIFS(Jogos!$E:$E,$C45,Jogos!$N:$N,\"D\")+COUNTIFS(Jogos!$I:$I,$C45,Jogos!$O:$O,\"D\")","v":3},{"$f":"SUMIFS(Jogos!$F:$F,Jogos!$E:$E,$C45)+SUMIFS(Jogos!$H:$H,Jogos!$I:$I,$C45)","v":6},{"$f":"SUMIFS(Jogos!$H:$H,Jogos!$E:$E,$C45)+SUMIFS(Jogos!$F:$F,Jogos!$I:$I,$C45)+COUNTIFS(Jogos!$S:$S,\"WWIND\",Jogos!$E:$E,$C45)*2+COUNTIFS(Jogos!$S:$S,\"WWIND\",Jogos!$I:$I,$C45)*2","v":5},1,{"$nulls":3},5,{"v":0.4,"d":"40.0%"}]
[null,null,"Marcelo Lima",6,{"$f":"COUNTIFS(Jogos!$E:$E,$C46,Jogos!$N:$N,\"V\")+COUNTIFS(Jogos!$I:$I,$C46,Jogos!$O:$O,\"V\")","v":1},{"$f":"COUNTIFS(Jogos!$E:$E,$C46,Jogos!$N:$N,\"E\")+COUNTIFS(Jogos!$I:$I,$C46,Jogos!$O:$O,\"E\")","v":3},{"$f":"COUNTIFS(Jogos!$E:$E,$C46,Jogos!$N:$N,\"D\")+COUNTIFS(Jogos!$I:$I,$C46,Jogos!$O:$O,\"D\")","v":0},{"$f":"SUMIFS(Jogos!$F:$F,Jogos!$E:$E,$C46)+SUMIFS(Jogos!$H:$H,Jogos!$I:$I,$C46)","v":4},{"$f":"SUMIFS(Jogos!$H:$H,Jogos!$E:$E,$C46)+SUMIFS(Jogos!$F:$F,Jogos!$I:$I,$C46)+COUNTIFS(Jogos!$S:$S,\"WWIND\",Jogos!$E:$E,$C46)*2+COUNTIFS(Jogos!$S:$S,\"WWIND\",Jogos!$I:$I,$C46)*2","v":1},3,{"$nulls":3},4,{"v":0.5,"d":"50.0%"}]
[null,null,"Valmir Silva",5,{"$f":"COUNTIFS(Jogos!$E:$E,$C47,Jogos!$N:$N,\"V\")+COUNTIFS(Jogos!$I:$I,$C47,Jogos!$O:$O,\"V\")","v":1},{"$f":"COUNTIFS(Jogos!$E:$E,$C47,Jogos!$N:$N,\"E\")+COUNTIFS(Jogos!$I:$I,$C47,Jogos!$O:$O,\"E\")","v":2},{"$f":"COUNTIFS(Jogos!$E:$E,$C47,Jogos!$N:$N,\"D\")+COUNTIFS(Jogos!$I:$I,$C47,Jogos!$O:$O,\"D\")","v":1},{"$f":"SUMIFS(Jogos!$F:$F,Jogos!$E:$E,$C47)+SUMIFS(Jogos!$H:$H,Jogos!$I:$I,$C47)","v":3},{"$f":"SUMIFS(Jogos!$H:$H,Jogos!$E:$E,$C47)+SUMIFS(Jogos!$F:$F,Jogos!$I:$I,$C47)+COUNTIFS(Jogos!$S:$S,\"WWIND\",Jogos!$E:$E,$C47)*2+COUNTIFS(Jogos!$S:$S,\"WWIND\",Jogos!$I:$I,$C47)*2","v":2},1,{"$nulls":3},4,{"v":0.4166666666666667,"d":"41.7%"}]
[null,{"v":8,"d":"8º"},"AABB/ACAFUMA [C]",{"$f":"SUMIFS(ClaOUR!D:D,ClaOUR!$C:$C,$C48)+SUMIFS(ClaPRA!D:D,ClaPRA!$C:$C,$C48)","v":14},{"$f":"SUMIFS(ClaOUR!E:E,ClaOUR!$C:$C,$C48)+SUMIFS(ClaPRA!E:E,ClaPRA!$C:$C,$C48)","v":4},{"$f":"SUMIFS(ClaOUR!F:F,ClaOUR!$C:$C,$C48)+SUMIFS(ClaPRA!F:F,ClaPRA!$C:$C,$C48)","v":2},{"$f":"SUMIFS(ClaOUR!G:G,ClaOUR!$C:$C,$C48)+SUMIFS(ClaPRA!G:G,ClaPRA!$C:$C,$C48)","v":4},{"$f":"SUMIFS(ClaOUR!H:H,ClaOUR!$C:$C,$C48)+SUMIFS(ClaPRA!H:H,ClaPRA!$C:$C,$C48)","v":15},{"$f":"SUMIFS(ClaOUR!I:I,ClaOUR!$C:$C,$C48)+SUMIFS(ClaPRA!I:I,ClaPRA!$C:$C,$C48)","v":15},{"$f":"SUMIFS(ClaOUR!J:J,ClaOUR!$C:$C,$C48)+SUMIFS(ClaPRA!J:J,ClaPRA!$C:$C,$C48)","v":0},{"$f":"SUMIFS(ClaOUR!K:K,ClaOUR!$C:$C,$C48)+SUMIFS(ClaPRA!K:K,ClaPRA!$C:$C,$C48)","v":38},{"$f":"SUMIFS(ClaOUR!L:L,ClaOUR!$C:$C,$C48)+SUMIFS(ClaPRA!L:L,ClaPRA!$C:$C,$C48)","v":51},{"$f":"SUMIFS(ClaOUR!M:M,ClaOUR!$C:$C,$C48)+SUMIFS(ClaPRA!M:M,ClaPRA!$C:$C,$C48)","v":-13},10,{"$f":"D48/(N48*3)","v":{"v":0.4666666666666667,"d":"46.7%"}}]
[null,null,"Andre Brandao",15,{"$f":"COUNTIFS(Jogos!$E:$E,$C49,Jogos!$N:$N,\"V\")+COUNTIFS(Jogos!$I:$I,$C49,Jogos!$O:$O,\"V\")","v":4},{"$f":"COUNTIFS(Jogos!$E:$E,$C49,Jogos!$N:$N,\"E\")+COUNTIFS(Jogos!$I:$I,$C49,Jogos!$O:$O,\"E\")","v":3},{"$f":"COUNTIFS(Jogos!$E:$E,$C49,Jogos!$N:$N,\"D\")+COUNTIFS(Jogos!$I:$I,$C49,Jogos!$O:$O,\"D\")","v":3},{"$f":"SUMIFS(Jogos!$F:$F,Jogos!$E:$E,$C49)+SUMIFS(Jogos!$H:$H,Jogos!$I:$I,$C49)","v":10},{"$f":"SUMIFS(Jogos!$H:$H,Jogos!$E:$E,$C49)+SUMIFS(Jogos!$F:$F,Jogos!$I:$I,$C49)+COUNTIFS(Jogos!$S:$S,\"WWIND\",Jogos!$E:$E,$C49)*2+COUNTIFS(Jogos!$S:$S,\"WWIND\",Jogos!$I:$I,$C49)*2","v":14},-4,{"$nulls":3},10,{"v":0.5,"d":"50.0%"}]
[null,null,"Marcelo Silva",15,{"$f":"COUNTIFS(Jogos!$E:$E,$C50,Jogos!$N:$N,\"V\")+COUNTIFS(Jogos!$I:$I,$C50,Jogos!$O:$O,\"V\")","v":4},{"$f":"COUNTIFS(Jogos!$E:$E,$C50,Jogos!$N:$N,\"E\")+COUNTIFS(Jogos!$I:$I,$C50,Jogos!$O:$O,\"E\")","v":3},{"$f":"COUNTIFS(Jogos!$E:$E,$C50,Jogos!$N:$N,\"D\")+COUNTIFS(Jogos!$I:$I,$C50,Jogos!$O:$O,\"D\")","v":3},{"$f":"SUMIFS(Jogos!$F:$F,Jogos!$E:$E,$C50)+SUMIFS(Jogos!$H:$H,Jogos!$I:$I,$C50)","v":7},{"$f":"SUMIFS(Jogos!$H:$H,Jogos!$E:$E,$C50)+SUMIFS(Jogos!$F:$F,Jogos!$I:$I,$C50)+COUNTIFS(Jogos!$S:$S,\"WWIND\",Jogos!$E:$E,$C50)*2+COUNTIFS(Jogos!$S:$S,\"WWIND\",Jogos!$I:$I,$C50)*2","v":10},-3,{"$nulls":3},10,{"v":0.5,"d":"50.0%"}]
[null,null,"Paulo Airton Junior",14,{"$f":"COUNTIFS(Jogos!$E:$E,$C51,Jogos!$N:$N,\"V\")+COUNTIFS(Jogos!$I:$I,$C51,Jogos!$O:$O,\"V\")","v":4},{"$f":"COUNTIFS(Jogos!$E:$E,$C51,Jogos!$N:$N,\"E\")+COUNTIFS(Jogos!$I:$I,$C51,Jogos!$O:$O,\"E\")","v":2},{"$f":"COUNTIFS(Jogos!$E:$E,$C51,Jogos!$N:$N,\"D\")+COUNTIFS(Jogos!$I:$I,$C51,Jogos!$O:$O,\"D\")","v":4},{"$f":"SUMIFS(Jogos!$F:$F,Jogos!$E:$E,$C51)+SUMIFS(Jogos!$H:$H,Jogos!$I:$I,$C51)","v":10},{"$f":"SUMIFS(Jogos!$H:$H,Jogos!$E:$E,$C51)+SUMIFS(Jogos!$F:$F,Jogos!$I:$I,$C51)+COUNTIFS(Jogos!$S:$S,\"WWIND\",Jogos!$E:$E,$C51)*2+COUNTIFS(Jogos!$S:$S,\"WWIND\",Jogos!$I:$I,$C51)*2","v":11},-1,{"$nulls":3},10,{"v":0.4666666666666667,"d":"46.7%"}]
[null,null,"Simplicio Santos",11,{"$f":"COUNTIFS(Jogos!$E:$E,$C52,Jogos!$N:$N,\"V\")+COUNTIFS(Jogos!$I:$I,$C52,Jogos!$O:$O,\"V\")","v":3},{"$f":"COUNTIFS(Jogos!$E:$E,$C52,Jogos!$N:$N,\"E\")+COUNTIFS(Jogos!$I:$I,$C52,Jogos!$O:$O,\"E\")","v":2},{"$f":"COUNTIFS(Jogos!$E:$E,$C52,Jogos!$N:$N,\"D\")+COUNTIFS(Jogos!$I:$I,$C52,Jogos!$O:$O,\"D\")","v":5},{"$f":"SUMIFS(Jogos!$F:$F,Jogos!$E:$E,$C52)+SUMIFS(Jogos!$H:$H,Jogos!$I:$I,$C52)","v":11},{"$f":"SUMIFS(Jogos!$H:$H,Jogos!$E:$E,$C52)+SUMIFS(Jogos!$F:$F,Jogos!$I:$I,$C52)+COUNTIFS(Jogos!$S:$S,\"WWIND\",Jogos!$E:$E,$C52)*2+COUNTIFS(Jogos!$S:$S,\"WWIND\",Jogos!$I:$I,$C52)*2","v":16},-5,{"$nulls":3},10,{"v":0.36666666666666664,"d":"36.7%"}]
[null,{"v":9,"d":"9º"},"AABB/ACAFUMA [A]",{"$f":"SUMIFS(ClaOUR!D:D,ClaOUR!$C:$C,$C53)+SUMIFS(ClaPRA!D:D,ClaPRA!$C:$C,$C53)","v":14},{"$f":"SUMIFS(ClaOUR!E:E,ClaOUR!$C:$C,$C53)+SUMIFS(ClaPRA!E:E,ClaPRA!$C:$C,$C53)","v":4},{"$f":"SUMIFS(ClaOUR!F:F,ClaOUR!$C:$C,$C53)+SUMIFS(ClaPRA!F:F,ClaPRA!$C:$C,$C53)","v":2},{"$f":"SUMIFS(ClaOUR!G:G,ClaOUR!$C:$C,$C53)+SUMIFS(ClaPRA!G:G,ClaPRA!$C:$C,$C53)","v":3},{"$f":"SUMIFS(ClaOUR!H:H,ClaOUR!$C:$C,$C53)+SUMIFS(ClaPRA!H:H,ClaPRA!$C:$C,$C53)","v":16},{"$f":"SUMIFS(ClaOUR!I:I,ClaOUR!$C:$C,$C53)+SUMIFS(ClaPRA!I:I,ClaPRA!$C:$C,$C53)","v":11},{"$f":"SUMIFS(ClaOUR!J:J,ClaOUR!$C:$C,$C53)+SUMIFS(ClaPRA!J:J,ClaPRA!$C:$C,$C53)","v":5},{"$f":"SUMIFS(ClaOUR!K:K,ClaOUR!$C:$C,$C53)+SUMIFS(ClaPRA!K:K,ClaPRA!$C:$C,$C53)","v":50},{"$f":"SUMIFS(ClaOUR!L:L,ClaOUR!$C:$C,$C53)+SUMIFS(ClaPRA!L:L,ClaPRA!$C:$C,$C53)","v":31},{"$f":"SUMIFS(ClaOUR!M:M,ClaOUR!$C:$C,$C53)+SUMIFS(ClaPRA!M:M,ClaPRA!$C:$C,$C53)","v":19},9,{"$f":"D53/(N53*3)","v":{"v":0.5185185185185185,"d":"51.9%"}}]
[null,null,"Antonio Carlos Almeida",10,{"$f":"COUNTIFS(Jogos!$E:$E,$C54,Jogos!$N:$N,\"V\")+COUNTIFS(Jogos!$I:$I,$C54,Jogos!$O:$O,\"V\")","v":2},{"$f":"COUNTIFS(Jogos!$E:$E,$C54,Jogos!$N:$N,\"E\")+COUNTIFS(Jogos!$I:$I,$C54,Jogos!$O:$O,\"E\")","v":4},{"$f":"COUNTIFS(Jogos!$E:$E,$C54,Jogos!$N:$N,\"D\")+COUNTIFS(Jogos!$I:$I,$C54,Jogos!$O:$O,\"D\")","v":3},{"$f":"SUMIFS(Jogos!$F:$F,Jogos!$E:$E,$C54)+SUMIFS(Jogos!$H:$H,Jogos!$I:$I,$C54)","v":9},{"$f":"SUMIFS(Jogos!$H:$H,Jogos!$E:$E,$C54)+SUMIFS(Jogos!$F:$F,Jogos!$I:$I,$C54)+COUNTIFS(Jogos!$S:$S,\"WWIND\",Jogos!$E:$E,$C54)*2+COUNTIFS(Jogos!$S:$S,\"WWIND\",Jogos!$I:$I,$C54)*2","v":8},1,{"$nulls":3},9,{"v":0.37037037037037035,"d":"37.0%"}]
[null,null,"Luiz Claudio Caruso",19,{"$f":"COUNTIFS(Jogos!$E:$E,$C55,Jogos!$N:$N,\"V\")+COUNTIFS(Jogos!$I:$I,$C55,Jogos!$O:$O,\"V\")","v":6},{"$f":"COUNTIFS(Jogos!$E:$E,$C55,Jogos!$N:$N,\"E\")+COUNTIFS(Jogos!$I:$I,$C55,Jogos!$O:$O,\"E\")","v":1},{"$f":"COUNTIFS(Jogos!$E:$E,$C55,Jogos!$N:$N,\"D\")+COUNTIFS(Jogos!$I:$I,$C55,Jogos!$O:$O,\"D\")","v":2},{"$f":"SUMIFS(Jogos!$F:$F,Jogos!$E:$E,$C55)+SUMIFS(Jogos!$H:$H,Jogos!$I:$I,$C55)","v":16},{"$f":"SUMIFS(Jogos!$H:$H,Jogos!$E:$E,$C55)+SUMIFS(Jogos!$F:$F,Jogos!$I:$I,$C55)+COUNTIFS(Jogos!$S:$S,\"WWIND\",Jogos!$E:$E,$C55)*2+COUNTIFS(Jogos!$S:$S,\"WWIND\",Jogos!$I:$I,$C55)*2","v":7},9,{"$nulls":3},9,{"v":0.7037037037037037,"d":"70.4%"}]
[null,null,"Paulo Caruso",13,{"$f":"COUNTIFS(Jogos!$E:$E,$C56,Jogos!$N:$N,\"V\")+COUNTIFS(Jogos!$I:$I,$C56,Jogos!$O:$O,\"V\")","v":4},{"$f":"COUNTIFS(Jogos!$E:$E,$C56,Jogos!$N:$N,\"E\")+COUNTIFS(Jogos!$I:$I,$C56,Jogos!$O:$O,\"E\")","v":1},{"$f":"COUNTIFS(Jogos!$E:$E,$C56,Jogos!$N:$N,\"D\")+COUNTIFS(Jogos!$I:$I,$C56,Jogos!$O:$O,\"D\")","v":4},{"$f":"SUMIFS(Jogos!$F:$F,Jogos!$E:$E,$C56)+SUMIFS(Jogos!$H:$H,Jogos!$I:$I,$C56)","v":10},{"$f":"SUMIFS(Jogos!$H:$H,Jogos!$E:$E,$C56)+SUMIFS(Jogos!$F:$F,Jogos!$I:$I,$C56)+COUNTIFS(Jogos!$S:$S,\"WWIND\",Jogos!$E:$E,$C56)*2+COUNTIFS(Jogos!$S:$S,\"WWIND\",Jogos!$I:$I,$C56)*2","v":7},3,{"$nulls":3},9,{"v":0.48148148148148145,"d":"48.1%"}]
[null,null,"Tarcizio Dinoa Junior",15,{"$f":"COUNTIFS(Jogos!$E:$E,$C57,Jogos!$N:$N,\"V\")+COUNTIFS(Jogos!$I:$I,$C57,Jogos!$O:$O,\"V\")","v":4},{"$f":"COUNTIFS(Jogos!$E:$E,$C57,Jogos!$N:$N,\"E\")+COUNTIFS(Jogos!$I:$I,$C57,Jogos!$O:$O,\"E\")","v":3},{"$f":"COUNTIFS(Jogos!$E:$E,$C57,Jogos!$N:$N,\"D\")+COUNTIFS(Jogos!$I:$I,$C57,Jogos!$O:$O,\"D\")","v":2},{"$f":"SUMIFS(Jogos!$F:$F,Jogos!$E:$E,$C57)+SUMIFS(Jogos!$H:$H,Jogos!$I:$I,$C57)","v":15},{"$f":"SUMIFS(Jogos!$H:$H,Jogos!$E:$E,$C57)+SUMIFS(Jogos!$F:$F,Jogos!$I:$I,$C57)+COUNTIFS(Jogos!$S:$S,\"WWIND\",Jogos!$E:$E,$C57)*2+COUNTIFS(Jogos!$S:$S,\"WWIND\",Jogos!$I:$I,$C57)*2","v":9},6,{"$nulls":3},9,{"v":0.5555555555555556,"d":"55.6%"}]
[null,{"v":10,"d":"10º"},"TUPI [B]",{"$f":"SUMIFS(ClaOUR!D:D,ClaOUR!$C:$C,$C58)+SUMIFS(ClaPRA!D:D,ClaPRA!$C:$C,$C58)","v":12},{"$f":"SUMIFS(ClaOUR!E:E,ClaOUR!$C:$C,$C58)+SUMIFS(ClaPRA!E:E,ClaPRA!$C:$C,$C58)","v":4},{"$f":"SUMIFS(ClaOUR!F:F,ClaOUR!$C:$C,$C58)+SUMIFS(ClaPRA!F:F,ClaPRA!$C:$C,$C58)","v":0},{"$f":"SUMIFS(ClaOUR!G:G,ClaOUR!$C:$C,$C58)+SUMIFS(ClaPRA!G:G,ClaPRA!$C:$C,$C58)","v":4},{"$f":"SUMIFS(ClaOUR!H:H,ClaOUR!$C:$C,$C58)+SUMIFS(ClaPRA!H:H,ClaPRA!$C:$C,$C58)","v":12},{"$f":"SUMIFS(ClaOUR!I:I,ClaOUR!$C:$C,$C58)+SUMIFS(ClaPRA!I:I,ClaPRA!$C:$C,$C58)","v":9},{"$f":"SUMIFS(ClaOUR!J:J,ClaOUR!$C:$C,$C58)+SUMIFS(ClaPRA!J:J,ClaPRA!$C:$C,$C58)","v":3},{"$f":"SUMIFS(ClaOUR!K:K,ClaOUR!$C:$C,$C58)+SUMIFS(ClaPRA!K:K,ClaPRA!$C:$C,$C58)","v":40},{"$f":"SUMIFS(ClaOUR!L:L,ClaOUR!$C:$C,$C58)+SUMIFS(ClaPRA!L:L,ClaPRA!$C:$C,$C58)","v":31},{"$f":"SUMIFS(ClaOUR!M:M,ClaOUR!$C:$C,$C58)+SUMIFS(ClaPRA!M:M,ClaPRA!$C:$C,$C58)","v":9},8,{"$f":"D58/(N58*3)","v":{"v":0.5,"d":"50.0%"}}]
[null,null,"Flavio Scarpelli",11,{"$f":"COUNTIFS(Jogos!$E:$E,$C59,Jogos!$N:$N,\"V\")+COUNTIFS(Jogos!$I:$I,$C59,Jogos!$O:$O,\"V\")","v":3},{"$f":"COUNTIFS(Jogos!$E:$E,$C59,Jogos!$N:$N,\"E\")+COUNTIFS(Jogos!$I:$I,$C59,Jogos!$O:$O,\"E\")","v":2},{"$f":"COUNTIFS(Jogos!$E:$E,$C59,Jogos!$N:$N,\"D\")+COUNTIFS(Jogos!$I:$I,$C59,Jogos!$O:$O,\"D\")","v":3},{"$f":"SUMIFS(Jogos!$F:$F,Jogos!$E:$E,$C59)+SUMIFS(Jogos!$H:$H,Jogos!$I:$I,$C59)","v":11},{"$f":"SUMIFS(Jogos!$H:$H,Jogos!$E:$E,$C59)+SUMIFS(Jogos!$F:$F,Jogos!$I:$I,$C59)+COUNTIFS(Jogos!$S:$S,\"WWIND\",Jogos!$E:$E,$C59)*2+COUNTIFS(Jogos!$S:$S,\"WWIND\",Jogos!$I:$I,$C59)*2","v":9},2,{"$nulls":3},8,{"v":0.4583333333333333,"d":"45.8%"}]
[null,null,"Leandro Benicio",11,{"$f":"COUNTIFS(Jogos!$E:$E,$C60,Jogos!$N:$N,\"V\")+COUNTIFS(Jogos!$I:$I,$C60,Jogos!$O:$O,\"V\")","v":3},{"$f":"COUNTIFS(Jogos!$E:$E,$C60,Jogos!$N:$N,\"E\")+COUNTIFS(Jogos!$I:$I,$C60,Jogos!$O:$O,\"E\")","v":2},{"$f":"COUNTIFS(Jogos!$E:$E,$C60,Jogos!$N:$N,\"D\")+COUNTIFS(Jogos!$I:$I,$C60,Jogos!$O:$O,\"D\")","v":3},{"$f":"SUMIFS(Jogos!$F:$F,Jogos!$E:$E,$C60)+SUMIFS(Jogos!$H:$H,Jogos!$I:$I,$C60)","v":10},{"$f":"SUMIFS(Jogos!$H:$H,Jogos!$E:$E,$C60)+SUMIFS(Jogos!$F:$F,Jogos!$I:$I,$C60)+COUNTIFS(Jogos!$S:$S,\"WWIND\",Jogos!$E:$E,$C60)*2+COUNTIFS(Jogos!$S:$S,\"WWIND\",Jogos!$I:$I,$C60)*2","v":10},0,{"$nulls":3},8,{"v":0.4583333333333333,"d":"45.8%"}]
[null,null,"Luiz Henrique Colla",12,{"$f":"COUNTIFS(Jogos!$E:$E,$C61,Jogos!$N:$N,\"V\")+COUNTIFS(Jogos!$I:$I,$C61,Jogos!$O:$O,\"V\")","v":3},{"$f":"COUNTIFS(Jogos!$E:$E,$C61,Jogos!$N:$N,\"E\")+COUNTIFS(Jogos!$I:$I,$C61,Jogos!$O:$O,\"E\")","v":3},{"$f":"COUNTIFS(Jogos!$E:$E,$C61,Jogos!$N:$N,\"D\")+COUNTIFS(Jogos!$I:$I,$C61,Jogos!$O:$O,\"D\")","v":2},{"$f":"SUMIFS(Jogos!$F:$F,Jogos!$E:$E,$C61)+SUMIFS(Jogos!$H:$H,Jogos!$I:$I,$C61)","v":9},{"$f":"SUMIFS(Jogos!$H:$H,Jogos!$E:$E,$C61)+SUMIFS(Jogos!$F:$F,Jogos!$I:$I,$C61)+COUNTIFS(Jogos!$S:$S,\"WWIND\",Jogos!$E:$E,$C61)*2+COUNTIFS(Jogos!$S:$S,\"WWIND\",Jogos!$I:$I,$C61)*2","v":7},2,{"$nulls":3},8,{"v":0.5,"d":"50.0%"}]
[null,null,"Paulo Ricardo Souza",13,{"$f":"COUNTIFS(Jogos!$E:$E,$C62,Jogos!$N:$N,\"V\")+COUNTIFS(Jogos!$I:$I,$C62,Jogos!$O:$O,\"V\")","v":3},{"$f":"COUNTIFS(Jogos!$E:$E,$C62,Jogos!$N:$N,\"E\")+COUNTIFS(Jogos!$I:$I,$C62,Jogos!$O:$O,\"E\")","v":4},{"$f":"COUNTIFS(Jogos!$E:$E,$C62,Jogos!$N:$N,\"D\")+COUNTIFS(Jogos!$I:$I,$C62,Jogos!$O:$O,\"D\")","v":1},{"$f":"SUMIFS(Jogos!$F:$F,Jogos!$E:$E,$C62)+SUMIFS(Jogos!$H:$H,Jogos!$I:$I,$C62)","v":10},{"$f":"SUMIFS(Jogos!$H:$H,Jogos!$E:$E,$C62)+SUMIFS(Jogos!$F:$F,Jogos!$I:$I,$C62)+COUNTIFS(Jogos!$S:$S,\"WWIND\",Jogos!$E:$E,$C62)*2+COUNTIFS(Jogos!$S:$S,\"WWIND\",Jogos!$I:$I,$C62)*2","v":5},5,{"$nulls":3},8,{"v":0.5416666666666666,"d":"54.2%"}]
["TAÇA DE PRATA",{"v":11,"d":"11º"},"AABB/ACAFUMA [B]",{"$f":"SUMIFS(ClaOUR!D:D,ClaOUR!$C:$C,$C63)+SUMIFS(ClaPRA!D:D,ClaPRA!$C:$C,$C63)","v":18},{"$f":"SUMIFS(ClaOUR!E:E,ClaOUR!$C:$C,$C63)+SUMIFS(ClaPRA!E:E,ClaPRA!$C:$C,$C63)","v":6},{"$f":"SUMIFS(ClaOUR!F:F,ClaOUR!$C:$C,$C63)+SUMIFS(ClaPRA!F:F,ClaPRA!$C:$C,$C63)","v":0},{"$f":"SUMIFS(ClaOUR!G:G,ClaOUR!$C:$C,$C63)+SUMIFS(ClaPRA!G:G,ClaPRA!$C:$C,$C63)","v":4},{"$f":"SUMIFS(ClaOUR!H:H,ClaOUR!$C:$C,$C63)+SUMIFS(ClaPRA!H:H,ClaPRA!$C:$C,$C63)","v":17},{"$f":"SUMIFS(ClaOUR!I:I,ClaOUR!$C:$C,$C63)+SUMIFS(ClaPRA!I:I,ClaPRA!$C:$C,$C63)","v":10},{"$f":"SUMIFS(ClaOUR!J:J,ClaOUR!$C:$C,$C63)+SUMIFS(ClaPRA!J:J,ClaPRA!$C:$C,$C63)","v":7},{"$f":"SUMIFS(ClaOUR!K:K,ClaOUR!$C:$C,$C63)+SUMIFS(ClaPRA!K:K,ClaPRA!$C:$C,$C63)","v":52},{"$f":"SUMIFS(ClaOUR!L:L,ClaOUR!$C:$C,$C63)+SUMIFS(ClaPRA!L:L,ClaPRA!$C:$C,$C63)","v":37},{"$f":"SUMIFS(ClaOUR!M:M,ClaOUR!$C:$C,$C63)+SUMIFS(ClaPRA!M:M,ClaPRA!$C:$C,$C63)","v":15},10,{"$f":"D63/(N63*3)","v":{"v":0.6,"d":"60.0%"}}]
[null,null,"Adolpho Parente",23,{"$f":"COUNTIFS(Jogos!$E:$E,$C64,Jogos!$N:$N,\"V\")+COUNTIFS(Jogos!$I:$I,$C64,Jogos!$O:$O,\"V\")","v":7},{"$f":"COUNTIFS(Jogos!$E:$E,$C64,Jogos!$N:$N,\"E\")+COUNTIFS(Jogos!$I:$I,$C64,Jogos!$O:$O,\"E\")","v":2},{"$f":"COUNTIFS(Jogos!$E:$E,$C64,Jogos!$N:$N,\"D\")+COUNTIFS(Jogos!$I:$I,$C64,Jogos!$O:$O,\"D\")","v":1},{"$f":"SUMIFS(Jogos!$F:$F,Jogos!$E:$E,$C64)+SUMIFS(Jogos!$H:$H,Jogos!$I:$I,$C64)","v":17},{"$f":"SUMIFS(Jogos!$H:$H,Jogos!$E:$E,$C64)+SUMIFS(Jogos!$F:$F,Jogos!$I:$I,$C64)+COUNTIFS(Jogos!$S:$S,\"WWIND\",Jogos!$E:$E,$C64)*2+COUNTIFS(Jogos!$S:$S,\"WWIND\",Jogos!$I:$I,$C64)*2","v":5},12,{"$nulls":3},10,{"v":0.7666666666666667,"d":"76.7%"}]
[null,null,"Alcides Figueira",18,{"$f":"COUNTIFS(Jogos!$E:$E,$C65,Jogos!$N:$N,\"V\")+COUNTIFS(Jogos!$I:$I,$C65,Jogos!$O:$O,\"V\")","v":5},{"$f":"COUNTIFS(Jogos!$E:$E,$C65,Jogos!$N:$N,\"E\")+COUNTIFS(Jogos!$I:$I,$C65,Jogos!$O:$O,\"E\")","v":3},{"$f":"COUNTIFS(Jogos!$E:$E,$C65,Jogos!$N:$N,\"D\")+COUNTIFS(Jogos!$I:$I,$C65,Jogos!$O:$O,\"D\")","v":2},{"$f":"SUMIFS(Jogos!$F:$F,Jogos!$E:$E,$C65)+SUMIFS(Jogos!$H:$H,Jogos!$I:$I,$C65)","v":24},{"$f":"SUMIFS(Jogos!$H:$H,Jogos!$E:$E,$C65)+SUMIFS(Jogos!$F:$F,Jogos!$I:$I,$C65)+COUNTIFS(Jogos!$S:$S,\"WWIND\",Jogos!$E:$E,$C65)*2+COUNTIFS(Jogos!$S:$S,\"WWIND\",Jogos!$I:$I,$C65)*2","v":13},11,{"$nulls":3},10,{"v":0.6,"d":"60.0%"}]
[null,null,"Marcelo Ferreira",9,{"$f":"COUNTIFS(Jogos!$E:$E,$C66,Jogos!$N:$N,\"V\")+COUNTIFS(Jogos!$I:$I,$C66,Jogos!$O:$O,\"V\")","v":2},{"$f":"COUNTIFS(Jogos!$E:$E,$C66,Jogos!$N:$N,\"E\")+COUNTIFS(Jogos!$I:$I,$C66,Jogos!$O:$O,\"E\")","v":3},{"$f":"COUNTIFS(Jogos!$E:$E,$C66,Jogos!$N:$N,\"D\")+COUNTIFS(Jogos!$I:$I,$C66,Jogos!$O:$O,\"D\")","v":2},{"$f":"SUMIFS(Jogos!$F:$F,Jogos!$E:$E,$C66)+SUMIFS(Jogos!$H:$H,Jogos!$I:$I,$C66)","v":3},{"$f":"SUMIFS(Jogos!$H:$H,Jogos!$E:$E,$C66)+SUMIFS(Jogos!$F:$F,Jogos!$I:$I,$C66)+COUNTIFS(Jogos!$S:$S,\"WWIND\",Jogos!$E:$E,$C66)*2+COUNTIFS(Jogos!$S:$S,\"WWIND\",Jogos!$I:$I,$C66)*2","v":6},-3,{"$nulls":3},7,{"v":0.42857142857142855,"d":"42.9%"}]
[null,null,"Paulo Cesar Faria",12,{"$f":"COUNTIFS(Jogos!$E:$E,$C67,Jogos!$N:$N,\"V\")+COUNTIFS(Jogos!$I:$I,$C67,Jogos!$O:$O,\"V\")","v":3},{"$f":"COUNTIFS(Jogos!$E:$E,$C67,Jogos!$N:$N,\"E\")+COUNTIFS(Jogos!$I:$I,$C67,Jogos!$O:$O,\"E\")","v":3},{"$f":"COUNTIFS(Jogos!$E:$E,$C67,Jogos!$N:$N,\"D\")+COUNTIFS(Jogos!$I:$I,$C67,Jogos!$O:$O,\"D\")","v":1},{"$f":"SUMIFS(Jogos!$F:$F,Jogos!$E:$E,$C67)+SUMIFS(Jogos!$H:$H,Jogos!$I:$I,$C67)","v":6},{"$f":"SUMIFS(Jogos!$H:$H,Jogos!$E:$E,$C67)+SUMIFS(Jogos!$F:$F,Jogos!$I:$I,$C67)+COUNTIFS(Jogos!$S:$S,\"WWIND\",Jogos!$E:$E,$C67)*2+COUNTIFS(Jogos!$S:$S,\"WWIND\",Jogos!$I:$I,$C67)*2","v":6},0,{"$nulls":3},7,{"v":0.5714285714285714,"d":"57.1%"}]
[null,null,"Rodrigo Caruso",2,{"$f":"COUNTIFS(Jogos!$E:$E,$C68,Jogos!$N:$N,\"V\")+COUNTIFS(Jogos!$I:$I,$C68,Jogos!$O:$O,\"V\")","v":0},{"$f":"COUNTIFS(Jogos!$E:$E,$C68,Jogos!$N:$N,\"E\")+COUNTIFS(Jogos!$I:$I,$C68,Jogos!$O:$O,\"E\")","v":2},{"$f":"COUNTIFS(Jogos!$E:$E,$C68,Jogos!$N:$N,\"D\")+COUNTIFS(Jogos!$I:$I,$C68,Jogos!$O:$O,\"D\")","v":4},{"$f":"SUMIFS(Jogos!$F:$F,Jogos!$E:$E,$C68)+SUMIFS(Jogos!$H:$H,Jogos!$I:$I,$C68)","v":2},{"$f":"SUMIFS(Jogos!$H:$H,Jogos!$E:$E,$C68)+SUMIFS(Jogos!$F:$F,Jogos!$I:$I,$C68)+COUNTIFS(Jogos!$S:$S,\"WWIND\",Jogos!$E:$E,$C68)*2+COUNTIFS(Jogos!$S:$S,\"WWIND\",Jogos!$I:$I,$C68)*2","v":7},-5,{"$nulls":3},6,{"v":0.1111111111111111,"d":"11.1%"}]
[null,{"v":12,"d":"12º"},"COMARY",{"$f":"SUMIFS(ClaOUR!D:D,ClaOUR!$C:$C,$C69)+SUMIFS(ClaPRA!D:D,ClaPRA!$C:$C,$C69)","v":13},{"$f":"SUMIFS(ClaOUR!E:E,ClaOUR!$C:$C,$C69)+SUMIFS(ClaPRA!E:E,ClaPRA!$C:$C,$C69)","v":4},{"$f":"SUMIFS(ClaOUR!F:F,ClaOUR!$C:$C,$C69)+SUMIFS(ClaPRA!F:F,ClaPRA!$C:$C,$C69)","v":1},{"$f":"SUMIFS(ClaOUR!G:G,ClaOUR!$C:$C,$C69)+SUMIFS(ClaPRA!G:G,ClaPRA!$C:$C,$C69)","v":5},{"$f":"SUMIFS(ClaOUR!H:H,ClaOUR!$C:$C,$C69)+SUMIFS(ClaPRA!H:H,ClaPRA!$C:$C,$C69)","v":12},{"$f":"SUMIFS(ClaOUR!I:I,ClaOUR!$C:$C,$C69)+SUMIFS(ClaPRA!I:I,ClaPRA!$C:$C,$C69)","v":15},{"$f":"SUMIFS(ClaOUR!J:J,ClaOUR!$C:$C,$C69)+SUMIFS(ClaPRA!J:J,ClaPRA!$C:$C,$C69)","v":-3},{"$f":"SUMIFS(ClaOUR!K:K,ClaOUR!$C:$C,$C69)+SUMIFS(ClaPRA!K:K,ClaPRA!$C:$C,$C69)","v":38},{"$f":"SUMIFS(ClaOUR!L:L,ClaOUR!$C:$C,$C69)+SUMIFS(ClaPRA!L:L,ClaPRA!$C:$C,$C69)","v":48},{"$f":"SUMIFS(ClaOUR!M:M,ClaOUR!$C:$C,$C69)+SUMIFS(ClaPRA!M:M,ClaPRA!$C:$C,$C69)","v":-10},10,{"$f":"D69/(N69*3)","v":{"v":0.43333333333333335,"d":"43.3%"}}]
[null,null,"Claudio Figueiredo",{"$f":"IF(N70=0,-0.001,E70*3+F70)","v":4},{"$f":"COUNTIFS(Jogos!$E:$E,$C70,Jogos!$N:$N,\"V\")+COUNTIFS(Jogos!$I:$I,$C70,Jogos!$O:$O,\"V\")","v":1},{"$f":"COUNTIFS(Jogos!$E:$E,$C70,Jogos!$N:$N,\"E\")+COUNTIFS(Jogos!$I:$I,$C70,Jogos!$O:$O,\"E\")","v":1},{"$f":"COUNTIFS(Jogos!$E:$E,$C70,Jogos!$N:$N,\"D\")+COUNTIFS(Jogos!$I:$I,$C70,Jogos!$O:$O,\"D\")","v":2},{"$f":"SUMIFS(Jogos!$F:$F,Jogos!$E:$E,$C70)+SUMIFS(Jogos!$H:$H,Jogos!$I:$I,$C70)","v":3},{"$f":"SUMIFS(Jogos!$H:$H,Jogos!$E:$E,$C70)+SUMIFS(Jogos!$F:$F,Jogos!$I:$I,$C70)+COUNTIFS(Jogos!$S:$S,\"WWIND\",Jogos!$E:$E,$C70)*2+COUNTIFS(Jogos!$S:$S,\"WWIND\",Jogos!$I:$I,$C70)*2","v":8},{"$f":"H70-I70","v":-5},{"$nulls":3},{"$f":"SUM(E70:G70)","v":4},{"$f":"IF(N70=0,-0.00001,D70/(N70*3))","v":{"v":0.3333333333333333,"d":"33.3%"}}]
[null,null,"Eduardo Tavares",8,{"$f":"COUNTIFS(Jogos!$E:$E,$C71,Jogos!$N:$N,\"V\")+COUNTIFS(Jogos!$I:$I,$C71,Jogos!$O:$O,\"V\")","v":2},{"$f":"COUNTIFS(Jogos!$E:$E,$C71,Jogos!$N:$N,\"E\")+COUNTIFS(Jogos!$I:$I,$C71,Jogos!$O:$O,\"E\")","v":2},{"$f":"COUNTIFS(Jogos!$E:$E,$C71,Jogos!$N:$N,\"D\")+COUNTIFS(Jogos!$I:$I,$C71,Jogos!$O:$O,\"D\")","v":4},{"$f":"SUMIFS(Jogos!$F:$F,Jogos!$E:$E,$C71)+SUMIFS(Jogos!$H:$H,Jogos!$I:$I,$C71)","v":5},{"$f":"SUMIFS(Jogos!$H:$H,Jogos!$E:$E,$C71)+SUMIFS(Jogos!$F:$F,Jogos!$I:$I,$C71)+COUNTIFS(Jogos!$S:$S,\"WWIND\",Jogos!$E:$E,$C71)*2+COUNTIFS(Jogos!$S:$S,\"WWIND\",Jogos!$I:$I,$C71)*2","v":8},-3,{"$nulls":3},8,{"v":0.3333333333333333,"d":"33.3%"}]
[null,null,"Igor Guarilha",15,{"$f":"COUNTIFS(Jogos!$E:$E,$C72,Jogos!$N:$N,\"V\")+COUNTIFS(Jogos!$I:$I,$C72,Jogos!$O:$O,\"V\")","v":4},{"$f":"COUNTIFS(Jogos!$E:$E,$C72,Jogos!$N:$N,\"E\")+COUNTIFS(Jogos!$I:$I,$C72,Jogos!$O:$O,\"E\")","v":3},{"$f":"COUNTIFS(Jogos!$E:$E,$C72,Jogos!$N:$N,\"D\")+COUNTIFS(Jogos!$I:$I,$C72,Jogos!$O:$O,\"D\")","v":2},{"$f":"SUMIFS(Jogos!$F:$F,Jogos!$E:$E,$C72)+SUMIFS(Jogos!$H:$H,Jogos!$I:$I,$C72)","v":10},{"$f":"SUMIFS(Jogos!$H:$H,Jogos!$E:$E,$C72)+SUMIFS(Jogos!$F:$F,Jogos!$I:$I,$C72)+COUNTIFS(Jogos!$S:$S,\"WWIND\",Jogos!$E:$E,$C72)*2+COUNTIFS(Jogos!$S:$S,\"WWIND\",Jogos!$I:$I,$C72)*2","v":7},3,{"$nulls":3},9,{"v":0.5555555555555556,"d":"55.6%"}]
[null,null,"Marco Andre Veloso",7,{"$f":"COUNTIFS(Jogos!$E:$E,$C73,Jogos!$N:$N,\"V\")+COUNTIFS(Jogos!$I:$I,$C73,Jogos!$O:$O,\"V\")","v":2},{"$f":"COUNTIFS(Jogos!$E:$E,$C73,Jogos!$N:$N,\"E\")+COUNTIFS(Jogos!$I:$I,$C73,Jogos!$O:$O,\"E\")","v":1},{"$f":"COUNTIFS(Jogos!$E:$E,$C73,Jogos!$N:$N,\"D\")+COUNTIFS(Jogos!$I:$I,$C73,Jogos!$O:$O,\"D\")","v":3},{"$f":"SUMIFS(Jogos!$F:$F,Jogos!$E:$E,$C73)+SUMIFS(Jogos!$H:$H,Jogos!$I:$I,$C73)","v":6},{"$f":"SUMIFS(Jogos!$H:$H,Jogos!$E:$E,$C73)+SUMIFS(Jogos!$F:$F,Jogos!$I:$I,$C73)+COUNTIFS(Jogos!$S:$S,\"WWIND\",Jogos!$E:$E,$C73)*2+COUNTIFS(Jogos!$S:$S,\"WWIND\",Jogos!$I:$I,$C73)*2","v":9},-3,{"$nulls":3},6,{"v":0.3888888888888889,"d":"38.9%"}]
[null,null,"Pablo Sidarta",11,{"$f":"COUNTIFS(Jogos!$E:$E,$C74,Jogos!$N:$N,\"V\")+COUNTIFS(Jogos!$I:$I,$C74,Jogos!$O:$O,\"V\")","v":2},{"$f":"COUNTIFS(Jogos!$E:$E,$C74,Jogos!$N:$N,\"E\")+COUNTIFS(Jogos!$I:$I,$C74,Jogos!$O:$O,\"E\")","v":5},{"$f":"COUNTIFS(Jogos!$E:$E,$C74,Jogos!$N:$N,\"D\")+COUNTIFS(Jogos!$I:$I,$C74,Jogos!$O:$O,\"D\")","v":2},{"$f":"SUMIFS(Jogos!$F:$F,Jogos!$E:$E,$C74)+SUMIFS(Jogos!$H:$H,Jogos!$I:$I,$C74)","v":11},{"$f":"SUMIFS(Jogos!$H:$H,Jogos!$E:$E,$C74)+SUMIFS(Jogos!$F:$F,Jogos!$I:$I,$C74)+COUNTIFS(Jogos!$S:$S,\"WWIND\",Jogos!$E:$E,$C74)*2+COUNTIFS(Jogos!$S:$S,\"WWIND\",Jogos!$I:$I,$C74)*2","v":10},1,{"$nulls":3},9,{"v":0.4074074074074074,"d":"40.7%"}]
[null,null,"Ricardo Machado",4,{"$f":"COUNTIFS(Jogos!$E:$E,$C75,Jogos!$N:$N,\"V\")+COUNTIFS(Jogos!$I:$I,$C75,Jogos!$O:$O,\"V\")","v":1},{"$f":"COUNTIFS(Jogos!$E:$E,$C75,Jogos!$N:$N,\"E\")+COUNTIFS(Jogos!$I:$I,$C75,Jogos!$O:$O,\"E\")","v":1},{"$f":"COUNTIFS(Jogos!$E:$E,$C75,Jogos!$N:$N,\"D\")+COUNTIFS(Jogos!$I:$I,$C75,Jogos!$O:$O,\"D\")","v":2},{"$f":"SUMIFS(Jogos!$F:$F,Jogos!$E:$E,$C75)+SUMIFS(Jogos!$H:$H,Jogos!$I:$I,$C75)","v":3},{"$f":"SUMIFS(Jogos!$H:$H,Jogos!$E:$E,$C75)+SUMIFS(Jogos!$F:$F,Jogos!$I:$I,$C75)+COUNTIFS(Jogos!$S:$S,\"WWIND\",Jogos!$E:$E,$C75)*2+COUNTIFS(Jogos!$S:$S,\"WWIND\",Jogos!$I:$I,$C75)*2","v":6},-3,{"$nulls":3},4,{"v":0.3333333333333333,"d":"33.3%"}]
[null,{"v":13,"d":"13º"},"CHACAL [A]",{"$f":"SUMIFS(ClaOUR!D:D,ClaOUR!$C:$C,$C76)+SUMIFS(ClaPRA!D:D,ClaPRA!$C:$C,$C76)","v":10},{"$f":"SUMIFS(ClaOUR!E:E,ClaOUR!$C:$C,$C76)+SUMIFS(ClaPRA!E:E,ClaPRA!$C:$C,$C76)","v":3},{"$f":"SUMIFS(ClaOUR!F:F,ClaOUR!$C:$C,$C76)+SUMIFS(ClaPRA!F:F,ClaPRA!$C:$C,$C76)","v":1},{"$f":"SUMIFS(ClaOUR!G:G,ClaOUR!$C:$C,$C76)+SUMIFS(ClaPRA!G:G,ClaPRA!$C:$C,$C76)","v":6},{"$f":"SUMIFS(ClaOUR!H:H,ClaOUR!$C:$C,$C76)+SUMIFS(ClaPRA!H:H,ClaPRA!$C:$C,$C76)","v":10},{"$f":"SUMIFS(ClaOUR!I:I,ClaOUR!$C:$C,$C76)+SUMIFS(ClaPRA!I:I,ClaPRA!$C:$C,$C76)","v":16},{"$f":"SUMIFS(ClaOUR!J:J,ClaOUR!$C:$C,$C76)+SUMIFS(ClaPRA!J:J,ClaPRA!$C:$C,$C76)","v":-6},{"$f":"SUMIFS(ClaOUR!K:K,ClaOUR!$C:$C,$C76)+SUMIFS(ClaPRA!K:K,ClaPRA!$C:$C,$C76)","v":48},{"$f":"SUMIFS(ClaOUR!L:L,ClaOUR!$C:$C,$C76)+SUMIFS(ClaPRA!L:L,ClaPRA!$C:$C,$C76)","v":50},{"$f":"SUMIFS(ClaOUR!M:M,ClaOUR!$C:$C,$C76)+SUMIFS(ClaPRA!M:M,ClaPRA!$C:$C,$C76)","v":-2},10,{"$f":"D76/(N76*3)","v":{"v":0.3333333333333333,"d":"33.3%"}}]
[null,null,"Janilson Pereira",13,{"$f":"COUNTIFS(Jogos!$E:$E,$C77,Jogos!$N:$N,\"V\")+COUNTIFS(Jogos!$I:$I,$C77,Jogos!$O:$O,\"V\")","v":4},{"$f":"COUNTIFS(Jogos!$E:$E,$C77,Jogos!$N:$N,\"E\")+COUNTIFS(Jogos!$I:$I,$C77,Jogos!$O:$O,\"E\")","v":1},{"$f":"COUNTIFS(Jogos!$E:$E,$C77,Jogos!$N:$N,\"D\")+COUNTIFS(Jogos!$I:$I,$C77,Jogos!$O:$O,\"D\")","v":4},{"$f":"SUMIFS(Jogos!$F:$F,Jogos!$E:$E,$C77)+SUMIFS(Jogos!$H:$H,Jogos!$I:$I,$C77)","v":12},{"$f":"SUMIFS(Jogos!$H:$H,Jogos!$E:$E,$C77)+SUMIFS(Jogos!$F:$F,Jogos!$I:$I,$C77)+COUNTIFS(Jogos!$S:$S,\"WWIND\",Jogos!$E:$E,$C77)*2+COUNTIFS(Jogos!$S:$S,\"WWIND\",Jogos!$I:$I,$C77)*2","v":10},2,{"$nulls":3},9,{"v":0.48148148148148145,"d":"48.1%"}]
[null,null,"Joao Francisco Stephan",4,{"$f":"COUNTIFS(Jogos!$E:$E,$C78,Jogos!$N:$N,\"V\")+COUNTIFS(Jogos!$I:$I,$C78,Jogos!$O:$O,\"V\")","v":1},{"$f":"COUNTIFS(Jogos!$E:$E,$C78,Jogos!$N:$N,\"E\")+COUNTIFS(Jogos!$I:$I,$C78,Jogos!$O:$O,\"E\")","v":1},{"$f":"COUNTIFS(Jogos!$E:$E,$C78,Jogos!$N:$N,\"D\")+COUNTIFS(Jogos!$I:$I,$C78,Jogos!$O:$O,\"D\")","v":1},{"$f":"SUMIFS(Jogos!$F:$F,Jogos!$E:$E,$C78)+SUMIFS(Jogos!$H:$H,Jogos!$I:$I,$C78)","v":4},{"$f":"SUMIFS(Jogos!$H:$H,Jogos!$E:$E,$C78)+SUMIFS(Jogos!$F:$F,Jogos!$I:$I,$C78)+COUNTIFS(Jogos!$S:$S,\"WWIND\",Jogos!$E:$E,$C78)*2+COUNTIFS(Jogos!$S:$S,\"WWIND\",Jogos!$I:$I,$C78)*2","v":3},1,{"$nulls":3},3,{"v":0.4444444444444444,"d":"44.4%"}]
[null,null,"Julio Celio Braga",7,{"$f":"COUNTIFS(Jogos!$E:$E,$C79,Jogos!$N:$N,\"V\")+COUNTIFS(Jogos!$I:$I,$C79,Jogos!$O:$O,\"V\")","v":1},{"$f":"COUNTIFS(Jogos!$E:$E,$C79,Jogos!$N:$N,\"E\")+COUNTIFS(Jogos!$I:$I,$C79,Jogos!$O:$O,\"E\")","v":4},{"$f":"COUNTIFS(Jogos!$E:$E,$C79,Jogos!$N:$N,\"D\")+COUNTIFS(Jogos!$I:$I,$C79,Jogos!$O:$O,\"D\")","v":4},{"$f":"SUMIFS(Jogos!$F:$F,Jogos!$E:$E,$C79)+SUMIFS(Jogos!$H:$H,Jogos!$I:$I,$C79)","v":12},{"$f":"SUMIFS(Jogos!$H:$H,Jogos!$E:$E,$C79)+SUMIFS(Jogos!$F:$F,Jogos!$I:$I,$C79)+COUNTIFS(Jogos!$S:$S,\"WWIND\",Jogos!$E:$E,$C79)*2+COUNTIFS(Jogos!$S:$S,\"WWIND\",Jogos!$I:$I,$C79)*2","v":14},-2,{"$nulls":3},9,{"v":0.25925925925925924,"d":"25.9%"}]
[null,null,"Paulo Mangia",4,{"$f":"COUNTIFS(Jogos!$E:$E,$C80,Jogos!$N:$N,\"V\")+COUNTIFS(Jogos!$I:$I,$C80,Jogos!$O:$O,\"V\")","v":0},{"$f":"COUNTIFS(Jogos!$E:$E,$C80,Jogos!$N:$N,\"E\")+COUNTIFS(Jogos!$I:$I,$C80,Jogos!$O:$O,\"E\")","v":4},{"$f":"COUNTIFS(Jogos!$E:$E,$C80,Jogos!$N:$N,\"D\")+COUNTIFS(Jogos!$I:$I,$C80,Jogos!$O:$O,\"D\")","v":5},{"$f":"SUMIFS(Jogos!$F:$F,Jogos!$E:$E,$C80)+SUMIFS(Jogos!$H:$H,Jogos!$I:$I,$C80)","v":4},{"$f":"SUMIFS(Jogos!$H:$H,Jogos!$E:$E,$C80)+SUMIFS(Jogos!$F:$F,Jogos!$I:$I,$C80)+COUNTIFS(Jogos!$S:$S,\"WWIND\",Jogos!$E:$E,$C80)*2+COUNTIFS(Jogos!$S:$S,\"WWIND\",Jogos!$I:$I,$C80)*2","v":12},-8,{"$nulls":3},9,{"v":0.14814814814814814,"d":"14.8%"}]
[null,null,"Thiago Stephan",16,{"$f":"COUNTIFS(Jogos!$E:$E,$C81,Jogos!$N:$N,\"V\")+COUNTIFS(Jogos!$I:$I,$C81,Jogos!$O:$O,\"V\")","v":4},{"$f":"COUNTIFS(Jogos!$E:$E,$C81,Jogos!$N:$N,\"E\")+COUNTIFS(Jogos!$I:$I,$C81,Jogos!$O:$O,\"E\")","v":4},{"$f":"COUNTIFS(Jogos!$E:$E,$C81,Jogos!$N:$N,\"D\")+COUNTIFS(Jogos!$I:$I,$C81,Jogos!$O:$O,\"D\")","v":2},{"$f":"SUMIFS(Jogos!$F:$F,Jogos!$E:$E,$C81)+SUMIFS(Jogos!$H:$H,Jogos!$I:$I,$C81)","v":16},{"$f":"SUMIFS(Jogos!$H:$H,Jogos!$E:$E,$C81)+SUMIFS(Jogos!$F:$F,Jogos!$I:$I,$C81)+COUNTIFS(Jogos!$S:$S,\"WWIND\",Jogos!$E:$E,$C81)*2+COUNTIFS(Jogos!$S:$S,\"WWIND\",Jogos!$I:$I,$C81)*2","v":11},5,{"$nulls":3},10,{"v":0.5333333333333333,"d":"53.3%"}]
[null,{"v":14,"d":"14º"},"ELDORADO",{"$f":"SUMIFS(ClaOUR!D:D,ClaOUR!$C:$C,$C82)+SUMIFS(ClaPRA!D:D,ClaPRA!$C:$C,$C82)","v":7},{"$f":"SUMIFS(ClaOUR!E:E,ClaOUR!$C:$C,$C82)+SUMIFS(ClaPRA!E:E,ClaPRA!$C:$C,$C82)","v":2},{"$f":"SUMIFS(ClaOUR!F:F,ClaOUR!$C:$C,$C82)+SUMIFS(ClaPRA!F:F,ClaPRA!$C:$C,$C82)","v":1},{"$f":"SUMIFS(ClaOUR!G:G,ClaOUR!$C:$C,$C82)+SUMIFS(ClaPRA!G:G,ClaPRA!$C:$C,$C82)","v":6},{"$f":"SUMIFS(ClaOUR!H:H,ClaOUR!$C:$C,$C82)+SUMIFS(ClaPRA!H:H,ClaPRA!$C:$C,$C82)","v":6},{"$f":"SUMIFS(ClaOUR!I:I,ClaOUR!$C:$C,$C82)+SUMIFS(ClaPRA!I:I,ClaPRA!$C:$C,$C82)","v":18},{"$f":"SUMIFS(ClaOUR!J:J,ClaOUR!$C:$C,$C82)+SUMIFS(ClaPRA!J:J,ClaPRA!$C:$C,$C82)","v":-12},{"$f":"SUMIFS(ClaOUR!K:K,ClaOUR!$C:$C,$C82)+SUMIFS(ClaPRA!K:K,ClaPRA!$C:$C,$C82)","v":24},{"$f":"SUMIFS(ClaOUR!L:L,ClaOUR!$C:$C,$C82)+SUMIFS(ClaPRA!L:L,ClaPRA!$C:$C,$C82)","v":42},{"$f":"SUMIFS(ClaOUR!M:M,ClaOUR!$C:$C,$C82)+SUMIFS(ClaPRA!M:M,ClaPRA!$C:$C,$C82)","v":-18},9,{"$f":"D82/(N82*3)","v":{"v":0.25925925925925924,"d":"25.9%"}}]
[null,null,"Alex Lage",7,{"$f":"COUNTIFS(Jogos!$E:$E,$C83,Jogos!$N:$N,\"V\")+COUNTIFS(Jogos!$I:$I,$C83,Jogos!$O:$O,\"V\")","v":1},{"$f":"COUNTIFS(Jogos!$E:$E,$C83,Jogos!$N:$N,\"E\")+COUNTIFS(Jogos!$I:$I,$C83,Jogos!$O:$O,\"E\")","v":4},{"$f":"COUNTIFS(Jogos!$E:$E,$C83,Jogos!$N:$N,\"D\")+COUNTIFS(Jogos!$I:$I,$C83,Jogos!$O:$O,\"D\")","v":4},{"$f":"SUMIFS(Jogos!$F:$F,Jogos!$E:$E,$C83)+SUMIFS(Jogos!$H:$H,Jogos!$I:$I,$C83)","v":9},{"$f":"SUMIFS(Jogos!$H:$H,Jogos!$E:$E,$C83)+SUMIFS(Jogos!$F:$F,Jogos!$I:$I,$C83)+COUNTIFS(Jogos!$S:$S,\"WWIND\",Jogos!$E:$E,$C83)*2+COUNTIFS(Jogos!$S:$S,\"WWIND\",Jogos!$I:$I,$C83)*2","v":15},-6,{"$nulls":3},9,{"v":0.25925925925925924,"d":"25.9%"}]
[null,null,"Bernardo Pires",2,{"$f":"COUNTIFS(Jogos!$E:$E,$C84,Jogos!$N:$N,\"V\")+COUNTIFS(Jogos!$I:$I,$C84,Jogos!$O:$O,\"V\")","v":0},{"$f":"COUNTIFS(Jogos!$E:$E,$C84,Jogos!$N:$N,\"E\")+COUNTIFS(Jogos!$I:$I,$C84,Jogos!$O:$O,\"E\")","v":2},{"$f":"COUNTIFS(Jogos!$E:$E,$C84,Jogos!$N:$N,\"D\")+COUNTIFS(Jogos!$I:$I,$C84,Jogos!$O:$O,\"D\")","v":7},{"$f":"SUMIFS(Jogos!$F:$F,Jogos!$E:$E,$C84)+SUMIFS(Jogos!$H:$H,Jogos!$I:$I,$C84)","v":2},{"$f":"SUMIFS(Jogos!$H:$H,Jogos!$E:$E,$C84)+SUMIFS(Jogos!$F:$F,Jogos!$I:$I,$C84)+COUNTIFS(Jogos!$S:$S,\"WWIND\",Jogos!$E:$E,$C84)*2+COUNTIFS(Jogos!$S:$S,\"WWIND\",Jogos!$I:$I,$C84)*2","v":13},-11,{"$nulls":3},9,{"v":0.07407407407407407,"d":"7.4%"}]
[null,null,"Jorge Dias",8,{"$f":"COUNTIFS(Jogos!$E:$E,$C85,Jogos!$N:$N,\"V\")+COUNTIFS(Jogos!$I:$I,$C85,Jogos!$O:$O,\"V\")","v":2},{"$f":"COUNTIFS(Jogos!$E:$E,$C85,Jogos!$N:$N,\"E\")+COUNTIFS(Jogos!$I:$I,$C85,Jogos!$O:$O,\"E\")","v":2},{"$f":"COUNTIFS(Jogos!$E:$E,$C85,Jogos!$N:$N,\"D\")+COUNTIFS(Jogos!$I:$I,$C85,Jogos!$O:$O,\"D\")","v":5},{"$f":"SUMIFS(Jogos!$F:$F,Jogos!$E:$E,$C85)+SUMIFS(Jogos!$H:$H,Jogos!$I:$I,$C85)","v":7},{"$f":"SUMIFS(Jogos!$H:$H,Jogos!$E:$E,$C85)+SUMIFS(Jogos!$F:$F,Jogos!$I:$I,$C85)+COUNTIFS(Jogos!$S:$S,\"WWIND\",Jogos!$E:$E,$C85)*2+COUNTIFS(Jogos!$S:$S,\"WWIND\",Jogos!$I:$I,$C85)*2","v":9},-2,{"$nulls":3},9,{"v":0.2962962962962963,"d":"29.6%"}]
[null,null,"Jose Pires",13,{"$f":"COUNTIFS(Jogos!$E:$E,$C86,Jogos!$N:$N,\"V\")+COUNTIFS(Jogos!$I:$I,$C86,Jogos!$O:$O,\"V\")","v":3},{"$f":"COUNTIFS(Jogos!$E:$E,$C86,Jogos!$N:$N,\"E\")+COUNTIFS(Jogos!$I:$I,$C86,Jogos!$O:$O,\"E\")","v":4},{"$f":"COUNTIFS(Jogos!$E:$E,$C86,Jogos!$N:$N,\"D\")+COUNTIFS(Jogos!$I:$I,$C86,Jogos!$O:$O,\"D\")","v":2},{"$f":"SUMIFS(Jogos!$F:$F,Jogos!$E:$E,$C86)+SUMIFS(Jogos!$H:$H,Jogos!$I:$I,$C86)","v":6},{"$f":"SUMIFS(Jogos!$H:$H,Jogos!$E:$E,$C86)+SUMIFS(Jogos!$F:$F,Jogos!$I:$I,$C86)+COUNTIFS(Jogos!$S:$S,\"WWIND\",Jogos!$E:$E,$C86)*2+COUNTIFS(Jogos!$S:$S,\"WWIND\",Jogos!$I:$I,$C86)*2","v":5},1,{"$nulls":3},9,{"v":0.48148148148148145,"d":"48.1%"}]
[null,{"v":15,"d":"15º"},"GRÊMIO MINEIRO",{"$f":"SUMIFS(ClaOUR!D:D,ClaOUR!$C:$C,$C87)+SUMIFS(ClaPRA!D:D,ClaPRA!$C:$C,$C87)","v":5},{"$f":"SUMIFS(ClaOUR!E:E,ClaOUR!$C:$C,$C87)+SUMIFS(ClaPRA!E:E,ClaPRA!$C:$C,$C87)","v":1},{"$f":"SUMIFS(ClaOUR!F:F,ClaOUR!$C:$C,$C87)+SUMIFS(ClaPRA!F:F,ClaPRA!$C:$C,$C87)","v":2},{"$f":"SUMIFS(ClaOUR!G:G,ClaOUR!$C:$C,$C87)+SUMIFS(ClaPRA!G:G,ClaPRA!$C:$C,$C87)","v":6},{"$f":"SUMIFS(ClaOUR!H:H,ClaOUR!$C:$C,$C87)+SUMIFS(ClaPRA!H:H,ClaPRA!$C:$C,$C87)","v":7},{"$f":"SUMIFS(ClaOUR!I:I,ClaOUR!$C:$C,$C87)+SUMIFS(ClaPRA!I:I,ClaPRA!$C:$C,$C87)","v":22},{"$f":"SUMIFS(ClaOUR!J:J,ClaOUR!$C:$C,$C87)+SUMIFS(ClaPRA!J:J,ClaPRA!$C:$C,$C87)","v":-15},{"$f":"SUMIFS(ClaOUR!K:K,ClaOUR!$C:$C,$C87)+SUMIFS(ClaPRA!K:K,ClaPRA!$C:$C,$C87)","v":33},{"$f":"SUMIFS(ClaOUR!L:L,ClaOUR!$C:$C,$C87)+SUMIFS(ClaPRA!L:L,ClaPRA!$C:$C,$C87)","v":63},{"$f":"SUMIFS(ClaOUR!M:M,ClaOUR!$C:$C,$C87)+SUMIFS(ClaPRA!M:M,ClaPRA!$C:$C,$C87)","v":-30},9,{"$f":"D87/(N87*3)","v":{"v":0.18518518518518517,"d":"18.5%"}}]
[null,null,"Fernando Vianna",5,{"$f":"COUNTIFS(Jogos!$E:$E,$C88,Jogos!$N:$N,\"V\")+COUNTIFS(Jogos!$I:$I,$C88,Jogos!$O:$O,\"V\")","v":1},{"$f":"COUNTIFS(Jogos!$E:$E,$C88,Jogos!$N:$N,\"E\")+COUNTIFS(Jogos!$I:$I,$C88,Jogos!$O:$O,\"E\")","v":2},{"$f":"COUNTIFS(Jogos!$E:$E,$C88,Jogos!$N:$N,\"D\")+COUNTIFS(Jogos!$I:$I,$C88,Jogos!$O:$O,\"D\")","v":6},{"$f":"SUMIFS(Jogos!$F:$F,Jogos!$E:$E,$C88)+SUMIFS(Jogos!$H:$H,Jogos!$I:$I,$C88)","v":5},{"$f":"SUMIFS(Jogos!$H:$H,Jogos!$E:$E,$C88)+SUMIFS(Jogos!$F:$F,Jogos!$I:$I,$C88)+COUNTIFS(Jogos!$S:$S,\"WWIND\",Jogos!$E:$E,$C88)*2+COUNTIFS(Jogos!$S:$S,\"WWIND\",Jogos!$I:$I,$C88)*2","v":14},-9,{"$nulls":3},9,{"v":0.18518518518518517,"d":"18.5%"}]
[null,null,"Gustavo Lopes",10,{"$f":"COUNTIFS(Jogos!$E:$E,$C89,Jogos!$N:$N,\"V\")+COUNTIFS(Jogos!$I:$I,$C89,Jogos!$O:$O,\"V\")","v":2},{"$f":"COUNTIFS(Jogos!$E:$E,$C89,Jogos!$N:$N,\"E\")+COUNTIFS(Jogos!$I:$I,$C89,Jogos!$O:$O,\"E\")","v":4},{"$f":"COUNTIFS(Jogos!$E:$E,$C89,Jogos!$N:$N,\"D\")+COUNTIFS(Jogos!$I:$I,$C89,Jogos!$O:$O,\"D\")","v":3},{"$f":"SUMIFS(Jogos!$F:$F,Jogos!$E:$E,$C89)+SUMIFS(Jogos!$H:$H,Jogos!$I:$I,$C89)","v":7},{"$f":"SUMIFS(Jogos!$H:$H,Jogos!$E:$E,$C89)+SUMIFS(Jogos!$F:$F,Jogos!$I:$I,$C89)+COUNTIFS(Jogos!$S:$S,\"WWIND\",Jogos!$E:$E,$C89)*2+COUNTIFS(Jogos!$S:$S,\"WWIND\",Jogos!$I:$I,$C89)*2","v":7},0,{"$nulls":3},9,{"v":0.37037037037037035,"d":"37.0%"}]
[null,null,"Rodrigo Primola",1,{"$f":"COUNTIFS(Jogos!$E:$E,$C90,Jogos!$N:$N,\"V\")+COUNTIFS(Jogos!$I:$I,$C90,Jogos!$O:$O,\"V\")","v":0},{"$f":"COUNTIFS(Jogos!$E:$E,$C90,Jogos!$N:$N,\"E\")+COUNTIFS(Jogos!$I:$I,$C90,Jogos!$O:$O,\"E\")","v":1},{"$f":"COUNTIFS(Jogos!$E:$E,$C90,Jogos!$N:$N,\"D\")+COUNTIFS(Jogos!$I:$I,$C90,Jogos!$O:$O,\"D\")","v":8},{"$f":"SUMIFS(Jogos!$F:$F,Jogos!$E:$E,$C90)+SUMIFS(Jogos!$H:$H,Jogos!$I:$I,$C90)","v":5},{"$f":"SUMIFS(Jogos!$H:$H,Jogos!$E:$E,$C90)+SUMIFS(Jogos!$F:$F,Jogos!$I:$I,$C90)+COUNTIFS(Jogos!$S:$S,\"WWIND\",Jogos!$E:$E,$C90)*2+COUNTIFS(Jogos!$S:$S,\"WWIND\",Jogos!$I:$I,$C90)*2","v":25},-20,{"$nulls":3},9,{"v":0.037037037037037035,"d":"3.7%"}]
[null,null,"Vander Felipe",12,{"$f":"COUNTIFS(Jogos!$E:$E,$C91,Jogos!$N:$N,\"V\")+COUNTIFS(Jogos!$I:$I,$C91,Jogos!$O:$O,\"V\")","v":4},{"$f":"COUNTIFS(Jogos!$E:$E,$C91,Jogos!$N:$N,\"E\")+COUNTIFS(Jogos!$I:$I,$C91,Jogos!$O:$O,\"E\")","v":0},{"$f":"COUNTIFS(Jogos!$E:$E,$C91,Jogos!$N:$N,\"D\")+COUNTIFS(Jogos!$I:$I,$C91,Jogos!$O:$O,\"D\")","v":5},{"$f":"SUMIFS(Jogos!$F:$F,Jogos!$E:$E,$C91)+SUMIFS(Jogos!$H:$H,Jogos!$I:$I,$C91)","v":16},{"$f":"SUMIFS(Jogos!$H:$H,Jogos!$E:$E,$C91)+SUMIFS(Jogos!$F:$F,Jogos!$I:$I,$C91)+COUNTIFS(Jogos!$S:$S,\"WWIND\",Jogos!$E:$E,$C91)*2+COUNTIFS(Jogos!$S:$S,\"WWIND\",Jogos!$I:$I,$C91)*2","v":17},-1,{"$nulls":3},9,{"v":0.4444444444444444,"d":"44.4%"}]
[null,{"v":16,"d":"16º"},"MATIAS [B]",{"$f":"SUMIFS(ClaOUR!D:D,ClaOUR!$C:$C,$C92)+SUMIFS(ClaPRA!D:D,ClaPRA!$C:$C,$C92)","v":1},{"$f":"SUMIFS(ClaOUR!E:E,ClaOUR!$C:$C,$C92)+SUMIFS(ClaPRA!E:E,ClaPRA!$C:$C,$C92)","v":0},{"$f":"SUMIFS(ClaOUR!F:F,ClaOUR!$C:$C,$C92)+SUMIFS(ClaPRA!F:F,ClaPRA!$C:$C,$C92)","v":1},{"$f":"SUMIFS(ClaOUR!G:G,ClaOUR!$C:$C,$C92)+SUMIFS(ClaPRA!G:G,ClaPRA!$C:$C,$C92)","v":8},{"$f":"SUMIFS(ClaOUR!H:H,ClaOUR!$C:$C,$C92)+SUMIFS(ClaPRA!H:H,ClaPRA!$C:$C,$C92)","v":4},{"$f":"SUMIFS(ClaOUR!I:I,ClaOUR!$C:$C,$C92)+SUMIFS(ClaPRA!I:I,ClaPRA!$C:$C,$C92)","v":24},{"$f":"SUMIFS(ClaOUR!J:J,ClaOUR!$C:$C,$C92)+SUMIFS(ClaPRA!J:J,ClaPRA!$C:$C,$C92)","v":-20},{"$f":"SUMIFS(ClaOUR!K:K,ClaOUR!$C:$C,$C92)+SUMIFS(ClaPRA!K:K,ClaPRA!$C:$C,$C92)","v":18},{"$f":"SUMIFS(ClaOUR!L:L,ClaOUR!$C:$C,$C92)+SUMIFS(ClaPRA!L:L,ClaPRA!$C:$C,$C92)","v":61},{"$f":"SUMIFS(ClaOUR!M:M,ClaOUR!$C:$C,$C92)+SUMIFS(ClaPRA!M:M,ClaPRA!$C:$C,$C92)","v":-43},9,{"$f":"D92/(N92*3)","v":{"v":0.037037037037037035,"d":"3.7%"}}]
[null,null,"Ailson Brites",2,{"$f":"COUNTIFS(Jogos!$E:$E,$C93,Jogos!$N:$N,\"V\")+COUNTIFS(Jogos!$I:$I,$C93,Jogos!$O:$O,\"V\")","v":0},{"$f":"COUNTIFS(Jogos!$E:$E,$C93,Jogos!$N:$N,\"E\")+COUNTIFS(Jogos!$I:$I,$C93,Jogos!$O:$O,\"E\")","v":2},{"$f":"COUNTIFS(Jogos!$E:$E,$C93,Jogos!$N:$N,\"D\")+COUNTIFS(Jogos!$I:$I,$C93,Jogos!$O:$O,\"D\")","v":7},{"$f":"SUMIFS(Jogos!$F:$F,Jogos!$E:$E,$C93)+SUMIFS(Jogos!$H:$H,Jogos!$I:$I,$C93)","v":6},{"$f":"SUMIFS(Jogos!$H:$H,Jogos!$E:$E,$C93)+SUMIFS(Jogos!$F:$F,Jogos!$I:$I,$C93)+COUNTIFS(Jogos!$S:$S,\"WWIND\",Jogos!$E:$E,$C93)*2+COUNTIFS(Jogos!$S:$S,\"WWIND\",Jogos!$I:$I,$C93)*2","v":17},-11,{"$nulls":3},9,{"v":0.07407407407407407,"d":"7.4%"}]
[null,null,"Eber Chapinotti",8,{"$f":"COUNTIFS(Jogos!$E:$E,$C94,Jogos!$N:$N,\"V\")+COUNTIFS(Jogos!$I:$I,$C94,Jogos!$O:$O,\"V\")","v":2},{"$f":"COUNTIFS(Jogos!$E:$E,$C94,Jogos!$N:$N,\"E\")+COUNTIFS(Jogos!$I:$I,$C94,Jogos!$O:$O,\"E\")","v":2},{"$f":"COUNTIFS(Jogos!$E:$E,$C94,Jogos!$N:$N,\"D\")+COUNTIFS(Jogos!$I:$I,$C94,Jogos!$O:$O,\"D\")","v":3},{"$f":"SUMIFS(Jogos!$F:$F,Jogos!$E:$E,$C94)+SUMIFS(Jogos!$H:$H,Jogos!$I:$I,$C94)","v":5},{"$f":"SUMIFS(Jogos!$H:$H,Jogos!$E:$E,$C94)+SUMIFS(Jogos!$F:$F,Jogos!$I:$I,$C94)+COUNTIFS(Jogos!$S:$S,\"WWIND\",Jogos!$E:$E,$C94)*2+COUNTIFS(Jogos!$S:$S,\"WWIND\",Jogos!$I:$I,$C94)*2","v":8},-3,{"$nulls":3},7,{"v":0.38095238095238093,"d":"38.1%"}]
[null,null,"Humberto Ramos",0,{"$f":"COUNTIFS(Jogos!$E:$E,$C95,Jogos!$N:$N,\"V\")+COUNTIFS(Jogos!$I:$I,$C95,Jogos!$O:$O,\"V\")","v":0},{"$f":"COUNTIFS(Jogos!$E:$E,$C95,Jogos!$N:$N,\"E\")+COUNTIFS(Jogos!$I:$I,$C95,Jogos!$O:$O,\"E\")","v":0},{"$f":"COUNTIFS(Jogos!$E:$E,$C95,Jogos!$N:$N,\"D\")+COUNTIFS(Jogos!$I:$I,$C95,Jogos!$O:$O,\"D\")","v":3},{"$f":"SUMIFS(Jogos!$F:$F,Jogos!$E:$E,$C95)+SUMIFS(Jogos!$H:$H,Jogos!$I:$I,$C95)","v":0},{"$f":"SUMIFS(Jogos!$H:$H,Jogos!$E:$E,$C95)+SUMIFS(Jogos!$F:$F,Jogos!$I:$I,$C95)+COUNTIFS(Jogos!$S:$S,\"WWIND\",Jogos!$E:$E,$C95)*2+COUNTIFS(Jogos!$S:$S,\"WWIND\",Jogos!$I:$I,$C95)*2","v":11},-11,{"$nulls":3},3,{"v":0,"d":"0.0%"}]
[null,null,"Mario Cleber",1,{"$f":"COUNTIFS(Jogos!$E:$E,$C96,Jogos!$N:$N,\"V\")+COUNTIFS(Jogos!$I:$I,$C96,Jogos!$O:$O,\"V\")","v":0},{"$f":"COUNTIFS(Jogos!$E:$E,$C96,Jogos!$N:$N,\"E\")+COUNTIFS(Jogos!$I:$I,$C96,Jogos!$O:$O,\"E\")","v":1},{"$f":"COUNTIFS(Jogos!$E:$E,$C96,Jogos!$N:$N,\"D\")+COUNTIFS(Jogos!$I:$I,$C96,Jogos!$O:$O,\"D\")","v":4},{"$f":"SUMIFS(Jogos!$F:$F,Jogos!$E:$E,$C96)+SUMIFS(Jogos!$H:$H,Jogos!$I:$I,$C96)","v":0},{"$f":"SUMIFS(Jogos!$H:$H,Jogos!$E:$E,$C96)+SUMIFS(Jogos!$F:$F,Jogos!$I:$I,$C96)+COUNTIFS(Jogos!$S:$S,\"WWIND\",Jogos!$E:$E,$C96)*2+COUNTIFS(Jogos!$S:$S,\"WWIND\",Jogos!$I:$I,$C96)*2","v":10},-10,{"$nulls":3},5,{"v":0.06666666666666667,"d":"6.7%"}]
[null,null,"Ricardo Sartine",0,{"$f":"COUNTIFS(Jogos!$E:$E,$C97,Jogos!$N:$N,\"V\")+COUNTIFS(Jogos!$I:$I,$C97,Jogos!$O:$O,\"V\")","v":0},{"$f":"COUNTIFS(Jogos!$E:$E,$C97,Jogos!$N:$N,\"E\")+COUNTIFS(Jogos!$I:$I,$C97,Jogos!$O:$O,\"E\")","v":0},{"$f":"COUNTIFS(Jogos!$E:$E,$C97,Jogos!$N:$N,\"D\")+COUNTIFS(Jogos!$I:$I,$C97,Jogos!$O:$O,\"D\")","v":3},{"$f":"SUMIFS(Jogos!$F:$F,Jogos!$E:$E,$C97)+SUMIFS(Jogos!$H:$H,Jogos!$I:$I,$C97)","v":0},{"$f":"SUMIFS(Jogos!$H:$H,Jogos!$E:$E,$C97)+SUMIFS(Jogos!$F:$F,Jogos!$I:$I,$C97)+COUNTIFS(Jogos!$S:$S,\"WWIND\",Jogos!$E:$E,$C97)*2+COUNTIFS(Jogos!$S:$S,\"WWIND\",Jogos!$I:$I,$C97)*2","v":8},-8,{"$nulls":3},3,{"v":0,"d":"0.0%"}]
[null,null,"Romualdo Piccinini",9,{"$f":"COUNTIFS(Jogos!$E:$E,$C98,Jogos!$N:$N,\"V\")+COUNTIFS(Jogos!$I:$I,$C98,Jogos!$O:$O,\"V\")","v":2},{"$f":"COUNTIFS(Jogos!$E:$E,$C98,Jogos!$N:$N,\"E\")+COUNTIFS(Jogos!$I:$I,$C98,Jogos!$O:$O,\"E\")","v":3},{"$f":"COUNTIFS(Jogos!$E:$E,$C98,Jogos!$N:$N,\"D\")+COUNTIFS(Jogos!$I:$I,$C98,Jogos!$O:$O,\"D\")","v":4},{"$f":"SUMIFS(Jogos!$F:$F,Jogos!$E:$E,$C98)+SUMIFS(Jogos!$H:$H,Jogos!$I:$I,$C98)","v":7},{"$f":"SUMIFS(Jogos!$H:$H,Jogos!$E:$E,$C98)+SUMIFS(Jogos!$F:$F,Jogos!$I:$I,$C98)+COUNTIFS(Jogos!$S:$S,\"WWIND\",Jogos!$E:$E,$C98)*2+COUNTIFS(Jogos!$S:$S,\"WWIND\",Jogos!$I:$I,$C98)*2","v":7},0,{"$nulls":3},9,{"v":0.3333333333333333,"d":"33.3%"}]
[null,{"v":17,"d":"17º"},"CHACAL [B]",{"$f":"SUMIFS(ClaOUR!D:D,ClaOUR!$C:$C,$C99)+SUMIFS(ClaPRA!D:D,ClaPRA!$C:$C,$C99)","v":0},{"$f":"SUMIFS(ClaOUR!E:E,ClaOUR!$C:$C,$C99)+SUMIFS(ClaPRA!E:E,ClaPRA!$C:$C,$C99)","v":0},{"$f":"SUMIFS(ClaOUR!F:F,ClaOUR!$C:$C,$C99)+SUMIFS(ClaPRA!F:F,ClaPRA!$C:$C,$C99)","v":0},{"$f":"SUMIFS(ClaOUR!G:G,ClaOUR!$C:$C,$C99)+SUMIFS(ClaPRA!G:G,ClaPRA!$C:$C,$C99)","v":8},{"$f":"SUMIFS(ClaOUR!H:H,ClaOUR!$C:$C,$C99)+SUMIFS(ClaPRA!H:H,ClaPRA!$C:$C,$C99)","v":2},{"$f":"SUMIFS(ClaOUR!I:I,ClaOUR!$C:$C,$C99)+SUMIFS(ClaPRA!I:I,ClaPRA!$C:$C,$C99)","v":24},{"$f":"SUMIFS(ClaOUR!J:J,ClaOUR!$C:$C,$C99)+SUMIFS(ClaPRA!J:J,ClaPRA!$C:$C,$C99)","v":-22},{"$f":"SUMIFS(ClaOUR!K:K,ClaOUR!$C:$C,$C99)+SUMIFS(ClaPRA!K:K,ClaPRA!$C:$C,$C99)","v":10},{"$f":"SUMIFS(ClaOUR!L:L,ClaOUR!$C:$C,$C99)+SUMIFS(ClaPRA!L:L,ClaPRA!$C:$C,$C99)","v":68},{"$f":"SUMIFS(ClaOUR!M:M,ClaOUR!$C:$C,$C99)+SUMIFS(ClaPRA!M:M,ClaPRA!$C:$C,$C99)","v":-58},8,{"$f":"D99/(N99*3)","v":{"v":0,"d":"0.0%"}}]
[null,null,"Everton Costa",2,{"$f":"COUNTIFS(Jogos!$E:$E,$C100,Jogos!$N:$N,\"V\")+COUNTIFS(Jogos!$I:$I,$C100,Jogos!$O:$O,\"V\")","v":0},{"$f":"COUNTIFS(Jogos!$E:$E,$C100,Jogos!$N:$N,\"E\")+COUNTIFS(Jogos!$I:$I,$C100,Jogos!$O:$O,\"E\")","v":2},{"$f":"COUNTIFS(Jogos!$E:$E,$C100,Jogos!$N:$N,\"D\")+COUNTIFS(Jogos!$I:$I,$C100,Jogos!$O:$O,\"D\")","v":4},{"$f":"SUMIFS(Jogos!$F:$F,Jogos!$E:$E,$C100)+SUMIFS(Jogos!$H:$H,Jogos!$I:$I,$C100)","v":1},{"$f":"SUMIFS(Jogos!$H:$H,Jogos!$E:$E,$C100)+SUMIFS(Jogos!$F:$F,Jogos!$I:$I,$C100)+COUNTIFS(Jogos!$S:$S,\"WWIND\",Jogos!$E:$E,$C100)*2+COUNTIFS(Jogos!$S:$S,\"WWIND\",Jogos!$I:$I,$C100)*2","v":10},-9,{"$nulls":3},6,{"v":0.1111111111111111,"d":"11.1%"}]
[null,null,"Heman Junior",1,{"$f":"COUNTIFS(Jogos!$E:$E,$C101,Jogos!$N:$N,\"V\")+COUNTIFS(Jogos!$I:$I,$C101,Jogos!$O:$O,\"V\")","v":0},{"$f":"COUNTIFS(Jogos!$E:$E,$C101,Jogos!$N:$N,\"E\")+COUNTIFS(Jogos!$I:$I,$C101,Jogos!$O:$O,\"E\")","v":1},{"$f":"COUNTIFS(Jogos!$E:$E,$C101,Jogos!$N:$N,\"D\")+COUNTIFS(Jogos!$I:$I,$C101,Jogos!$O:$O,\"D\")","v":3},{"$f":"SUMIFS(Jogos!$F:$F,Jogos!$E:$E,$C101)+SUMIFS(Jogos!$H:$H,Jogos!$I:$I,$C101)","v":1},{"$f":"SUMIFS(Jogos!$H:$H,Jogos!$E:$E,$C101)+SUMIFS(Jogos!$F:$F,Jogos!$I:$I,$C101)+COUNTIFS(Jogos!$S:$S,\"WWIND\",Jogos!$E:$E,$C101)*2+COUNTIFS(Jogos!$S:$S,\"WWIND\",Jogos!$I:$I,$C101)*2","v":7},-6,{"$nulls":3},4,{"v":0.08333333333333333,"d":"8.3%"}]
[null,null,"Jefferson Rosa",3,{"$f":"COUNTIFS(Jogos!$E:$E,$C102,Jogos!$N:$N,\"V\")+COUNTIFS(Jogos!$I:$I,$C102,Jogos!$O:$O,\"V\")","v":1},{"$f":"COUNTIFS(Jogos!$E:$E,$C102,Jogos!$N:$N,\"E\")+COUNTIFS(Jogos!$I:$I,$C102,Jogos!$O:$O,\"E\")","v":0},{"$f":"COUNTIFS(Jogos!$E:$E,$C102,Jogos!$N:$N,\"D\")+COUNTIFS(Jogos!$I:$I,$C102,Jogos!$O:$O,\"D\")","v":4},{"$f":"SUMIFS(Jogos!$F:$F,Jogos!$E:$E,$C102)+SUMIFS(Jogos!$H:$H,Jogos!$I:$I,$C102)","v":2},{"$f":"SUMIFS(Jogos!$H:$H,Jogos!$E:$E,$C102)+SUMIFS(Jogos!$F:$F,Jogos!$I:$I,$C102)+COUNTIFS(Jogos!$S:$S,\"WWIND\",Jogos!$E:$E,$C102)*2+COUNTIFS(Jogos!$S:$S,\"WWIND\",Jogos!$I:$I,$C102)*2","v":13},-11,{"$nulls":3},5,{"v":0.2,"d":"20.0%"}]
[null,null,"Lucas Luna",3,{"$f":"COUNTIFS(Jogos!$E:$E,$C103,Jogos!$N:$N,\"V\")+COUNTIFS(Jogos!$I:$I,$C103,Jogos!$O:$O,\"V\")","v":1},{"$f":"COUNTIFS(Jogos!$E:$E,$C103,Jogos!$N:$N,\"E\")+COUNTIFS(Jogos!$I:$I,$C103,Jogos!$O:$O,\"E\")","v":0},{"$f":"COUNTIFS(Jogos!$E:$E,$C103,Jogos!$N:$N,\"D\")+COUNTIFS(Jogos!$I:$I,$C103,Jogos!$O:$O,\"D\")","v":6},{"$f":"SUMIFS(Jogos!$F:$F,Jogos!$E:$E,$C103)+SUMIFS(Jogos!$H:$H,Jogos!$I:$I,$C103)","v":4},{"$f":"SUMIFS(Jogos!$H:$H,Jogos!$E:$E,$C103)+SUMIFS(Jogos!$F:$F,Jogos!$I:$I,$C103)+COUNTIFS(Jogos!$S:$S,\"WWIND\",Jogos!$E:$E,$C103)*2+COUNTIFS(Jogos!$S:$S,\"WWIND\",Jogos!$I:$I,$C103)*2","v":17},-13,{"$nulls":3},7,{"v":0.14285714285714285,"d":"14.3%"}]
[null,null,"Pablino Colen",0,{"$f":"COUNTIFS(Jogos!$E:$E,$C104,Jogos!$N:$N,\"V\")+COUNTIFS(Jogos!$I:$I,$C104,Jogos!$O:$O,\"V\")","v":0},{"$f":"COUNTIFS(Jogos!$E:$E,$C104,Jogos!$N:$N,\"E\")+COUNTIFS(Jogos!$I:$I,$C104,Jogos!$O:$O,\"E\")","v":0},{"$f":"COUNTIFS(Jogos!$E:$E,$C104,Jogos!$N:$N,\"D\")+COUNTIFS(Jogos!$I:$I,$C104,Jogos!$O:$O,\"D\")","v":2},{"$f":"SUMIFS(Jogos!$F:$F,Jogos!$E:$E,$C104)+SUMIFS(Jogos!$H:$H,Jogos!$I:$I,$C104)","v":0},{"$f":"SUMIFS(Jogos!$H:$H,Jogos!$E:$E,$C104)+SUMIFS(Jogos!$F:$F,Jogos!$I:$I,$C104)+COUNTIFS(Jogos!$S:$S,\"WWIND\",Jogos!$E:$E,$C104)*2+COUNTIFS(Jogos!$S:$S,\"WWIND\",Jogos!$I:$I,$C104)*2","v":3},-3,{"$nulls":3},2,{"v":0,"d":"0.0%"}]
[null,null,"Rodolfo Magalhaes",3,{"$f":"COUNTIFS(Jogos!$E:$E,$C105,Jogos!$N:$N,\"V\")+COUNTIFS(Jogos!$I:$I,$C105,Jogos!$O:$O,\"V\")","v":0},{"$f":"COUNTIFS(Jogos!$E:$E,$C105,Jogos!$N:$N,\"E\")+COUNTIFS(Jogos!$I:$I,$C105,Jogos!$O:$O,\"E\")","v":3},{"$f":"COUNTIFS(Jogos!$E:$E,$C105,Jogos!$N:$N,\"D\")+COUNTIFS(Jogos!$I:$I,$C105,Jogos!$O:$O,\"D\")","v":2},{"$f":"SUMIFS(Jogos!$F:$F,Jogos!$E:$E,$C105)+SUMIFS(Jogos!$H:$H,Jogos!$I:$I,$C105)","v":2},{"$f":"SUMIFS(Jogos!$H:$H,Jogos!$E:$E,$C105)+SUMIFS(Jogos!$F:$F,Jogos!$I:$I,$C105)+COUNTIFS(Jogos!$S:$S,\"WWIND\",Jogos!$E:$E,$C105)*2+COUNTIFS(Jogos!$S:$S,\"WWIND\",Jogos!$I:$I,$C105)*2","v":6},-4,{"$nulls":3},5,{"v":0.2,"d":"20.0%"}]
[null,null,"Vanderley da Silva",0,{"$f":"COUNTIFS(Jogos!$E:$E,$C106,Jogos!$N:$N,\"V\")+COUNTIFS(Jogos!$I:$I,$C106,Jogos!$O:$O,\"V\")","v":0},{"$f":"COUNTIFS(Jogos!$E:$E,$C106,Jogos!$N:$N,\"E\")+COUNTIFS(Jogos!$I:$I,$C106,Jogos!$O:$O,\"E\")","v":0},{"$f":"COUNTIFS(Jogos!$E:$E,$C106,Jogos!$N:$N,\"D\")+COUNTIFS(Jogos!$I:$I,$C106,Jogos!$O:$O,\"D\")","v":3},{"$f":"SUMIFS(Jogos!$F:$F,Jogos!$E:$E,$C106)+SUMIFS(Jogos!$H:$H,Jogos!$I:$I,$C106)","v":0},{"$f":"SUMIFS(Jogos!$H:$H,Jogos!$E:$E,$C106)+SUMIFS(Jogos!$F:$F,Jogos!$I:$I,$C106)+COUNTIFS(Jogos!$S:$S,\"WWIND\",Jogos!$E:$E,$C106)*2+COUNTIFS(Jogos!$S:$S,\"WWIND\",Jogos!$I:$I,$C106)*2","v":12},-12,{"$nulls":3},3,{"v":0,"d":"0.0%"}]

{"sheet":"ClaOUR","index":6,"n_rows":52,"n_cols":14,"rows_kept":52}
[{"$f":"ClaFIN!A1","v":"XL CAMPEONATO BRASILEIRO INTERCLUBES / 2022"}]
[{"$f":"ClaFIN!A2","v":"Matias Barbosa / MG, 15 a 17 de abril de 2022"}]
[]
["TAÇA DE OURO",null,null,"PG","V","E","D","GP","GC","SG","GPI","GCI","SGI","J"]
["PRIMEIRA FASE"]
[{"v":1,"d":"01"},{"v":1,"d":"1º"},"TUPI [A]",{"$f":"E6*3+F6","v":24},{"$f":"COUNTIFS(Jogos!$N:$N,\"V\",Jogos!$D:$D,$A6,Jogos!$E:$E,$C6)+COUNTIFS(Jogos!$O:$O,\"V\",Jogos!$D:$D,$A6,Jogos!$I:$I,$C6)","v":8},{"$f":"COUNTIFS(Jogos!$N:$N,\"E\",Jogos!$D:$D,$A6,Jogos!$E:$E,$C6)+COUNTIFS(Jogos!$O:$O,\"E\",Jogos!$D:$D,$A6,Jogos!$I:$I,$C6)","v":0},{"$f":"COUNTIFS(Jogos!$N:$N,\"D\",Jogos!$D:$D,$A6,Jogos!$E:$E,$C6)+COUNTIFS(Jogos!$O:$O,\"D\",Jogos!$D:$D,$A6,Jogos!$I:$I,$C6)","v":0},{"$f":"SUMIFS(Jogos!$L:$L,Jogos!$D:$D,$A6,Jogos!$E:$E,$C6)+SUMIFS(Jogos!$Q:$Q,Jogos!$D:$D,$A6,Jogos!$I:$I,$C6)","v":21},{"$f":"SUMIFS(Jogos!$Q:$Q,Jogos!$D:$D,$A6,Jogos!$E:$E,$C6)+SUMIFS(Jogos!$L:$L,Jogos!$D:$D,$A6,Jogos!$I:$I,$C6)","v":2},{"$f":"H6-I6","v":19},{"$f":"SUMIFS(Jogos!$M:$M,Jogos!$D:$D,$A6,Jogos!$E:$E,$C6)+SUMIFS(Jogos!$P:$P,Jogos!$D:$D,$A6,Jogos!$I:$I,$C6)","v":57},{"$f":"SUMIFS(Jogos!$P:$P,Jogos!$D:$D,$A6,Jogos!$E:$E,$C6)+SUMIFS(Jogos!$M:$M,Jogos!$D:$D,$A6,Jogos!$I:$I,$C6)","v":22},{"$f":"K6-L6","v":35},{"$f":"SUM(E6:G6)","v":8}]
[{"v":1,"d":"01"},{"v":2,"d":"2º"},"BOTAFOGO",16,{"$f":"COUNTIFS(Jogos!$N:$N,\"V\",Jogos!$D:$D,$A7,Jogos!$E:$E,$C7)+COUNTIFS(Jogos!$O:$O,\"V\",Jogos!$D:$D,$A7,Jogos!$I:$I,$C7)","v":5},{"$f":"COUNTIFS(Jogos!$N:$N,\"E\",Jogos!$D:$D,$A7,Jogos!$E:$E,$C7)+COUNTIFS(Jogos!$O:$O,\"E\",Jogos!$D:$D,$A7,Jogos!$I:$I,$C7)","v":1},{"$f":"COUNTIFS(Jogos!$N:$N,\"D\",Jogos!$D:$D,$A7,Jogos!$E:$E,$C7)+COUNTIFS(Jogos!$O:$O,\"D\",Jogos!$D:$D,$A7,Jogos!$I:$I,$C7)","v":2},{"$f":"SUMIFS(Jogos!$L:$L,Jogos!$D:$D,$A7,Jogos!$E:$E,$C7)+SUMIFS(Jogos!$Q:$Q,Jogos!$D:$D,$A7,Jogos!$I:$I,$C7)","v":17},{"$f":"SUMIFS(Jogos!$Q:$Q,Jogos!$D:$D,$A7,Jogos!$E:$E,$C7)+SUMIFS(Jogos!$L:$L,Jogos!$D:$D,$A7,Jogos!$I:$I,$C7)","v":7},10,{"$f":"SUMIFS(Jogos!$M:$M,Jogos!$D:$D,$A7,Jogos!$E:$E,$C7)+SUMIFS(Jogos!$P:$P,Jogos!$D:$D,$A7,Jogos!$I:$I,$C7)","v":41},{"$f":"SUMIFS(Jogos!$P:$P,Jogos!$D:$D,$A7,Jogos!$E:$E,$C7)+SUMIFS(Jogos!$M:$M,Jogos!$D:$D,$A7,Jogos!$I:$I,$C7)","v":24},17,8]
[{"v":1,"d":"01"},{"v":3,"d":"3º"},"LIBERDADE [B]",15,{"$f":"COUNTIFS(Jogos!$N:$N,\"V\",Jogos!$D:$D,$A8,Jogos!$E:$E,$C8)+COUNTIFS(Jogos!$O:$O,\"V\",Jogos!$D:$D,$A8,Jogos!$I:$I,$C8)","v":5},{"$f":"COUNTIFS(Jogos!$N:$N,\"E\",Jogos!$D:$D,$A8,Jogos!$E:$E,$C8)+COUNTIFS(Jogos!$O:$O,\"E\",Jogos!$D:$D,$A8,Jogos!$I:$I,$C8)","v":0},{"$f":"COUNTIFS(Jogos!$N:$N,\"D\",Jogos!$D:$D,$A8,Jogos!$E:$E,$C8)+COUNTIFS(Jogos!$O:$O,\"D\",Jogos!$D:$D,$A8,Jogos!$I:$I,$C8)","v":3},{"$f":"SUMIFS(Jogos!$L:$L,Jogos!$D:$D,$A8,Jogos!$E:$E,$C8)+SUMIFS(Jogos!$Q:$Q,Jogos!$D:$D,$A8,Jogos!$I:$I,$C8)","v":13},{"$f":"SUMIFS(Jogos!$Q:$Q,Jogos!$D:$D,$A8,Jogos!$E:$E,$C8)+SUMIFS(Jogos!$L:$L,Jogos!$D:$D,$A8,Jogos!$I:$I,$C8)","v":11},2,{"$f":"SUMIFS(Jogos!$M:$M,Jogos!$D:$D,$A8,Jogos!$E:$E,$C8)+SUMIFS(Jogos!$P:$P,Jogos!$D:$D,$A8,Jogos!$I:$I,$C8)","v":34},{"$f":"SUMIFS(Jogos!$P:$P,Jogos!$D:$D,$A8,Jogos!$E:$E,$C8)+SUMIFS(Jogos!$M:$M,Jogos!$D:$D,$A8,Jogos!$I:$I,$C8)","v":28},6,8]
[{"v":1,"d":"01"},{"v":4,"d":"4º"},"AABB/ACAFUMA [A]",14,{"$f":"COUNTIFS(Jogos!$N:$N,\"V\",Jogos!$D:$D,$A9,Jogos!$E:$E,$C9)+COUNTIFS(Jogos!$O:$O,\"V\",Jogos!$D:$D,$A9,Jogos!$I:$I,$C9)","v":4},{"$f":"COUNTIFS(Jogos!$N:$N,\"E\",Jogos!$D:$D,$A9,Jogos!$E:$E,$C9)+COUNTIFS(Jogos!$O:$O,\"E\",Jogos!$D:$D,$A9,Jogos!$I:$I,$C9)","v":2},{"$f":"COUNTIFS(Jogos!$N:$N,\"D\",Jogos!$D:$D,$A9,Jogos!$E:$E,$C9)+COUNTIFS(Jogos!$O:$O,\"D\",Jogos!$D:$D,$A9,Jogos!$I:$I,$C9)","v":2},{"$f":"SUMIFS(Jogos!$L:$L,Jogos!$D:$D,$A9,Jogos!$E:$E,$C9)+SUMIFS(Jogos!$Q:$Q,Jogos!$D:$D,$A9,Jogos!$I:$I,$C9)","v":16},{"$f":"SUMIFS(Jogos!$Q:$Q,Jogos!$D:$D,$A9,Jogos!$E:$E,$C9)+SUMIFS(Jogos!$L:$L,Jogos!$D:$D,$A9,Jogos!$I:$I,$C9)","v":7},9,{"$f":"SUMIFS(Jogos!$M:$M,Jogos!$D:$D,$A9,Jogos!$E:$E,$C9)+SUMIFS(Jogos!$P:$P,Jogos!$D:$D,$A9,Jogos!$I:$I,$C9)","v":49},{"$f":"SUMIFS(Jogos!$P:$P,Jogos!$D:$D,$A9,Jogos!$E:$E,$C9)+SUMIFS(Jogos!$M:$M,Jogos!$D:$D,$A9,Jogos!$I:$I,$C9)","v":20},29,8]
[{"v":1,"d":"01"},{"v":5,"d":"5º"},"AABB/ACAFUMA [C]",11,{"$f":"COUNTIFS(Jogos!$N:$N,\"V\",Jogos!$D:$D,$A10,Jogos!$E:$E,$C10)+COUNTIFS(Jogos!$O:$O,\"V\",Jogos!$D:$D,$A10,Jogos!$I:$I,$C10)","v":3},{"$f":"COUNTIFS(Jogos!$N:$N,\"E\",Jogos!$D:$D,$A10,Jogos!$E:$E,$C10)+COUNTIFS(Jogos!$O:$O,\"E\",Jogos!$D:$D,$A10,Jogos!$I:$I,$C10)","v":2},{"$f":"COUNTIFS(Jogos!$N:$N,\"D\",Jogos!$D:$D,$A10,Jogos!$E:$E,$C10)+COUNTIFS(Jogos!$O:$O,\"D\",Jogos!$D:$D,$A10,Jogos!$I:$I,$C10)","v":3},{"$f":"SUMIFS(Jogos!$L:$L,Jogos!$D:$D,$A10,Jogos!$E:$E,$C10)+SUMIFS(Jogos!$Q:$Q,Jogos!$D:$D,$A10,Jogos!$I:$I,$C10)","v":12},{"$f":"SUMIFS(Jogos!$Q:$Q,Jogos!$D:$D,$A10,Jogos!$E:$E,$C10)+SUMIFS(Jogos!$L:$L,Jogos!$D:$D,$A10,Jogos!$I:$I,$C10)","v":11},1,{"$f":"SUMIFS(Jogos!$M:$M,Jogos!$D:$D,$A10,Jogos!$E:$E,$C10)+SUMIFS(Jogos!$P:$P,Jogos!$D:$D,$A10,Jogos!$I:$I,$C10)","v":30},{"$f":"SUMIFS(Jogos!$P:$P,Jogos!$D:$D,$A10,Jogos!$E:$E,$C10)+SUMIFS(Jogos!$M:$M,Jogos!$D:$D,$A10,Jogos!$I:$I,$C10)","v":36},-6,8]
[{"v":1,"d":"01"},{"v":6,"d":"6º"},"COMARY",10,{"$f":"COUNTIFS(Jogos!$N:$N,\"V\",Jogos!$D:$D,$A11,Jogos!$E:$E,$C11)+COUNTIFS(Jogos!$O:$O,\"V\",Jogos!$D:$D,$A11,Jogos!$I:$I,$C11)","v":3},{"$f":"COUNTIFS(Jogos!$N:$N,\"E\",Jogos!$D:$D,$A11,Jogos!$E:$E,$C11)+COUNTIFS(Jogos!$O:$O,\"E\",Jogos!$D:$D,$A11,Jogos!$I:$I,$C11)","v":1},{"$f":"COUNTIFS(Jogos!$N:$N,\"D\",Jogos!$D:$D,$A11,Jogos!$E:$E,$C11)+COUNTIFS(Jogos!$O:$O,\"D\",Jogos!$D:$D,$A11,Jogos!$I:$I,$C11)","v":4},{"$f":"SUMIFS(Jogos!$L:$L,Jogos!$D:$D,$A11,Jogos!$E:$E,$C11)+SUMIFS(Jogos!$Q:$Q,Jogos!$D:$D,$A11,Jogos!$I:$I,$C11)","v":10},{"$f":"SUMIFS(Jogos!$Q:$Q,Jogos!$D:$D,$A11,Jogos!$E:$E,$C11)+SUMIFS(Jogos!$L:$L,Jogos!$D:$D,$A11,Jogos!$I:$I,$C11)","v":12},-2,{"$f":"SUMIFS(Jogos!$M:$M,Jogos!$D:$D,$A11,Jogos!$E:$E,$C11)+SUMIFS(Jogos!$P:$P,Jogos!$D:$D,$A11,Jogos!$I:$I,$C11)","v":30},{"$f":"SUMIFS(Jogos!$P:$P,Jogos!$D:$D,$A11,Jogos!$E:$E,$C11)+SUMIFS(Jogos!$M:$M,Jogos!$D:$D,$A11,Jogos!$I:$I,$C11)","v":38},-8,8]
[{"v":1,"d":"01"},{"v":7,"d":"7º"},"CHACAL [A]",7,{"$f":"COUNTIFS(Jogos!$N:$N,\"V\",Jogos!$D:$D,$A12,Jogos!$E:$E,$C12)+COUNTIFS(Jogos!$O:$O,\"V\",Jogos!$D:$D,$A12,Jogos!$I:$I,$C12)","v":2},{"$f":"COUNTIFS(Jogos!$N:$N,\"E\",Jogos!$D:$D,$A12,Jogos!$E:$E,$C12)+COUNTIFS(Jogos!$O:$O,\"E\",Jogos!$D:$D,$A12,Jogos!$I:$I,$C12)","v":1},{"$f":"COUNTIFS(Jogos!$N:$N,\"D\",Jogos!$D:$D,$A12,Jogos!$E:$E,$C12)+COUNTIFS(Jogos!$O:$O,\"D\",Jogos!$D:$D,$A12,Jogos!$I:$I,$C12)","v":5},{"$f":"SUMIFS(Jogos!$L:$L,Jogos!$D:$D,$A12,Jogos!$E:$E,$C12)+SUMIFS(Jogos!$Q:$Q,Jogos!$D:$D,$A12,Jogos!$I:$I,$C12)","v":6},{"$f":"SUMIFS(Jogos!$Q:$Q,Jogos!$D:$D,$A12,Jogos!$E:$E,$C12)+SUMIFS(Jogos!$L:$L,Jogos!$D:$D,$A12,Jogos!$I:$I,$C12)","v":13},-7,{"$f":"SUMIFS(Jogos!$M:$M,Jogos!$D:$D,$A12,Jogos!$E:$E,$C12)+SUMIFS(Jogos!$P:$P,Jogos!$D:$D,$A12,Jogos!$I:$I,$C12)","v":32},{"$f":"SUMIFS(Jogos!$P:$P,Jogos!$D:$D,$A12,Jogos!$E:$E,$C12)+SUMIFS(Jogos!$M:$M,Jogos!$D:$D,$A12,Jogos!$I:$I,$C12)","v":42},-10,8]
[{"v":1,"d":"01"},{"v":8,"d":"8º"},"GRÊMIO MINEIRO",5,{"$f":"COUNTIFS(Jogos!$N:$N,\"V\",Jogos!$D:$D,$A13,Jogos!$E:$E,$C13)+COUNTIFS(Jogos!$O:$O,\"V\",Jogos!$D:$D,$A13,Jogos!$I:$I,$C13)","v":1},{"$f":"COUNTIFS(Jogos!$N:$N,\"E\",Jogos!$D:$D,$A13,Jogos!$E:$E,$C13)+COUNTIFS(Jogos!$O:$O,\"E\",Jogos!$D:$D,$A13,Jogos!$I:$I,$C13)","v":2},{"$f":"COUNTIFS(Jogos!$N:$N,\"D\",Jogos!$D:$D,$A13,Jogos!$E:$E,$C13)+COUNTIFS(Jogos!$O:$O,\"D\",Jogos!$D:$D,$A13,Jogos!$I:$I,$C13)","v":5},{"$f":"SUMIFS(Jogos!$L:$L,Jogos!$D:$D,$A13,Jogos!$E:$E,$C13)+SUMIFS(Jogos!$Q:$Q,Jogos!$D:$D,$A13,Jogos!$I:$I,$C13)","v":6},{"$f":"SUMIFS(Jogos!$Q:$Q,Jogos!$D:$D,$A13,Jogos!$E:$E,$C13)+SUMIFS(Jogos!$L:$L,Jogos!$D:$D,$A13,Jogos!$I:$I,$C13)","v":20},-14,{"$f":"SUMIFS(Jogos!$M:$M,Jogos!$D:$D,$A13,Jogos!$E:$E,$C13)+SUMIFS(Jogos!$P:$P,Jogos!$D:$D,$A13,Jogos!$I:$I,$C13)","v":31},{"$f":"SUMIFS(Jogos!$P:$P,Jogos!$D:$D,$A13,Jogos!$E:$E,$C13)+SUMIFS(Jogos!$M:$M,Jogos!$D:$D,$A13,Jogos!$I:$I,$C13)","v":56},-25,8]
[{"v":1,"d":"01"},{"v":9,"d":"9º"},"MATIAS [B]",1,{"$f":"COUNTIFS(Jogos!$N:$N,\"V\",Jogos!$D:$D,$A14,Jogos!$E:$E,$C14)+COUNTIFS(Jogos!$O:$O,\"V\",Jogos!$D:$D,$A14,Jogos!$I:$I,$C14)","v":0},{"$f":"COUNTIFS(Jogos!$N:$N,\"E\",Jogos!$D:$D,$A14,Jogos!$E:$E,$C14)+COUNTIFS(Jogos!$O:$O,\"E\",Jogos!$D:$D,$A14,Jogos!$I:$I,$C14)","v":1},{"$f":"COUNTIFS(Jogos!$N:$N,\"D\",Jogos!$D:$D,$A14,Jogos!$E:$E,$C14)+COUNTIFS(Jogos!$O:$O,\"D\",Jogos!$D:$D,$A14,Jogos!$I:$I,$C14)","v":7},{"$f":"SUMIFS(Jogos!$L:$L,Jogos!$D:$D,$A14,Jogos!$E:$E,$C14)+SUMIFS(Jogos!$Q:$Q,Jogos!$D:$D,$A14,Jogos!$I:$I,$C14)","v":4},{"$f":"SUMIFS(Jogos!$Q:$Q,Jogos!$D:$D,$A14,Jogos!$E:$E,$C14)+SUMIFS(Jogos!$L:$L,Jogos!$D:$D,$A14,Jogos!$I:$I,$C14)","v":22},-18,{"$f":"SUMIFS(Jogos!$M:$M,Jogos!$D:$D,$A14,Jogos!$E:$E,$C14)+SUMIFS(Jogos!$P:$P,Jogos!$D:$D,$A14,Jogos!$I:$I,$C14)","v":17},{"$f":"SUMIFS(Jogos!$P:$P,Jogos!$D:$D,$A14,Jogos!$E:$E,$C14)+SUMIFS(Jogos!$M:$M,Jogos!$D:$D,$A14,Jogos!$I:$I,$C14)","v":55},-38,8]
[{"v":2,"d":"02"},{"v":1,"d":"1º"},"LIBERDADE [A]",19,{"$f":"COUNTIFS(Jogos!$N:$N,\"V\",Jogos!$D:$D,$A15,Jogos!$E:$E,$C15)+COUNTIFS(Jogos!$O:$O,\"V\",Jogos!$D:$D,$A15,Jogos!$I:$I,$C15)","v":6},{"$f":"COUNTIFS(Jogos!$N:$N,\"E\",Jogos!$D:$D,$A15,Jogos!$E:$E,$C15)+COUNTIFS(Jogos!$O:$O,\"E\",Jogos!$D:$D,$A15,Jogos!$I:$I,$C15)","v":1},{"$f":"COUNTIFS(Jogos!$N:$N,\"D\",Jogos!$D:$D,$A15,Jogos!$E:$E,$C15)+COUNTIFS(Jogos!$O:$O,\"D\",Jogos!$D:$D,$A15,Jogos!$I:$I,$C15)","v":0},{"$f":"SUMIFS(Jogos!$L:$L,Jogos!$D:$D,$A15,Jogos!$E:$E,$C15)+SUMIFS(Jogos!$Q:$Q,Jogos!$D:$D,$A15,Jogos!$I:$I,$C15)","v":19},{"$f":"SUMIFS(Jogos!$Q:$Q,Jogos!$D:$D,$A15,Jogos!$E:$E,$C15)+SUMIFS(Jogos!$L:$L,Jogos!$D:$D,$A15,Jogos!$I:$I,$C15)","v":5},14,{"$f":"SUMIFS(Jogos!$M:$M,Jogos!$D:$D,$A15,Jogos!$E:$E,$C15)+SUMIFS(Jogos!$P:$P,Jogos!$D:$D,$A15,Jogos!$I:$I,$C15)","v":50},{"$f":"SUMIFS(Jogos!$P:$P,Jogos!$D:$D,$A15,Jogos!$E:$E,$C15)+SUMIFS(Jogos!$M:$M,Jogos!$D:$D,$A15,Jogos!$I:$I,$C15)","v":21},29,7]
[{"v":2,"d":"02"},{"v":2,"d":"2º"},"UNIÃO INDEPENDENTE/UBERABA",13,{"$f":"COUNTIFS(Jogos!$N:$N,\"V\",Jogos!$D:$D,$A16,Jogos!$E:$E,$C16)+COUNTIFS(Jogos!$O:$O,\"V\",Jogos!$D:$D,$A16,Jogos!$I:$I,$C16)","v":4},{"$f":"COUNTIFS(Jogos!$N:$N,\"E\",Jogos!$D:$D,$A16,Jogos!$E:$E,$C16)+COUNTIFS(Jogos!$O:$O,\"E\",Jogos!$D:$D,$A16,Jogos!$I:$I,$C16)","v":1},{"$f":"COUNTIFS(Jogos!$N:$N,\"D\",Jogos!$D:$D,$A16,Jogos!$E:$E,$C16)+COUNTIFS(Jogos!$O:$O,\"D\",Jogos!$D:$D,$A16,Jogos!$I:$I,$C16)","v":2},{"$f":"SUMIFS(Jogos!$L:$L,Jogos!$D:$D,$A16,Jogos!$E:$E,$C16)+SUMIFS(Jogos!$Q:$Q,Jogos!$D:$D,$A16,Jogos!$I:$I,$C16)","v":14},{"$f":"SUMIFS(Jogos!$Q:$Q,Jogos!$D:$D,$A16,Jogos!$E:$E,$C16)+SUMIFS(Jogos!$L:$L,Jogos!$D:$D,$A16,Jogos!$I:$I,$C16)","v":7},7,{"$f":"SUMIFS(Jogos!$M:$M,Jogos!$D:$D,$A16,Jogos!$E:$E,$C16)+SUMIFS(Jogos!$P:$P,Jogos!$D:$D,$A16,Jogos!$I:$I,$C16)","v":38},{"$f":"SUMIFS(Jogos!$P:$P,Jogos!$D:$D,$A16,Jogos!$E:$E,$C16)+SUMIFS(Jogos!$M:$M,Jogos!$D:$D,$A16,Jogos!$I:$I,$C16)","v":26},12,7]
[{"v":2,"d":"02"},{"v":3,"d":"3º"},"MATIAS [A]",13,{"$f":"COUNTIFS(Jogos!$N:$N,\"V\",Jogos!$D:$D,$A17,Jogos!$E:$E,$C17)+COUNTIFS(Jogos!$O:$O,\"V\",Jogos!$D:$D,$A17,Jogos!$I:$I,$C17)","v":4},{"$f":"COUNTIFS(Jogos!$N:$N,\"E\",Jogos!$D:$D,$A17,Jogos!$E:$E,$C17)+COUNTIFS(Jogos!$O:$O,\"E\",Jogos!$D:$D,$A17,Jogos!$I:$I,$C17)","v":1},{"$f":"COUNTIFS(Jogos!$N:$N,\"D\",Jogos!$D:$D,$A17,Jogos!$E:$E,$C17)+COUNTIFS(Jogos!$O:$O,\"D\",Jogos!$D:$D,$A17,Jogos!$I:$I,$C17)","v":2},{"$f":"SUMIFS(Jogos!$L:$L,Jogos!$D:$D,$A17,Jogos!$E:$E,$C17)+SUMIFS(Jogos!$Q:$Q,Jogos!$D:$D,$A17,Jogos!$I:$I,$C17)","v":16},{"$f":"SUMIFS(Jogos!$Q:$Q,Jogos!$D:$D,$A17,Jogos!$E:$E,$C17)+SUMIFS(Jogos!$L:$L,Jogos!$D:$D,$A17,Jogos!$I:$I,$C17)","v":11},5,{"$f":"SUMIFS(Jogos!$M:$M,Jogos!$D:$D,$A17,Jogos!$E:$E,$C17)+SUMIFS(Jogos!$P:$P,Jogos!$D:$D,$A17,Jogos!$I:$I,$C17)","v":34},{"$f":"SUMIFS(Jogos!$P:$P,Jogos!$D:$D,$A17,Jogos!$E:$E,$C17)+SUMIFS(Jogos!$M:$M,Jogos!$D:$D,$A17,Jogos!$I:$I,$C17)","v":24},10,7]
[{"v":2,"d":"02"},{"v":4,"d":"4º"},"TUPI [B]",12,{"$f":"COUNTIFS(Jogos!$N:$N,\"V\",Jogos!$D:$D,$A18,Jogos!$E:$E,$C18)+COUNTIFS(Jogos!$O:$O,\"V\",Jogos!$D:$D,$A18,Jogos!$I:$I,$C18)","v":4},{"$f":"COUNTIFS(Jogos!$N:$N,\"E\",Jogos!$D:$D,$A18,Jogos!$E:$E,$C18)+COUNTIFS(Jogos!$O:$O,\"E\",Jogos!$D:$D,$A18,Jogos!$I:$I,$C18)","v":0},{"$f":"COUNTIFS(Jogos!$N:$N,\"D\",Jogos!$D:$D,$A18,Jogos!$E:$E,$C18)+COUNTIFS(Jogos!$O:$O,\"D\",Jogos!$D:$D,$A18,Jogos!$I:$I,$C18)","v":3},{"$f":"SUMIFS(Jogos!$L:$L,Jogos!$D:$D,$A18,Jogos!$E:$E,$C18)+SUMIFS(Jogos!$Q:$Q,Jogos!$D:$D,$A18,Jogos!$I:$I,$C18)","v":11},{"$f":"SUMIFS(Jogos!$Q:$Q,Jogos!$D:$D,$A18,Jogos!$E:$E,$C18)+SUMIFS(Jogos!$L:$L,Jogos!$D:$D,$A18,Jogos!$I:$I,$C18)","v":7},4,{"$f":"SUMIFS(Jogos!$M:$M,Jogos!$D:$D,$A18,Jogos!$E:$E,$C18)+SUMIFS(Jogos!$P:$P,Jogos!$D:$D,$A18,Jogos!$I:$I,$C18)","v":33},{"$f":"SUMIFS(Jogos!$P:$P,Jogos!$D:$D,$A18,Jogos!$E:$E,$C18)+SUMIFS(Jogos!$M:$M,Jogos!$D:$D,$A18,Jogos!$I:$I,$C18)","v":27},6,7]
[{"v":2,"d":"02"},{"v":5,"d":"5º"},"VASCO DA GAMA",11,{"$f":"COUNTIFS(Jogos!$N:$N,\"V\",Jogos!$D:$D,$A19,Jogos!$E:$E,$C19)+COUNTIFS(Jogos!$O:$O,\"V\",Jogos!$D:$D,$A19,Jogos!$I:$I,$C19)","v":3},{"$f":"COUNTIFS(Jogos!$N:$N,\"E\",Jogos!$D:$D,$A19,Jogos!$E:$E,$C19)+COUNTIFS(Jogos!$O:$O,\"E\",Jogos!$D:$D,$A19,Jogos!$I:$I,$C19)","v":2},{"$f":"COUNTIFS(Jogos!$N:$N,\"D\",Jogos!$D:$D,$A19,Jogos!$E:$E,$C19)+COUNTIFS(Jogos!$O:$O,\"D\",Jogos!$D:$D,$A19,Jogos!$I:$I,$C19)","v":2},{"$f":"SUMIFS(Jogos!$L:$L,Jogos!$D:$D,$A19,Jogos!$E:$E,$C19)+SUMIFS(Jogos!$Q:$Q,Jogos!$D:$D,$A19,Jogos!$I:$I,$C19)","v":10},{"$f":"SUMIFS(Jogos!$Q:$Q,Jogos!$D:$D,$A19,Jogos!$E:$E,$C19)+SUMIFS(Jogos!$L:$L,Jogos!$D:$D,$A19,Jogos!$I:$I,$C19)","v":10},0,{"$f":"SUMIFS(Jogos!$M:$M,Jogos!$D:$D,$A19,Jogos!$E:$E,$C19)+SUMIFS(Jogos!$P:$P,Jogos!$D:$D,$A19,Jogos!$I:$I,$C19)","v":35},{"$f":"SUMIFS(Jogos!$P:$P,Jogos!$D:$D,$A19,Jogos!$E:$E,$C19)+SUMIFS(Jogos!$M:$M,Jogos!$D:$D,$A19,Jogos!$I:$I,$C19)","v":27},8,7]
[{"v":2,"d":"02"},{"v":6,"d":"6º"},"AABB/ACAFUMA [B]",9,{"$f":"COUNTIFS(Jogos!$N:$N,\"V\",Jogos!$D:$D,$A20,Jogos!$E:$E,$C20)+COUNTIFS(Jogos!$O:$O,\"V\",Jogos!$D:$D,$A20,Jogos!$I:$I,$C20)","v":3},{"$f":"COUNTIFS(Jogos!$N:$N,\"E\",Jogos!$D:$D,$A20,Jogos!$E:$E,$C20)+COUNTIFS(Jogos!$O:$O,\"E\",Jogos!$D:$D,$A20,Jogos!$I:$I,$C20)","v":0},{"$f":"COUNTIFS(Jogos!$N:$N,\"D\",Jogos!$D:$D,$A20,Jogos!$E:$E,$C20)+COUNTIFS(Jogos!$O:$O,\"D\",Jogos!$D:$D,$A20,Jogos!$I:$I,$C20)","v":4},{"$f":"SUMIFS(Jogos!$L:$L,Jogos!$D:$D,$A20,Jogos!$E:$E,$C20)+SUMIFS(Jogos!$Q:$Q,Jogos!$D:$D,$A20,Jogos!$I:$I,$C20)","v":9},{"$f":"SUMIFS(Jogos!$Q:$Q,Jogos!$D:$D,$A20,Jogos!$E:$E,$C20)+SUMIFS(Jogos!$L:$L,Jogos!$D:$D,$A20,Jogos!$I:$I,$C20)","v":8},1,{"$f":"SUMIFS(Jogos!$M:$M,Jogos!$D:$D,$A20,Jogos!$E:$E,$C20)+SUMIFS(Jogos!$P:$P,Jogos!$D:$D,$A20,Jogos!$I:$I,$C20)","v":31},{"$f":"SUMIFS(Jogos!$P:$P,Jogos!$D:$D,$A20,Jogos!$E:$E,$C20)+SUMIFS(Jogos!$M:$M,Jogos!$D:$D,$A20,Jogos!$I:$I,$C20)","v":29},2,7]
[{"v":2,"d":"02"},{"v":7,"d":"7º"},"ELDORADO",4,{"$f":"COUNTIFS(Jogos!$N:$N,\"V\",Jogos!$D:$D,$A21,Jogos!$E:$E,$C21)+COUNTIFS(Jogos!$O:$O,\"V\",Jogos!$D:$D,$A21,Jogos!$I:$I,$C21)","v":1},{"$f":"COUNTIFS(Jogos!$N:$N,\"E\",Jogos!$D:$D,$A21,Jogos!$E:$E,$C21)+COUNTIFS(Jogos!$O:$O,\"E\",Jogos!$D:$D,$A21,Jogos!$I:$I,$C21)","v":1},{"$f":"COUNTIFS(Jogos!$N:$N,\"D\",Jogos!$D:$D,$A21,Jogos!$E:$E,$C21)+COUNTIFS(Jogos!$O:$O,\"D\",Jogos!$D:$D,$A21,Jogos!$I:$I,$C21)","v":5},{"$f":"SUMIFS(Jogos!$L:$L,Jogos!$D:$D,$A21,Jogos!$E:$E,$C21)+SUMIFS(Jogos!$Q:$Q,Jogos!$D:$D,$A21,Jogos!$I:$I,$C21)","v":4},{"$f":"SUMIFS(Jogos!$Q:$Q,Jogos!$D:$D,$A21,Jogos!$E:$E,$C21)+SUMIFS(Jogos!$L:$L,Jogos!$D:$D,$A21,Jogos!$I:$I,$C21)","v":16},-12,{"$f":"SUMIFS(Jogos!$M:$M,Jogos!$D:$D,$A21,Jogos!$E:$E,$C21)+SUMIFS(Jogos!$P:$P,Jogos!$D:$D,$A21,Jogos!$I:$I,$C21)","v":15},{"$f":"SUMIFS(Jogos!$P:$P,Jogos!$D:$D,$A21,Jogos!$E:$E,$C21)+SUMIFS(Jogos!$M:$M,Jogos!$D:$D,$A21,Jogos!$I:$I,$C21)","v":36},-21,7]
[{"v":2,"d":"02"},{"v":8,"d":"8º"},"CHACAL [B]",0,{"$f":"COUNTIFS(Jogos!$N:$N,\"V\",Jogos!$D:$D,$A22,Jogos!$E:$E,$C22)+COUNTIFS(Jogos!$O:$O,\"V\",Jogos!$D:$D,$A22,Jogos!$I:$I,$C22)","v":0},{"$f":"COUNTIFS(Jogos!$N:$N,\"E\",Jogos!$D:$D,$A22,Jogos!$E:$E,$C22)+COUNTIFS(Jogos!$O:$O,\"E\",Jogos!$D:$D,$A22,Jogos!$I:$I,$C22)","v":0},{"$f":"COUNTIFS(Jogos!$N:$N,\"D\",Jogos!$D:$D,$A22,Jogos!$E:$E,$C22)+COUNTIFS(Jogos!$O:$O,\"D\",Jogos!$D:$D,$A22,Jogos!$I:$I,$C22)","v":7},{"$f":"SUMIFS(Jogos!$L:$L,Jogos!$D:$D,$A22,Jogos!$E:$E,$C22)+SUMIFS(Jogos!$Q:$Q,Jogos!$D:$D,$A22,Jogos!$I:$I,$C22)","v":2},{"$f":"SUMIFS(Jogos!$Q:$Q,Jogos!$D:$D,$A22,Jogos!$E:$E,$C22)+SUMIFS(Jogos!$L:$L,Jogos!$D:$D,$A22,Jogos!$I:$I,$C22)","v":21},-19,{"$f":"SUMIFS(Jogos!$M:$M,Jogos!$D:$D,$A22,Jogos!$E:$E,$C22)+SUMIFS(Jogos!$P:$P,Jogos!$D:$D,$A22,Jogos!$I:$I,$C22)","v":9},{"$f":"SUMIFS(Jogos!$P:$P,Jogos!$D:$D,$A22,Jogos!$E:$E,$C22)+SUMIFS(Jogos!$M:$M,Jogos!$D:$D,$A22,Jogos!$I:$I,$C22)","v":55},-46,7]
[]
["TAÇA DE OURO",null,null,"PG","V","E","D","GP","GC","SG","GPI","GCI","SGI","J"]
["SEGUNDA FASE"]
[{"v":3,"d":"03"},{"v":1,"d":"1º"},"VASCO DA GAMA",{"$f":"E26*3+F26","v":3},{"$f":"COUNTIFS(Jogos!$N:$N,\"V\",Jogos!$D:$D,$A26,Jogos!$E:$E,$C26)+COUNTIFS(Jogos!$O:$O,\"V\",Jogos!$D:$D,$A26,Jogos!$I:$I,$C26)","v":1},{"$f":"COUNTIFS(Jogos!$N:$N,\"E\",Jogos!$D:$D,$A26,Jogos!$E:$E,$C26)+COUNTIFS(Jogos!$O:$O,\"E\",Jogos!$D:$D,$A26,Jogos!$I:$I,$C26)","v":0},{"$f":"COUNTIFS(Jogos!$N:$N,\"D\",Jogos!$D:$D,$A26,Jogos!$E:$E,$C26)+COUNTIFS(Jogos!$O:$O,\"D\",Jogos!$D:$D,$A26,Jogos!$I:$I,$C26)","v":0},{"$f":"SUMIFS(Jogos!$L:$L,Jogos!$D:$D,$A26,Jogos!$E:$E,$C26)+SUMIFS(Jogos!$Q:$Q,Jogos!$D:$D,$A26,Jogos!$I:$I,$C26)","v":4},{"$f":"SUMIFS(Jogos!$Q:$Q,Jogos!$D:$D,$A26,Jogos!$E:$E,$C26)+SUMIFS(Jogos!$L:$L,Jogos!$D:$D,$A26,Jogos!$I:$I,$C26)","v":0},{"$f":"H26-I26","v":4},{"$f":"SUMIFS(Jogos!$M:$M,Jogos!$D:$D,$A26,Jogos!$E:$E,$C26)+SUMIFS(Jogos!$P:$P,Jogos!$D:$D,$A26,Jogos!$I:$I,$C26)","v":11},{"$f":"SUMIFS(Jogos!$P:$P,Jogos!$D:$D,$A26,Jogos!$E:$E,$C26)+SUMIFS(Jogos!$M:$M,Jogos!$D:$D,$A26,Jogos!$I:$I,$C26)","v":1},{"$f":"K26-L26","v":10},{"$f":"SUM(E26:G26)","v":1}]
[{"v":3,"d":"03"},{"v":2,"d":"2º"},"AABB/ACAFUMA [A]",0,{"$f":"COUNTIFS(Jogos!$N:$N,\"V\",Jogos!$D:$D,$A27,Jogos!$E:$E,$C27)+COUNTIFS(Jogos!$O:$O,\"V\",Jogos!$D:$D,$A27,Jogos!$I:$I,$C27)","v":0},{"$f":"COUNTIFS(Jogos!$N:$N,\"E\",Jogos!$D:$D,$A27,Jogos!$E:$E,$C27)+COUNTIFS(Jogos!$O:$O,\"E\",Jogos!$D:$D,$A27,Jogos!$I:$I,$C27)","v":0},{"$f":"COUNTIFS(Jogos!$N:$N,\"D\",Jogos!$D:$D,$A27,Jogos!$E:$E,$C27)+COUNTIFS(Jogos!$O:$O,\"D\",Jogos!$D:$D,$A27,Jogos!$I:$I,$C27)","v":1},{"$f":"SUMIFS(Jogos!$L:$L,Jogos!$D:$D,$A27,Jogos!$E:$E,$C27)+SUMIFS(Jogos!$Q:$Q,Jogos!$D:$D,$A27,Jogos!$I:$I,$C27)","v":0},{"$f":"SUMIFS(Jogos!$Q:$Q,Jogos!$D:$D,$A27,Jogos!$E:$E,$C27)+SUMIFS(Jogos!$L:$L,Jogos!$D:$D,$A27,Jogos!$I:$I,$C27)","v":4},-4,{"$f":"SUMIFS(Jogos!$M:$M,Jogos!$D:$D,$A27,Jogos!$E:$E,$C27)+SUMIFS(Jogos!$P:$P,Jogos!$D:$D,$A27,Jogos!$I:$I,$C27)","v":1},{"$f":"SUMIFS(Jogos!$P:$P,Jogos!$D:$D,$A27,Jogos!$E:$E,$C27)+SUMIFS(Jogos!$M:$M,Jogos!$D:$D,$A27,Jogos!$I:$I,$C27)","v":11},-10,1]
[{"v":4,"d":"04"},{"v":1,"d":"1º"},"AABB/ACAFUMA [C]",3,{"$f":"COUNTIFS(Jogos!$N:$N,\"V\",Jogos!$D:$D,$A28,Jogos!$E:$E,$C28)+COUNTIFS(Jogos!$O:$O,\"V\",Jogos!$D:$D,$A28,Jogos!$I:$I,$C28)","v":1},{"$f":"COUNTIFS(Jogos!$N:$N,\"E\",Jogos!$D:$D,$A28,Jogos!$E:$E,$C28)+COUNTIFS(Jogos!$O:$O,\"E\",Jogos!$D:$D,$A28,Jogos!$I:$I,$C28)","v":0},{"$f":"COUNTIFS(Jogos!$N:$N,\"D\",Jogos!$D:$D,$A28,Jogos!$E:$E,$C28)+COUNTIFS(Jogos!$O:$O,\"D\",Jogos!$D:$D,$A28,Jogos!$I:$I,$C28)","v":0},{"$f":"SUMIFS(Jogos!$L:$L,Jogos!$D:$D,$A28,Jogos!$E:$E,$C28)+SUMIFS(Jogos!$Q:$Q,Jogos!$D:$D,$A28,Jogos!$I:$I,$C28)","v":2},{"$f":"SUMIFS(Jogos!$Q:$Q,Jogos!$D:$D,$A28,Jogos!$E:$E,$C28)+SUMIFS(Jogos!$L:$L,Jogos!$D:$D,$A28,Jogos!$I:$I,$C28)","v":1},1,{"$f":"SUMIFS(Jogos!$M:$M,Jogos!$D:$D,$A28,Jogos!$E:$E,$C28)+SUMIFS(Jogos!$P:$P,Jogos!$D:$D,$A28,Jogos!$I:$I,$C28)","v":4},{"$f":"SUMIFS(Jogos!$P:$P,Jogos!$D:$D,$A28,Jogos!$E:$E,$C28)+SUMIFS(Jogos!$M:$M,Jogos!$D:$D,$A28,Jogos!$I:$I,$C28)","v":7},-3,1]
[{"v":4,"d":"04"},{"v":2,"d":"2º"},"TUPI [B]",0,{"$f":"COUNTIFS(Jogos!$N:$N,\"V\",Jogos!$D:$D,$A29,Jogos!$E:$E,$C29)+COUNTIFS(Jogos!$O:$O,\"V\",Jogos!$D:$D,$A29,Jogos!$I:$I,$C29)","v":0},{"$f":"COUNTIFS(Jogos!$N:$N,\"E\",Jogos!$D:$D,$A29,Jogos!$E:$E,$C29)+COUNTIFS(Jogos!$O:$O,\"E\",Jogos!$D:$D,$A29,Jogos!$I:$I,$C29)","v":0},{"$f":"COUNTIFS(Jogos!$N:$N,\"D\",Jogos!$D:$D,$A29,Jogos!$E:$E,$C29)+COUNTIFS(Jogos!$O:$O,\"D\",Jogos!$D:$D,$A29,Jogos!$I:$I,$C29)","v":1},{"$f":"SUMIFS(Jogos!$L:$L,Jogos!$D:$D,$A29,Jogos!$E:$E,$C29)+SUMIFS(Jogos!$Q:$Q,Jogos!$D:$D,$A29,Jogos!$I:$I,$C29)","v":1},{"$f":"SUMIFS(Jogos!$Q:$Q,Jogos!$D:$D,$A29,Jogos!$E:$E,$C29)+SUMIFS(Jogos!$L:$L,Jogos!$D:$D,$A29,Jogos!$I:$I,$C29)","v":2},-1,{"$f":"SUMIFS(Jogos!$M:$M,Jogos!$D:$D,$A29,Jogos!$E:$E,$C29)+SUMIFS(Jogos!$P:$P,Jogos!$D:$D,$A29,Jogos!$I:$I,$C29)","v":7},{"$f":"SUMIFS(Jogos!$P:$P,Jogos!$D:$D,$A29,Jogos!$E:$E,$C29)+SUMIFS(Jogos!$M:$M,Jogos!$D:$D,$A29,Jogos!$I:$I,$C29)","v":4},3,1]
[]
["TAÇA DE OURO",null,null,"PG","V","E","D","GP","GC","SG","GPI","GCI","SGI","J"]
["QUARTAS-DE-FINAIS"]
[{"v":5,"d":"05"},{"v":1,"d":"1º"},"TUPI [A]",{"$f":"E33*3+F33","v":3},{"$f":"COUNTIFS(Jogos!$N:$N,\"V\",Jogos!$D:$D,$A33,Jogos!$E:$E,$C33)+COUNTIFS(Jogos!$O:$O,\"V\",Jogos!$D:$D,$A33,Jogos!$I:$I,$C33)","v":1},{"$f":"COUNTIFS(Jogos!$N:$N,\"E\",Jogos!$D:$D,$A33,Jogos!$E:$E,$C33)+COUNTIFS(Jogos!$O:$O,\"E\",Jogos!$D:$D,$A33,Jogos!$I:$I,$C33)","v":0},{"$f":"COUNTIFS(Jogos!$N:$N,\"D\",Jogos!$D:$D,$A33,Jogos!$E:$E,$C33)+COUNTIFS(Jogos!$O:$O,\"D\",Jogos!$D:$D,$A33,Jogos!$I:$I,$C33)","v":0},{"$f":"SUMIFS(Jogos!$L:$L,Jogos!$D:$D,$A33,Jogos!$E:$E,$C33)+SUMIFS(Jogos!$Q:$Q,Jogos!$D:$D,$A33,Jogos!$I:$I,$C33)","v":3},{"$f":"SUMIFS(Jogos!$Q:$Q,Jogos!$D:$D,$A33,Jogos!$E:$E,$C33)+SUMIFS(Jogos!$L:$L,Jogos!$D:$D,$A33,Jogos!$I:$I,$C33)","v":1},{"$f":"H33-I33","v":2},{"$f":"SUMIFS(Jogos!$M:$M,Jogos!$D:$D,$A33,Jogos!$E:$E,$C33)+SUMIFS(Jogos!$P:$P,Jogos!$D:$D,$A33,Jogos!$I:$I,$C33)","v":8},{"$f":"SUMIFS(Jogos!$P:$P,Jogos!$D:$D,$A33,Jogos!$E:$E,$C33)+SUMIFS(Jogos!$M:$M,Jogos!$D:$D,$A33,Jogos!$I:$I,$C33)","v":4},{"$f":"K33-L33","v":4},{"$f":"SUM(E33:G33)","v":1}]
[{"v":5,"d":"05"},{"v":2,"d":"2º"},"AABB/ACAFUMA [C]",0,{"$f":"COUNTIFS(Jogos!$N:$N,\"V\",Jogos!$D:$D,$A34,Jogos!$E:$E,$C34)+COUNTIFS(Jogos!$O:$O,\"V\",Jogos!$D:$D,$A34,Jogos!$I:$I,$C34)","v":0},{"$f":"COUNTIFS(Jogos!$N:$N,\"E\",Jogos!$D:$D,$A34,Jogos!$E:$E,$C34)+COUNTIFS(Jogos!$O:$O,\"E\",Jogos!$D:$D,$A34,Jogos!$I:$I,$C34)","v":0},{"$f":"COUNTIFS(Jogos!$N:$N,\"D\",Jogos!$D:$D,$A34,Jogos!$E:$E,$C34)+COUNTIFS(Jogos!$O:$O,\"D\",Jogos!$D:$D,$A34,Jogos!$I:$I,$C34)","v":1},{"$f":"SUMIFS(Jogos!$L:$L,Jogos!$D:$D,$A34,Jogos!$E:$E,$C34)+SUMIFS(Jogos!$Q:$Q,Jogos!$D:$D,$A34,Jogos!$I:$I,$C34)","v":1},{"$f":"SUMIFS(Jogos!$Q:$Q,Jogos!$D:$D,$A34,Jogos!$E:$E,$C34)+SUMIFS(Jogos!$L:$L,Jogos!$D:$D,$A34,Jogos!$I:$I,$C34)","v":3},-2,{"$f":"SUMIFS(Jogos!$M:$M,Jogos!$D:$D,$A34,Jogos!$E:$E,$C34)+SUMIFS(Jogos!$P:$P,Jogos!$D:$D,$A34,Jogos!$I:$I,$C34)","v":4},{"$f":"SUMIFS(Jogos!$P:$P,Jogos!$D:$D,$A34,Jogos!$E:$E,$C34)+SUMIFS(Jogos!$M:$M,Jogos!$D:$D,$A34,Jogos!$I:$I,$C34)","v":8},-4,1]
[{"v":6,"d":"06"},{"v":1,"d":"1º"},"LIBERDADE [A]",3,{"$f":"COUNTIFS(Jogos!$N:$N,\"V\",Jogos!$D:$D,$A35,Jogos!$E:$E,$C35)+COUNTIFS(Jogos!$O:$O,\"V\",Jogos!$D:$D,$A35,Jogos!$I:$I,$C35)","v":1},{"$f":"COUNTIFS(Jogos!$N:$N,\"E\",Jogos!$D:$D,$A35,Jogos!$E:$E,$C35)+COUNTIFS(Jogos!$O:$O,\"E\",Jogos!$D:$D,$A35,Jogos!$I:$I,$C35)","v":0},{"$f":"COUNTIFS(Jogos!$N:$N,\"D\",Jogos!$D:$D,$A35,Jogos!$E:$E,$C35)+COUNTIFS(Jogos!$O:$O,\"D\",Jogos!$D:$D,$A35,Jogos!$I:$I,$C35)","v":0},{"$f":"SUMIFS(Jogos!$L:$L,Jogos!$D:$D,$A35,Jogos!$E:$E,$C35)+SUMIFS(Jogos!$Q:$Q,Jogos!$D:$D,$A35,Jogos!$I:$I,$C35)","v":1},{"$f":"SUMIFS(Jogos!$Q:$Q,Jogos!$D:$D,$A35,Jogos!$E:$E,$C35)+SUMIFS(Jogos!$L:$L,Jogos!$D:$D,$A35,Jogos!$I:$I,$C35)","v":0},1,{"$f":"SUMIFS(Jogos!$M:$M,Jogos!$D:$D,$A35,Jogos!$E:$E,$C35)+SUMIFS(Jogos!$P:$P,Jogos!$D:$D,$A35,Jogos!$I:$I,$C35)","v":3},{"$f":"SUMIFS(Jogos!$P:$P,Jogos!$D:$D,$A35,Jogos!$E:$E,$C35)+SUMIFS(Jogos!$M:$M,Jogos!$D:$D,$A35,Jogos!$I:$I,$C35)","v":2},1,1]
[{"v":6,"d":"06"},{"v":2,"d":"2º"},"VASCO DA GAMA",0,{"$f":"COUNTIFS(Jogos!$N:$N,\"V\",Jogos!$D:$D,$A36,Jogos!$E:$E,$C36)+COUNTIFS(Jogos!$O:$O,\"V\",Jogos!$D:$D,$A36,Jogos!$I:$I,$C36)","v":0},{"$f":"COUNTIFS(Jogos!$N:$N,\"E\",Jogos!$D:$D,$A36,Jogos!$E:$E,$C36)+COUNTIFS(Jogos!$O:$O,\"E\",Jogos!$D:$D,$A36,Jogos!$I:$I,$C36)","v":0},{"$f":"COUNTIFS(Jogos!$N:$N,\"D\",Jogos!$D:$D,$A36,Jogos!$E:$E,$C36)+COUNTIFS(Jogos!$O:$O,\"D\",Jogos!$D:$D,$A36,Jogos!$I:$I,$C36)","v":1},{"$f":"SUMIFS(Jogos!$L:$L,Jogos!$D:$D,$A36,Jogos!$E:$E,$C36)+SUMIFS(Jogos!$Q:$Q,Jogos!$D:$D,$A36,Jogos!$I:$I,$C36)","v":0},{"$f":"SUMIFS(Jogos!$Q:$Q,Jogos!$D:$D,$A36,Jogos!$E:$E,$C36)+SUMIFS(Jogos!$L:$L,Jogos!$D:$D,$A36,Jogos!$I:$I,$C36)","v":1},-1,{"$f":"SUMIFS(Jogos!$M:$M,Jogos!$D:$D,$A36,Jogos!$E:$E,$C36)+SUMIFS(Jogos!$P:$P,Jogos!$D:$D,$A36,Jogos!$I:$I,$C36)","v":2},{"$f":"SUMIFS(Jogos!$P:$P,Jogos!$D:$D,$A36,Jogos!$E:$E,$C36)+SUMIFS(Jogos!$M:$M,Jogos!$D:$D,$A36,Jogos!$I:$I,$C36)","v":3},-1,1]
[{"v":7,"d":"07"},{"v":1,"d":"1º"},"MATIAS [A]",3,{"$f":"COUNTIFS(Jogos!$N:$N,\"V\",Jogos!$D:$D,$A37,Jogos!$E:$E,$C37)+COUNTIFS(Jogos!$O:$O,\"V\",Jogos!$D:$D,$A37,Jogos!$I:$I,$C37)","v":1},{"$f":"COUNTIFS(Jogos!$N:$N,\"E\",Jogos!$D:$D,$A37,Jogos!$E:$E,$C37)+COUNTIFS(Jogos!$O:$O,\"E\",Jogos!$D:$D,$A37,Jogos!$I:$I,$C37)","v":0},{"$f":"COUNTIFS(Jogos!$N:$N,\"D\",Jogos!$D:$D,$A37,Jogos!$E:$E,$C37)+COUNTIFS(Jogos!$O:$O,\"D\",Jogos!$D:$D,$A37,Jogos!$I:$I,$C37)","v":0},{"$f":"SUMIFS(Jogos!$L:$L,Jogos!$D:$D,$A37,Jogos!$E:$E,$C37)+SUMIFS(Jogos!$Q:$Q,Jogos!$D:$D,$A37,Jogos!$I:$I,$C37)","v":2},{"$f":"SUMIFS(Jogos!$Q:$Q,Jogos!$D:$D,$A37,Jogos!$E:$E,$C37)+SUMIFS(Jogos!$L:$L,Jogos!$D:$D,$A37,Jogos!$I:$I,$C37)","v":1},1,{"$f":"SUMIFS(Jogos!$M:$M,Jogos!$D:$D,$A37,Jogos!$E:$E,$C37)+SUMIFS(Jogos!$P:$P,Jogos!$D:$D,$A37,Jogos!$I:$I,$C37)","v":5},{"$f":"SUMIFS(Jogos!$P:$P,Jogos!$D:$D,$A37,Jogos!$E:$E,$C37)+SUMIFS(Jogos!$M:$M,Jogos!$D:$D,$A37,Jogos!$I:$I,$C37)","v":3},2,1]
[{"v":7,"d":"07"},{"v":2,"d":"2º"},"BOTAFOGO",0,{"$f":"COUNTIFS(Jogos!$N:$N,\"V\",Jogos!$D:$D,$A38,Jogos!$E:$E,$C38)+COUNTIFS(Jogos!$O:$O,\"V\",Jogos!$D:$D,$A38,Jogos!$I:$I,$C38)","v":0},{"$f":"COUNTIFS(Jogos!$N:$N,\"E\",Jogos!$D:$D,$A38,Jogos!$E:$E,$C38)+COUNTIFS(Jogos!$O:$O,\"E\",Jogos!$D:$D,$A38,Jogos!$I:$I,$C38)","v":0},{"$f":"COUNTIFS(Jogos!$N:$N,\"D\",Jogos!$D:$D,$A38,Jogos!$E:$E,$C38)+COUNTIFS(Jogos!$O:$O,\"D\",Jogos!$D:$D,$A38,Jogos!$I:$I,$C38)","v":1},{"$f":"SUMIFS(Jogos!$L:$L,Jogos!$D:$D,$A38,Jogos!$E:$E,$C38)+SUMIFS(Jogos!$Q:$Q,Jogos!$D:$D,$A38,Jogos!$I:$I,$C38)","v":1},{"$f":"SUMIFS(Jogos!$Q:$Q,Jogos!$D:$D,$A38,Jogos!$E:$E,$C38)+SUMIFS(Jogos!$L:$L,Jogos!$D:$D,$A38,Jogos!$I:$I,$C38)","v":2},-1,{"$f":"SUMIFS(Jogos!$M:$M,Jogos!$D:$D,$A38,Jogos!$E:$E,$C38)+SUMIFS(Jogos!$P:$P,Jogos!$D:$D,$A38,Jogos!$I:$I,$C38)","v":3},{"$f":"SUMIFS(Jogos!$P:$P,Jogos!$D:$D,$A38,Jogos!$E:$E,$C38)+SUMIFS(Jogos!$M:$M,Jogos!$D:$D,$A38,Jogos!$I:$I,$C38)","v":5},-2,1]
[{"v":8,"d":"08"},{"v":1,"d":"1º"},"UNIÃO INDEPENDENTE/UBERABA",1,{"$f":"COUNTIFS(Jogos!$N:$N,\"V\",Jogos!$D:$D,$A39,Jogos!$E:$E,$C39)+COUNTIFS(Jogos!$O:$O,\"V\",Jogos!$D:$D,$A39,Jogos!$I:$I,$C39)","v":0},{"$f":"COUNTIFS(Jogos!$N:$N,\"E\",Jogos!$D:$D,$A39,Jogos!$E:$E,$C39)+COUNTIFS(Jogos!$O:$O,\"E\",Jogos!$D:$D,$A39,Jogos!$I:$I,$C39)","v":1},{"$f":"COUNTIFS(Jogos!$N:$N,\"D\",Jogos!$D:$D,$A39,Jogos!$E:$E,$C39)+COUNTIFS(Jogos!$O:$O,\"D\",Jogos!$D:$D,$A39,Jogos!$I:$I,$C39)","v":0},{"$f":"SUMIFS(Jogos!$L:$L,Jogos!$D:$D,$A39,Jogos!$E:$E,$C39)+SUMIFS(Jogos!$Q:$Q,Jogos!$D:$D,$A39,Jogos!$I:$I,$C39)","v":1},{"$f":"SUMIFS(Jogos!$Q:$Q,Jogos!$D:$D,$A39,Jogos!$E:$E,$C39)+SUMIFS(Jogos!$L:$L,Jogos!$D:$D,$A39,Jogos!$I:$I,$C39)","v":1},0,{"$f":"SUMIFS(Jogos!$M:$M,Jogos!$D:$D,$A39,Jogos!$E:$E,$C39)+SUMIFS(Jogos!$P:$P,Jogos!$D:$D,$A39,Jogos!$I:$I,$C39)","v":2},{"$f":"SUMIFS(Jogos!$P:$P,Jogos!$D:$D,$A39,Jogos!$E:$E,$C39)+SUMIFS(Jogos!$M:$M,Jogos!$D:$D,$A39,Jogos!$I:$I,$C39)","v":2},0,1]
[{"v":8,"d":"08"},{"v":2,"d":"2º"},"LIBERDADE [B]",1,{"$f":"COUNTIFS(Jogos!$N:$N,\"V\",Jogos!$D:$D,$A40,Jogos!$E:$E,$C40)+COUNTIFS(Jogos!$O:$O,\"V\",Jogos!$D:$D,$A40,Jogos!$I:$I,$C40)","v":0},{"$f":"COUNTIFS(Jogos!$N:$N,\"E\",Jogos!$D:$D,$A40,Jogos!$E:$E,$C40)+COUNTIFS(Jogos!$O:$O,\"E\",Jogos!$D:$D,$A40,Jogos!$I:$I,$C40)","v":1},{"$f":"COUNTIFS(Jogos!$N:$N,\"D\",Jogos!$D:$D,$A40,Jogos!$E:$E,$C40)+COUNTIFS(Jogos!$O:$O,\"D\",Jogos!$D:$D,$A40,Jogos!$I:$I,$C40)","v":0},{"$f":"SUMIFS(Jogos!$L:$L,Jogos!$D:$D,$A40,Jogos!$E:$E,$C40)+SUMIFS(Jogos!$Q:$Q,Jogos!$D:$D,$A40,Jogos!$I:$I,$C40)","v":1},{"$f":"SUMIFS(Jogos!$Q:$Q,Jogos!$D:$D,$A40,Jogos!$E:$E,$C40)+SUMIFS(Jogos!$L:$L,Jogos!$D:$D,$A40,Jogos!$I:$I,$C40)","v":1},0,{"$f":"SUMIFS(Jogos!$M:$M,Jogos!$D:$D,$A40,Jogos!$E:$E,$C40)+SUMIFS(Jogos!$P:$P,Jogos!$D:$D,$A40,Jogos!$I:$I,$C40)","v":2},{"$f":"SUMIFS(Jogos!$P:$P,Jogos!$D:$D,$A40,Jogos!$E:$E,$C40)+SUMIFS(Jogos!$M:$M,Jogos!$D:$D,$A40,Jogos!$I:$I,$C40)","v":2},0,1]
[]
["TAÇA DE OURO",null,null,"PG","V","E","D","GP","GC","SG","GPI","GCI","SGI","J"]
["SEMI-FINAIS"]
[{"v":9,"d":"09"},{"v":1,"d":"1º"},"TUPI [A]",{"$f":"E44*3+F44","v":3},{"$f":"COUNTIFS(Jogos!$N:$N,\"V\",Jogos!$D:$D,$A44,Jogos!$E:$E,$C44)+COUNTIFS(Jogos!$O:$O,\"V\",Jogos!$D:$D,$A44,Jogos!$I:$I,$C44)","v":1},{"$f":"COUNTIFS(Jogos!$N:$N,\"E\",Jogos!$D:$D,$A44,Jogos!$E:$E,$C44)+COUNTIFS(Jogos!$O:$O,\"E\",Jogos!$D:$D,$A44,Jogos!$I:$I,$C44)","v":0},{"$f":"COUNTIFS(Jogos!$N:$N,\"D\",Jogos!$D:$D,$A44,Jogos!$E:$E,$C44)+COUNTIFS(Jogos!$O:$O,\"D\",Jogos!$D:$D,$A44,Jogos!$I:$I,$C44)","v":0},{"$f":"SUMIFS(Jogos!$L:$L,Jogos!$D:$D,$A44,Jogos!$E:$E,$C44)+SUMIFS(Jogos!$Q:$Q,Jogos!$D:$D,$A44,Jogos!$I:$I,$C44)","v":2},{"$f":"SUMIFS(Jogos!$Q:$Q,Jogos!$D:$D,$A44,Jogos!$E:$E,$C44)+SUMIFS(Jogos!$L:$L,Jogos!$D:$D,$A44,Jogos!$I:$I,$C44)","v":0},{"$f":"H44-I44","v":2},{"$f":"SUMIFS(Jogos!$M:$M,Jogos!$D:$D,$A44,Jogos!$E:$E,$C44)+SUMIFS(Jogos!$P:$P,Jogos!$D:$D,$A44,Jogos!$I:$I,$C44)","v":2},{"$f":"SUMIFS(Jogos!$P:$P,Jogos!$D:$D,$A44,Jogos!$E:$E,$C44)+SUMIFS(Jogos!$M:$M,Jogos!$D:$D,$A44,Jogos!$I:$I,$C44)","v":0},{"$f":"K44-L44","v":2},{"$f":"SUM(E44:G44)","v":1}]
[{"v":9,"d":"09"},{"v":2,"d":"2º"},"UNIÃO INDEPENDENTE/UBERABA",{"$f":"E45*3+F45","v":0},{"$f":"COUNTIFS(Jogos!$N:$N,\"V\",Jogos!$D:$D,$A45,Jogos!$E:$E,$C45)+COUNTIFS(Jogos!$O:$O,\"V\",Jogos!$D:$D,$A45,Jogos!$I:$I,$C45)","v":0},{"$f":"COUNTIFS(Jogos!$N:$N,\"E\",Jogos!$D:$D,$A45,Jogos!$E:$E,$C45)+COUNTIFS(Jogos!$O:$O,\"E\",Jogos!$D:$D,$A45,Jogos!$I:$I,$C45)","v":0},{"$f":"COUNTIFS(Jogos!$N:$N,\"D\",Jogos!$D:$D,$A45,Jogos!$E:$E,$C45)+COUNTIFS(Jogos!$O:$O,\"D\",Jogos!$D:$D,$A45,Jogos!$I:$I,$C45)","v":1},{"$f":"SUMIFS(Jogos!$L:$L,Jogos!$D:$D,$A45,Jogos!$E:$E,$C45)+SUMIFS(Jogos!$Q:$Q,Jogos!$D:$D,$A45,Jogos!$I:$I,$C45)","v":0},{"$f":"SUMIFS(Jogos!$Q:$Q,Jogos!$D:$D,$A45,Jogos!$E:$E,$C45)+SUMIFS(Jogos!$L:$L,Jogos!$D:$D,$A45,Jogos!$I:$I,$C45)","v":2},{"$f":"H45-I45","v":-2},{"$f":"SUMIFS(Jogos!$M:$M,Jogos!$D:$D,$A45,Jogos!$E:$E,$C45)+SUMIFS(Jogos!$P:$P,Jogos!$D:$D,$A45,Jogos!$I:$I,$C45)","v":0},{"$f":"SUMIFS(Jogos!$P:$P,Jogos!$D:$D,$A45,Jogos!$E:$E,$C45)+SUMIFS(Jogos!$M:$M,Jogos!$D:$D,$A45,Jogos!$I:$I,$C45)","v":2},{"$f":"K45-L45","v":-2},{"$f":"SUM(E45:G45)","v":1}]
[10,{"v":1,"d":"1º"},"LIBERDADE [A]",{"$f":"E46*3+F46","v":3},{"$f":"COUNTIFS(Jogos!$N:$N,\"V\",Jogos!$D:$D,$A46,Jogos!$E:$E,$C46)+COUNTIFS(Jogos!$O:$O,\"V\",Jogos!$D:$D,$A46,Jogos!$I:$I,$C46)","v":1},{"$f":"COUNTIFS(Jogos!$N:$N,\"E\",Jogos!$D:$D,$A46,Jogos!$E:$E,$C46)+COUNTIFS(Jogos!$O:$O,\"E\",Jogos!$D:$D,$A46,Jogos!$I:$I,$C46)","v":0},{"$f":"COUNTIFS(Jogos!$N:$N,\"D\",Jogos!$D:$D,$A46,Jogos!$E:$E,$C46)+COUNTIFS(Jogos!$O:$O,\"D\",Jogos!$D:$D,$A46,Jogos!$I:$I,$C46)","v":0},{"$f":"SUMIFS(Jogos!$L:$L,Jogos!$D:$D,$A46,Jogos!$E:$E,$C46)+SUMIFS(Jogos!$Q:$Q,Jogos!$D:$D,$A46,Jogos!$I:$I,$C46)","v":3},{"$f":"SUMIFS(Jogos!$Q:$Q,Jogos!$D:$D,$A46,Jogos!$E:$E,$C46)+SUMIFS(Jogos!$L:$L,Jogos!$D:$D,$A46,Jogos!$I:$I,$C46)","v":0},{"$f":"H46-I46","v":3},{"$f":"SUMIFS(Jogos!$M:$M,Jogos!$D:$D,$A46,Jogos!$E:$E,$C46)+SUMIFS(Jogos!$P:$P,Jogos!$D:$D,$A46,Jogos!$I:$I,$C46)","v":4},{"$f":"SUMIFS(Jogos!$P:$P,Jogos!$D:$D,$A46,Jogos!$E:$E,$C46)+SUMIFS(Jogos!$M:$M,Jogos!$D:$D,$A46,Jogos!$I:$I,$C46)","v":0},{"$f":"K46-L46","v":4},{"$f":"SUM(E46:G46)","v":1}]
[10,{"v":2,"d":"2º"},"MATIAS [A]",{"$f":"E47*3+F47","v":0},{"$f":"COUNTIFS(Jogos!$N:$N,\"V\",Jogos!$D:$D,$A47,Jogos!$E:$E,$C47)+COUNTIFS(Jogos!$O:$O,\"V\",Jogos!$D:$D,$A47,Jogos!$I:$I,$C47)","v":0},{"$f":"COUNTIFS(Jogos!$N:$N,\"E\",Jogos!$D:$D,$A47,Jogos!$E:$E,$C47)+COUNTIFS(Jogos!$O:$O,\"E\",Jogos!$D:$D,$A47,Jogos!$I:$I,$C47)","v":0},{"$f":"COUNTIFS(Jogos!$N:$N,\"D\",Jogos!$D:$D,$A47,Jogos!$E:$E,$C47)+COUNTIFS(Jogos!$O:$O,\"D\",Jogos!$D:$D,$A47,Jogos!$I:$I,$C47)","v":1},{"$f":"SUMIFS(Jogos!$L:$L,Jogos!$D:$D,$A47,Jogos!$E:$E,$C47)+SUMIFS(Jogos!$Q:$Q,Jogos!$D:$D,$A47,Jogos!$I:$I,$C47)","v":0},{"$f":"SUMIFS(Jogos!$Q:$Q,Jogos!$D:$D,$A47,Jogos!$E:$E,$C47)+SUMIFS(Jogos!$L:$L,Jogos!$D:$D,$A47,Jogos!$I:$I,$C47)","v":3},{"$f":"H47-I47","v":-3},{"$f":"SUMIFS(Jogos!$M:$M,Jogos!$D:$D,$A47,Jogos!$E:$E,$C47)+SUMIFS(Jogos!$P:$P,Jogos!$D:$D,$A47,Jogos!$I:$I,$C47)","v":0},{"$f":"SUMIFS(Jogos!$P:$P,Jogos!$D:$D,$A47,Jogos!$E:$E,$C47)+SUMIFS(Jogos!$M:$M,Jogos!$D:$D,$A47,Jogos!$I:$I,$C47)","v":4},{"$f":"K47-L47","v":-4},{"$f":"SUM(E47:G47)","v":1}]
[]
["TAÇA DE OURO",null,null,"PG","V","E","D","GP","GC","SG","GPI","GCI","SGI","J"]
["FINAL"]
[11,{"v":1,"d":"1º"},"LIBERDADE [A]",{"$f":"E51*3+F51","v":3},{"$f":"COUNTIFS(Jogos!$N:$N,\"V\",Jogos!$D:$D,$A51,Jogos!$E:$E,$C51)+COUNTIFS(Jogos!$O:$O,\"V\",Jogos!$D:$D,$A51,Jogos!$I:$I,$C51)","v":1},{"$f":"COUNTIFS(Jogos!$N:$N,\"E\",Jogos!$D:$D,$A51,Jogos!$E:$E,$C51)+COUNTIFS(Jogos!$O:$O,\"E\",Jogos!$D:$D,$A51,Jogos!$I:$I,$C51)","v":0},{"$f":"COUNTIFS(Jogos!$N:$N,\"D\",Jogos!$D:$D,$A51,Jogos!$E:$E,$C51)+COUNTIFS(Jogos!$O:$O,\"D\",Jogos!$D:$D,$A51,Jogos!$I:$I,$C51)","v":0},{"$f":"SUMIFS(Jogos!$L:$L,Jogos!$D:$D,$A51,Jogos!$E:$E,$C51)+SUMIFS(Jogos!$Q:$Q,Jogos!$D:$D,$A51,Jogos!$I:$I,$C51)","v":2},{"$f":"SUMIFS(Jogos!$Q:$Q,Jogos!$D:$D,$A51,Jogos!$E:$E,$C51)+SUMIFS(Jogos!$L:$L,Jogos!$D:$D,$A51,Jogos!$I:$I,$C51)","v":1},{"$f":"H51-I51","v":1},{"$f":"SUMIFS(Jogos!$M:$M,Jogos!$D:$D,$A51,Jogos!$E:$E,$C51)+SUMIFS(Jogos!$P:$P,Jogos!$D:$D,$A51,Jogos!$I:$I,$C51)","v":5},{"$f":"SUMIFS(Jogos!$P:$P,Jogos!$D:$D,$A51,Jogos!$E:$E,$C51)+SUMIFS(Jogos!$M:$M,Jogos!$D:$D,$A51,Jogos!$I:$I,$C51)","v":5},{"$f":"K51-L51","v":0},{"$f":"SUM(E51:G51)","v":1}]
[11,{"v":2,"d":"2º"},"TUPI [A]",{"$f":"E52*3+F52","v":0},{"$f":"COUNTIFS(Jogos!$N:$N,\"V\",Jogos!$D:$D,$A52,Jogos!$E:$E,$C52)+COUNTIFS(Jogos!$O:$O,\"V\",Jogos!$D:$D,$A52,Jogos!$I:$I,$C52)","v":0},{"$f":"COUNTIFS(Jogos!$N:$N,\"E\",Jogos!$D:$D,$A52,Jogos!$E:$E,$C52)+COUNTIFS(Jogos!$O:$O,\"E\",Jogos!$D:$D,$A52,Jogos!$I:$I,$C52)","v":0},{"$f":"COUNTIFS(Jogos!$N:$N,\"D\",Jogos!$D:$D,$A52,Jogos!$E:$E,$C52)+COUNTIFS(Jogos!$O:$O,\"D\",Jogos!$D:$D,$A52,Jogos!$I:$I,$C52)","v":1},{"$f":"SUMIFS(Jogos!$L:$L,Jogos!$D:$D,$A52,Jogos!$E:$E,$C52)+SUMIFS(Jogos!$Q:$Q,Jogos!$D:$D,$A52,Jogos!$I:$I,$C52)","v":1},{"$f":"SUMIFS(Jogos!$Q:$Q,Jogos!$D:$D,$A52,Jogos!$E:$E,$C52)+SUMIFS(Jogos!$L:$L,Jogos!$D:$D,$A52,Jogos!$I:$I,$C52)","v":2},{"$f":"H52-I52","v":-1},{"$f":"SUMIFS(Jogos!$M:$M,Jogos!$D:$D,$A52,Jogos!$E:$E,$C52)+SUMIFS(Jogos!$P:$P,Jogos!$D:$D,$A52,Jogos!$I:$I,$C52)","v":5},{"$f":"SUMIFS(Jogos!$P:$P,Jogos!$D:$D,$A52,Jogos!$E:$E,$C52)+SUMIFS(Jogos!$M:$M,Jogos!$D:$D,$A52,Jogos!$I:$I,$C52)","v":5},{"$f":"K52-L52","v":0},{"$f":"SUM(E52:G52)","v":1}]

{"sheet":"ClaPRA","index":7,"n_rows":23,"n_cols":14,"rows_kept":23}
[{"$f":"ClaFIN!A1","v":"XL CAMPEONATO BRASILEIRO INTERCLUBES / 2022"}]
[{"$f":"ClaFIN!A2","v":"Matias Barbosa / MG, 15 a 17 de abril de 2022"}]
[]
["TAÇA DE PRATA",null,null,"PG","V","E","D","GP","GC","SG","GPI","GCI","SGI","J"]
["PRIMEIRA FASE"]
["TP.01",{"v":1,"d":"1º"},"ELDORADO",{"$f":"E6*3+F6","v":3},{"$f":"COUNTIFS(Jogos!$N:$N,\"V\",Jogos!$D:$D,$A6,Jogos!$E:$E,$C6)+COUNTIFS(Jogos!$O:$O,\"V\",Jogos!$D:$D,$A6,Jogos!$I:$I,$C6)","v":1},{"$f":"COUNTIFS(Jogos!$N:$N,\"E\",Jogos!$D:$D,$A6,Jogos!$E:$E,$C6)+COUNTIFS(Jogos!$O:$O,\"E\",Jogos!$D:$D,$A6,Jogos!$I:$I,$C6)","v":0},{"$f":"COUNTIFS(Jogos!$N:$N,\"D\",Jogos!$D:$D,$A6,Jogos!$E:$E,$C6)+COUNTIFS(Jogos!$O:$O,\"D\",Jogos!$D:$D,$A6,Jogos!$I:$I,$C6)","v":0},{"$f":"SUMIFS(Jogos!$L:$L,Jogos!$D:$D,$A6,Jogos!$E:$E,$C6)+SUMIFS(Jogos!$Q:$Q,Jogos!$D:$D,$A6,Jogos!$I:$I,$C6)","v":2},{"$f":"SUMIFS(Jogos!$Q:$Q,Jogos!$D:$D,$A6,Jogos!$E:$E,$C6)+SUMIFS(Jogos!$L:$L,Jogos!$D:$D,$A6,Jogos!$I:$I,$C6)","v":0},{"$f":"H6-I6","v":2},{"$f":"SUMIFS(Jogos!$M:$M,Jogos!$D:$D,$A6,Jogos!$E:$E,$C6)+SUMIFS(Jogos!$P:$P,Jogos!$D:$D,$A6,Jogos!$I:$I,$C6)","v":6},{"$f":"SUMIFS(Jogos!$P:$P,Jogos!$D:$D,$A6,Jogos!$E:$E,$C6)+SUMIFS(Jogos!$M:$M,Jogos!$D:$D,$A6,Jogos!$I:$I,$C6)","v":1},{"$f":"K6-L6","v":5},{"$f":"SUM(E6:G6)","v":1}]
["TP.01",{"v":2,"d":"2º"},"MATIAS [B]",0,{"$f":"COUNTIFS(Jogos!$N:$N,\"V\",Jogos!$D:$D,$A7,Jogos!$E:$E,$C7)+COUNTIFS(Jogos!$O:$O,\"V\",Jogos!$D:$D,$A7,Jogos!$I:$I,$C7)","v":0},{"$f":"COUNTIFS(Jogos!$N:$N,\"E\",Jogos!$D:$D,$A7,Jogos!$E:$E,$C7)+COUNTIFS(Jogos!$O:$O,\"E\",Jogos!$D:$D,$A7,Jogos!$I:$I,$C7)","v":0},{"$f":"COUNTIFS(Jogos!$N:$N,\"D\",Jogos!$D:$D,$A7,Jogos!$E:$E,$C7)+COUNTIFS(Jogos!$O:$O,\"D\",Jogos!$D:$D,$A7,Jogos!$I:$I,$C7)","v":1},{"$f":"SUMIFS(Jogos!$L:$L,Jogos!$D:$D,$A7,Jogos!$E:$E,$C7)+SUMIFS(Jogos!$Q:$Q,Jogos!$D:$D,$A7,Jogos!$I:$I,$C7)","v":0},{"$f":"SUMIFS(Jogos!$Q:$Q,Jogos!$D:$D,$A7,Jogos!$E:$E,$C7)+SUMIFS(Jogos!$L:$L,Jogos!$D:$D,$A7,Jogos!$I:$I,$C7)","v":2},-2,{"$f":"SUMIFS(Jogos!$M:$M,Jogos!$D:$D,$A7,Jogos!$E:$E,$C7)+SUMIFS(Jogos!$P:$P,Jogos!$D:$D,$A7,Jogos!$I:$I,$C7)","v":1},{"$f":"SUMIFS(Jogos!$P:$P,Jogos!$D:$D,$A7,Jogos!$E:$E,$C7)+SUMIFS(Jogos!$M:$M,Jogos!$D:$D,$A7,Jogos!$I:$I,$C7)","v":6},-5,1]
["TP.02",{"v":1,"d":"1º"},"CHACAL [A]",{"$f":"E8*3+F8","v":3},{"$f":"COUNTIFS(Jogos!$N:$N,\"V\",Jogos!$D:$D,$A8,Jogos!$E:$E,$C8)+COUNTIFS(Jogos!$O:$O,\"V\",Jogos!$D:$D,$A8,Jogos!$I:$I,$C8)","v":1},{"$f":"COUNTIFS(Jogos!$N:$N,\"E\",Jogos!$D:$D,$A8,Jogos!$E:$E,$C8)+COUNTIFS(Jogos!$O:$O,\"E\",Jogos!$D:$D,$A8,Jogos!$I:$I,$C8)","v":0},{"$f":"COUNTIFS(Jogos!$N:$N,\"D\",Jogos!$D:$D,$A8,Jogos!$E:$E,$C8)+COUNTIFS(Jogos!$O:$O,\"D\",Jogos!$D:$D,$A8,Jogos!$I:$I,$C8)","v":0},{"$f":"SUMIFS(Jogos!$L:$L,Jogos!$D:$D,$A8,Jogos!$E:$E,$C8)+SUMIFS(Jogos!$Q:$Q,Jogos!$D:$D,$A8,Jogos!$I:$I,$C8)","v":3},{"$f":"SUMIFS(Jogos!$Q:$Q,Jogos!$D:$D,$A8,Jogos!$E:$E,$C8)+SUMIFS(Jogos!$L:$L,Jogos!$D:$D,$A8,Jogos!$I:$I,$C8)","v":0},{"$f":"H8-I8","v":3},{"$f":"SUMIFS(Jogos!$M:$M,Jogos!$D:$D,$A8,Jogos!$E:$E,$C8)+SUMIFS(Jogos!$P:$P,Jogos!$D:$D,$A8,Jogos!$I:$I,$C8)","v":13},{"$f":"SUMIFS(Jogos!$P:$P,Jogos!$D:$D,$A8,Jogos!$E:$E,$C8)+SUMIFS(Jogos!$M:$M,Jogos!$D:$D,$A8,Jogos!$I:$I,$C8)","v":1},{"$f":"K8-L8","v":12},{"$f":"SUM(E8:G8)","v":1}]
["TP.02",{"v":2,"d":"2º"},"CHACAL [B]",0,{"$f":"COUNTIFS(Jogos!$N:$N,\"V\",Jogos!$D:$D,$A9,Jogos!$E:$E,$C9)+COUNTIFS(Jogos!$O:$O,\"V\",Jogos!$D:$D,$A9,Jogos!$I:$I,$C9)","v":0},{"$f":"COUNTIFS(Jogos!$N:$N,\"E\",Jogos!$D:$D,$A9,Jogos!$E:$E,$C9)+COUNTIFS(Jogos!$O:$O,\"E\",Jogos!$D:$D,$A9,Jogos!$I:$I,$C9)","v":0},{"$f":"COUNTIFS(Jogos!$N:$N,\"D\",Jogos!$D:$D,$A9,Jogos!$E:$E,$C9)+COUNTIFS(Jogos!$O:$O,\"D\",Jogos!$D:$D,$A9,Jogos!$I:$I,$C9)","v":1},{"$f":"SUMIFS(Jogos!$L:$L,Jogos!$D:$D,$A9,Jogos!$E:$E,$C9)+SUMIFS(Jogos!$Q:$Q,Jogos!$D:$D,$A9,Jogos!$I:$I,$C9)","v":0},{"$f":"SUMIFS(Jogos!$Q:$Q,Jogos!$D:$D,$A9,Jogos!$E:$E,$C9)+SUMIFS(Jogos!$L:$L,Jogos!$D:$D,$A9,Jogos!$I:$I,$C9)","v":3},-3,{"$f":"SUMIFS(Jogos!$M:$M,Jogos!$D:$D,$A9,Jogos!$E:$E,$C9)+SUMIFS(Jogos!$P:$P,Jogos!$D:$D,$A9,Jogos!$I:$I,$C9)","v":1},{"$f":"SUMIFS(Jogos!$P:$P,Jogos!$D:$D,$A9,Jogos!$E:$E,$C9)+SUMIFS(Jogos!$M:$M,Jogos!$D:$D,$A9,Jogos!$I:$I,$C9)","v":13},-12,1]
["TP.03",{"v":1,"d":"1º"},"AABB/ACAFUMA [B]",3,{"$f":"COUNTIFS(Jogos!$N:$N,\"V\",Jogos!$D:$D,$A10,Jogos!$E:$E,$C10)+COUNTIFS(Jogos!$O:$O,\"V\",Jogos!$D:$D,$A10,Jogos!$I:$I,$C10)","v":1},{"$f":"COUNTIFS(Jogos!$N:$N,\"E\",Jogos!$D:$D,$A10,Jogos!$E:$E,$C10)+COUNTIFS(Jogos!$O:$O,\"E\",Jogos!$D:$D,$A10,Jogos!$I:$I,$C10)","v":0},{"$f":"COUNTIFS(Jogos!$N:$N,\"D\",Jogos!$D:$D,$A10,Jogos!$E:$E,$C10)+COUNTIFS(Jogos!$O:$O,\"D\",Jogos!$D:$D,$A10,Jogos!$I:$I,$C10)","v":0},{"$f":"SUMIFS(Jogos!$L:$L,Jogos!$D:$D,$A10,Jogos!$E:$E,$C10)+SUMIFS(Jogos!$Q:$Q,Jogos!$D:$D,$A10,Jogos!$I:$I,$C10)","v":2},{"$f":"SUMIFS(Jogos!$Q:$Q,Jogos!$D:$D,$A10,Jogos!$E:$E,$C10)+SUMIFS(Jogos!$L:$L,Jogos!$D:$D,$A10,Jogos!$I:$I,$C10)","v":1},1,{"$f":"SUMIFS(Jogos!$M:$M,Jogos!$D:$D,$A10,Jogos!$E:$E,$C10)+SUMIFS(Jogos!$P:$P,Jogos!$D:$D,$A10,Jogos!$I:$I,$C10)","v":7},{"$f":"SUMIFS(Jogos!$P:$P,Jogos!$D:$D,$A10,Jogos!$E:$E,$C10)+SUMIFS(Jogos!$M:$M,Jogos!$D:$D,$A10,Jogos!$I:$I,$C10)","v":2},5,1]
["TP.03",{"v":2,"d":"2º"},"GRÊMIO MINEIRO",0,{"$f":"COUNTIFS(Jogos!$N:$N,\"V\",Jogos!$D:$D,$A11,Jogos!$E:$E,$C11)+COUNTIFS(Jogos!$O:$O,\"V\",Jogos!$D:$D,$A11,Jogos!$I:$I,$C11)","v":0},{"$f":"COUNTIFS(Jogos!$N:$N,\"E\",Jogos!$D:$D,$A11,Jogos!$E:$E,$C11)+COUNTIFS(Jogos!$O:$O,\"E\",Jogos!$D:$D,$A11,Jogos!$I:$I,$C11)","v":0},{"$f":"COUNTIFS(Jogos!$N:$N,\"D\",Jogos!$D:$D,$A11,Jogos!$E:$E,$C11)+COUNTIFS(Jogos!$O:$O,\"D\",Jogos!$D:$D,$A11,Jogos!$I:$I,$C11)","v":1},{"$f":"SUMIFS(Jogos!$L:$L,Jogos!$D:$D,$A11,Jogos!$E:$E,$C11)+SUMIFS(Jogos!$Q:$Q,Jogos!$D:$D,$A11,Jogos!$I:$I,$C11)","v":1},{"$f":"SUMIFS(Jogos!$Q:$Q,Jogos!$D:$D,$A11,Jogos!$E:$E,$C11)+SUMIFS(Jogos!$L:$L,Jogos!$D:$D,$A11,Jogos!$I:$I,$C11)","v":2},-1,{"$f":"SUMIFS(Jogos!$M:$M,Jogos!$D:$D,$A11,Jogos!$E:$E,$C11)+SUMIFS(Jogos!$P:$P,Jogos!$D:$D,$A11,Jogos!$I:$I,$C11)","v":2},{"$f":"SUMIFS(Jogos!$P:$P,Jogos!$D:$D,$A11,Jogos!$E:$E,$C11)+SUMIFS(Jogos!$M:$M,Jogos!$D:$D,$A11,Jogos!$I:$I,$C11)","v":7},-5,1]
[]
["TAÇA DE PRATA",null,null,"PG","V","E","D","GP","GC","SG","GPI","GCI","SGI","J"]
["SEMI-FINAL"]
["TP.04",{"v":1,"d":"1º"},"COMARY",{"$f":"E15*3+F15","v":3},{"$f":"COUNTIFS(Jogos!$N:$N,\"V\",Jogos!$D:$D,$A15,Jogos!$E:$E,$C15)+COUNTIFS(Jogos!$O:$O,\"V\",Jogos!$D:$D,$A15,Jogos!$I:$I,$C15)","v":1},{"$f":"COUNTIFS(Jogos!$N:$N,\"E\",Jogos!$D:$D,$A15,Jogos!$E:$E,$C15)+COUNTIFS(Jogos!$O:$O,\"E\",Jogos!$D:$D,$A15,Jogos!$I:$I,$C15)","v":0},{"$f":"COUNTIFS(Jogos!$N:$N,\"D\",Jogos!$D:$D,$A15,Jogos!$E:$E,$C15)+COUNTIFS(Jogos!$O:$O,\"D\",Jogos!$D:$D,$A15,Jogos!$I:$I,$C15)","v":0},{"$f":"SUMIFS(Jogos!$L:$L,Jogos!$D:$D,$A15,Jogos!$E:$E,$C15)+SUMIFS(Jogos!$Q:$Q,Jogos!$D:$D,$A15,Jogos!$I:$I,$C15)","v":2},{"$f":"SUMIFS(Jogos!$Q:$Q,Jogos!$D:$D,$A15,Jogos!$E:$E,$C15)+SUMIFS(Jogos!$L:$L,Jogos!$D:$D,$A15,Jogos!$I:$I,$C15)","v":0},{"$f":"H15-I15","v":2},{"$f":"SUMIFS(Jogos!$M:$M,Jogos!$D:$D,$A15,Jogos!$E:$E,$C15)+SUMIFS(Jogos!$P:$P,Jogos!$D:$D,$A15,Jogos!$I:$I,$C15)","v":5},{"$f":"SUMIFS(Jogos!$P:$P,Jogos!$D:$D,$A15,Jogos!$E:$E,$C15)+SUMIFS(Jogos!$M:$M,Jogos!$D:$D,$A15,Jogos!$I:$I,$C15)","v":3},{"$f":"K15-L15","v":2},{"$f":"SUM(E15:G15)","v":1}]
["TP.04",{"v":2,"d":"2º"},"ELDORADO",{"$f":"E16*3+F16","v":0},{"$f":"COUNTIFS(Jogos!$N:$N,\"V\",Jogos!$D:$D,$A16,Jogos!$E:$E,$C16)+COUNTIFS(Jogos!$O:$O,\"V\",Jogos!$D:$D,$A16,Jogos!$I:$I,$C16)","v":0},{"$f":"COUNTIFS(Jogos!$N:$N,\"E\",Jogos!$D:$D,$A16,Jogos!$E:$E,$C16)+COUNTIFS(Jogos!$O:$O,\"E\",Jogos!$D:$D,$A16,Jogos!$I:$I,$C16)","v":0},{"$f":"COUNTIFS(Jogos!$N:$N,\"D\",Jogos!$D:$D,$A16,Jogos!$E:$E,$C16)+COUNTIFS(Jogos!$O:$O,\"D\",Jogos!$D:$D,$A16,Jogos!$I:$I,$C16)","v":1},{"$f":"SUMIFS(Jogos!$L:$L,Jogos!$D:$D,$A16,Jogos!$E:$E,$C16)+SUMIFS(Jogos!$Q:$Q,Jogos!$D:$D,$A16,Jogos!$I:$I,$C16)","v":0},{"$f":"SUMIFS(Jogos!$Q:$Q,Jogos!$D:$D,$A16,Jogos!$E:$E,$C16)+SUMIFS(Jogos!$L:$L,Jogos!$D:$D,$A16,Jogos!$I:$I,$C16)","v":2},{"$f":"H16-I16","v":-2},{"$f":"SUMIFS(Jogos!$M:$M,Jogos!$D:$D,$A16,Jogos!$E:$E,$C16)+SUMIFS(Jogos!$P:$P,Jogos!$D:$D,$A16,Jogos!$I:$I,$C16)","v":3},{"$f":"SUMIFS(Jogos!$P:$P,Jogos!$D:$D,$A16,Jogos!$E:$E,$C16)+SUMIFS(Jogos!$M:$M,Jogos!$D:$D,$A16,Jogos!$I:$I,$C16)","v":5},{"$f":"K16-L16","v":-2},{"$f":"SUM(E16:G16)","v":1}]
["TP.05",{"v":1,"d":"1º"},"AABB/ACAFUMA [B]",{"$f":"E17*3+F17","v":3},{"$f":"COUNTIFS(Jogos!$N:$N,\"V\",Jogos!$D:$D,$A17,Jogos!$E:$E,$C17)+COUNTIFS(Jogos!$O:$O,\"V\",Jogos!$D:$D,$A17,Jogos!$I:$I,$C17)","v":1},{"$f":"COUNTIFS(Jogos!$N:$N,\"E\",Jogos!$D:$D,$A17,Jogos!$E:$E,$C17)+COUNTIFS(Jogos!$O:$O,\"E\",Jogos!$D:$D,$A17,Jogos!$I:$I,$C17)","v":0},{"$f":"COUNTIFS(Jogos!$N:$N,\"D\",Jogos!$D:$D,$A17,Jogos!$E:$E,$C17)+COUNTIFS(Jogos!$O:$O,\"D\",Jogos!$D:$D,$A17,Jogos!$I:$I,$C17)","v":0},{"$f":"SUMIFS(Jogos!$L:$L,Jogos!$D:$D,$A17,Jogos!$E:$E,$C17)+SUMIFS(Jogos!$Q:$Q,Jogos!$D:$D,$A17,Jogos!$I:$I,$C17)","v":3},{"$f":"SUMIFS(Jogos!$Q:$Q,Jogos!$D:$D,$A17,Jogos!$E:$E,$C17)+SUMIFS(Jogos!$L:$L,Jogos!$D:$D,$A17,Jogos!$I:$I,$C17)","v":1},{"$f":"H17-I17","v":2},{"$f":"SUMIFS(Jogos!$M:$M,Jogos!$D:$D,$A17,Jogos!$E:$E,$C17)+SUMIFS(Jogos!$P:$P,Jogos!$D:$D,$A17,Jogos!$I:$I,$C17)","v":7},{"$f":"SUMIFS(Jogos!$P:$P,Jogos!$D:$D,$A17,Jogos!$E:$E,$C17)+SUMIFS(Jogos!$M:$M,Jogos!$D:$D,$A17,Jogos!$I:$I,$C17)","v":3},{"$f":"K17-L17","v":4},{"$f":"SUM(E17:G17)","v":1}]
["TP.05",{"v":2,"d":"2º"},"CHACAL [A]",{"$f":"E18*3+F18","v":0},{"$f":"COUNTIFS(Jogos!$N:$N,\"V\",Jogos!$D:$D,$A18,Jogos!$E:$E,$C18)+COUNTIFS(Jogos!$O:$O,\"V\",Jogos!$D:$D,$A18,Jogos!$I:$I,$C18)","v":0},{"$f":"COUNTIFS(Jogos!$N:$N,\"E\",Jogos!$D:$D,$A18,Jogos!$E:$E,$C18)+COUNTIFS(Jogos!$O:$O,\"E\",Jogos!$D:$D,$A18,Jogos!$I:$I,$C18)","v":0},{"$f":"COUNTIFS(Jogos!$N:$N,\"D\",Jogos!$D:$D,$A18,Jogos!$E:$E,$C18)+COUNTIFS(Jogos!$O:$O,\"D\",Jogos!$D:$D,$A18,Jogos!$I:$I,$C18)","v":1},{"$f":"SUMIFS(Jogos!$L:$L,Jogos!$D:$D,$A18,Jogos!$E:$E,$C18)+SUMIFS(Jogos!$Q:$Q,Jogos!$D:$D,$A18,Jogos!$I:$I,$C18)","v":1},{"$f":"SUMIFS(Jogos!$Q:$Q,Jogos!$D:$D,$A18,Jogos!$E:$E,$C18)+SUMIFS(Jogos!$L:$L,Jogos!$D:$D,$A18,Jogos!$I:$I,$C18)","v":3},{"$f":"H18-I18","v":-2},{"$f":"SUMIFS(Jogos!$M:$M,Jogos!$D:$D,$A18,Jogos!$E:$E,$C18)+SUMIFS(Jogos!$P:$P,Jogos!$D:$D,$A18,Jogos!$I:$I,$C18)","v":3},{"$f":"SUMIFS(Jogos!$P:$P,Jogos!$D:$D,$A18,Jogos!$E:$E,$C18)+SUMIFS(Jogos!$M:$M,Jogos!$D:$D,$A18,Jogos!$I:$I,$C18)","v":7},{"$f":"K18-L18","v":-4},{"$f":"SUM(E18:G18)","v":1}]
[]
["TAÇA DE PRATA",null,null,"PG","V","E","D","GP","GC","SG","GPI","GCI","SGI","J"]
["FINAL"]
["TP.06",{"v":1,"d":"1º"},"AABB/ACAFUMA [B]",{"$f":"E22*3+F22","v":3},{"$f":"COUNTIFS(Jogos!$N:$N,\"V\",Jogos!$D:$D,$A22,Jogos!$E:$E,$C22)+COUNTIFS(Jogos!$O:$O,\"V\",Jogos!$D:$D,$A22,Jogos!$I:$I,$C22)","v":1},{"$f":"COUNTIFS(Jogos!$N:$N,\"E\",Jogos!$D:$D,$A22,Jogos!$E:$E,$C22)+COUNTIFS(Jogos!$O:$O,\"E\",Jogos!$D:$D,$A22,Jogos!$I:$I,$C22)","v":0},{"$f":"COUNTIFS(Jogos!$N:$N,\"D\",Jogos!$D:$D,$A22,Jogos!$E:$E,$C22)+COUNTIFS(Jogos!$O:$O,\"D\",Jogos!$D:$D,$A22,Jogos!$I:$I,$C22)","v":0},{"$f":"SUMIFS(Jogos!$L:$L,Jogos!$D:$D,$A22,Jogos!$E:$E,$C22)+SUMIFS(Jogos!$Q:$Q,Jogos!$D:$D,$A22,Jogos!$I:$I,$C22)","v":3},{"$f":"SUMIFS(Jogos!$Q:$Q,Jogos!$D:$D,$A22,Jogos!$E:$E,$C22)+SUMIFS(Jogos!$L:$L,Jogos!$D:$D,$A22,Jogos!$I:$I,$C22)","v":0},{"$f":"H22-I22","v":3},{"$f":"SUMIFS(Jogos!$M:$M,Jogos!$D:$D,$A22,Jogos!$E:$E,$C22)+SUMIFS(Jogos!$P:$P,Jogos!$D:$D,$A22,Jogos!$I:$I,$C22)","v":7},{"$f":"SUMIFS(Jogos!$P:$P,Jogos!$D:$D,$A22,Jogos!$E:$E,$C22)+SUMIFS(Jogos!$M:$M,Jogos!$D:$D,$A22,Jogos!$I:$I,$C22)","v":3},{"$f":"K22-L22","v":4},{"$f":"SUM(E22:G22)","v":1}]
["TP.06",{"v":2,"d":"2º"},"COMARY",{"$f":"E23*3+F23","v":0},{"$f":"COUNTIFS(Jogos!$N:$N,\"V\",Jogos!$D:$D,$A23,Jogos!$E:$E,$C23)+COUNTIFS(Jogos!$O:$O,\"V\",Jogos!$D:$D,$A23,Jogos!$I:$I,$C23)","v":0},{"$f":"COUNTIFS(Jogos!$N:$N,\"E\",Jogos!$D:$D,$A23,Jogos!$E:$E,$C23)+COUNTIFS(Jogos!$O:$O,\"E\",Jogos!$D:$D,$A23,Jogos!$I:$I,$C23)","v":0},{"$f":"COUNTIFS(Jogos!$N:$N,\"D\",Jogos!$D:$D,$A23,Jogos!$E:$E,$C23)+COUNTIFS(Jogos!$O:$O,\"D\",Jogos!$D:$D,$A23,Jogos!$I:$I,$C23)","v":1},{"$f":"SUMIFS(Jogos!$L:$L,Jogos!$D:$D,$A23,Jogos!$E:$E,$C23)+SUMIFS(Jogos!$Q:$Q,Jogos!$D:$D,$A23,Jogos!$I:$I,$C23)","v":0},{"$f":"SUMIFS(Jogos!$Q:$Q,Jogos!$D:$D,$A23,Jogos!$E:$E,$C23)+SUMIFS(Jogos!$L:$L,Jogos!$D:$D,$A23,Jogos!$I:$I,$C23)","v":3},{"$f":"H23-I23","v":-3},{"$f":"SUMIFS(Jogos!$M:$M,Jogos!$D:$D,$A23,Jogos!$E:$E,$C23)+SUMIFS(Jogos!$P:$P,Jogos!$D:$D,$A23,Jogos!$I:$I,$C23)","v":3},{"$f":"SUMIFS(Jogos!$P:$P,Jogos!$D:$D,$A23,Jogos!$E:$E,$C23)+SUMIFS(Jogos!$M:$M,Jogos!$D:$D,$A23,Jogos!$I:$I,$C23)","v":7},{"$f":"K23-L23","v":-4},{"$f":"SUM(E23:G23)","v":1}]

{"sheet":"ClaIND","index":8,"n_rows":90,"n_cols":23,"rows_kept":90,"merged":[[0,13,2,14]]}
[{"$f":"Info!A1","v":"XL CAMPEONATO BRASILEIRO INTERCLUBES / 2022"},{"$nulls":12},"linhas de conferencia  ",null,"PG","V","E","D","GP","GC","SG","J"]
[{"$f":"Info!A2","v":"Matias Barbosa / MG, 15 a 17 de abril de 2022"},{"$nulls":15},{"$f":"SUM(D6:D90)","v":232},168,232,692,692,0,632]
[{"$nulls":21},"total de jogos individuais",{"$f":"W2/2","v":316}]
["BOTONISTA","CLUBE","PG","V","E","D","GP","GC","SG","J","REND","POS"]
[]
["Adolpho Parente","AABB/ACAFUMA [B]",{"$f":"IF(J6=0,-0.001,D6*3+E6)","v":23},{"$f":"COUNTIFS(Jogos!$E:$E,$A6,Jogos!$N:$N,\"V\")+COUNTIFS(Jogos!$I:$I,$A6,Jogos!$O:$O,\"V\")","v":7},{"$f":"COUNTIFS(Jogos!$E:$E,$A6,Jogos!$N:$N,\"E\")+COUNTIFS(Jogos!$I:$I,$A6,Jogos!$O:$O,\"E\")","v":2},{"$f":"COUNTIFS(Jogos!$E:$E,$A6,Jogos!$N:$N,\"D\")+COUNTIFS(Jogos!$I:$I,$A6,Jogos!$O:$O,\"D\")","v":1},{"$f":"SUMIFS(Jogos!$F:$F,Jogos!$E:$E,$A6)+SUMIFS(Jogos!$H:$H,Jogos!$I:$I,$A6)","v":17},{"$f":"SUMIFS(Jogos!$H:$H,Jogos!$E:$E,$A6)+SUMIFS(Jogos!$F:$F,Jogos!$I:$I,$A6)+COUNTIFS(Jogos!$S:$S,\"WWIND\",Jogos!$E:$E,$A6)*2+COUNTIFS(Jogos!$S:$S,\"WWIND\",Jogos!$I:$I,$A6)*2","v":5},{"$f":"G6-H6","v":12},{"$f":"SUM(D6:F6)","v":10},{"$f":"IF(J6=0,-0.00001,C6/(J6*3))","v":{"v":0.7666666666666667,"d":"76.7%"}},{"$f":"INDEX(ClaFIN!B:C,MATCH(B6,ClaFIN!C:C,0),1)","v":{"v":11,"d":"11º"}}]
["Ailson Brites","MATIAS [B]",2,{"$f":"COUNTIFS(Jogos!$E:$E,$A7,Jogos!$N:$N,\"V\")+COUNTIFS(Jogos!$I:$I,$A7,Jogos!$O:$O,\"V\")","v":0},{"$f":"COUNTIFS(Jogos!$E:$E,$A7,Jogos!$N:$N,\"E\")+COUNTIFS(Jogos!$I:$I,$A7,Jogos!$O:$O,\"E\")","v":2},{"$f":"COUNTIFS(Jogos!$E:$E,$A7,Jogos!$N:$N,\"D\")+COUNTIFS(Jogos!$I:$I,$A7,Jogos!$O:$O,\"D\")","v":7},{"$f":"SUMIFS(Jogos!$F:$F,Jogos!$E:$E,$A7)+SUMIFS(Jogos!$H:$H,Jogos!$I:$I,$A7)","v":6},{"$f":"SUMIFS(Jogos!$H:$H,Jogos!$E:$E,$A7)+SUMIFS(Jogos!$F:$F,Jogos!$I:$I,$A7)+COUNTIFS(Jogos!$S:$S,\"WWIND\",Jogos!$E:$E,$A7)*2+COUNTIFS(Jogos!$S:$S,\"WWIND\",Jogos!$I:$I,$A7)*2","v":17},-11,9,{"v":0.07407407407407407,"d":"7.4%"},{"$f":"INDEX(ClaFIN!B:C,MATCH(B7,ClaFIN!C:C,0),1)","v":{"v":16,"d":"16º"}}]
["Alcides Figueira","AABB/ACAFUMA [B]",18,{"$f":"COUNTIFS(Jogos!$E:$E,$A8,Jogos!$N:$N,\"V\")+COUNTIFS(Jogos!$I:$I,$A8,Jogos!$O:$O,\"V\")","v":5},{"$f":"COUNTIFS(Jogos!$E:$E,$A8,Jogos!$N:$N,\"E\")+COUNTIFS(Jogos!$I:$I,$A8,Jogos!$O:$O,\"E\")","v":3},{"$f":"COUNTIFS(Jogos!$E:$E,$A8,Jogos!$N:$N,\"D\")+COUNTIFS(Jogos!$I:$I,$A8,Jogos!$O:$O,\"D\")","v":2},{"$f":"SUMIFS(Jogos!$F:$F,Jogos!$E:$E,$A8)+SUMIFS(Jogos!$H:$H,Jogos!$I:$I,$A8)","v":24},{"$f":"SUMIFS(Jogos!$H:$H,Jogos!$E:$E,$A8)+SUMIFS(Jogos!$F:$F,Jogos!$I:$I,$A8)+COUNTIFS(Jogos!$S:$S,\"WWIND\",Jogos!$E:$E,$A8)*2+COUNTIFS(Jogos!$S:$S,\"WWIND\",Jogos!$I:$I,$A8)*2","v":13},11,10,{"v":0.6,"d":"60.0%"},{"$f":"INDEX(ClaFIN!B:C,MATCH(B8,ClaFIN!C:C,0),1)","v":{"v":11,"d":"11º"}}]
["Alex Lage","ELDORADO",7,{"$f":"COUNTIFS(Jogos!$E:$E,$A9,Jogos!$N:$N,\"V\")+COUNTIFS(Jogos!$I:$I,$A9,Jogos!$O:$O,\"V\")","v":1},{"$f":"COUNTIFS(Jogos!$E:$E,$A9,Jogos!$N:$N,\"E\")+COUNTIFS(Jogos!$I:$I,$A9,Jogos!$O:$O,\"E\")","v":4},{"$f":"COUNTIFS(Jogos!$E:$E,$A9,Jogos!$N:$N,\"D\")+COUNTIFS(Jogos!$I:$I,$A9,Jogos!$O:$O,\"D\")","v":4},{"$f":"SUMIFS(Jogos!$F:$F,Jogos!$E:$E,$A9)+SUMIFS(Jogos!$H:$H,Jogos!$I:$I,$A9)","v":9},{"$f":"SUMIFS(Jogos!$H:$H,Jogos!$E:$E,$A9)+SUMIFS(Jogos!$F:$F,Jogos!$I:$I,$A9)+COUNTIFS(Jogos!$S:$S,\"WWIND\",Jogos!$E:$E,$A9)*2+COUNTIFS(Jogos!$S:$S,\"WWIND\",Jogos!$I:$I,$A9)*2","v":15},-6,9,{"v":0.25925925925925924,"d":"25.9%"},{"$f":"INDEX(ClaFIN!B:C,MATCH(B9,ClaFIN!C:C,0),1)","v":{"v":14,"d":"14º"}}]
["Altanir Junior","BOTAFOGO",16,{"$f":"COUNTIFS(Jogos!$E:$E,$A10,Jogos!$N:$N,\"V\")+COUNTIFS(Jogos!$I:$I,$A10,Jogos!$O:$O,\"V\")","v":5},{"$f":"COUNTIFS(Jogos!$E:$E,$A10,Jogos!$N:$N,\"E\")+COUNTIFS(Jogos!$I:$I,$A10,Jogos!$O:$O,\"E\")","v":1},{"$f":"COUNTIFS(Jogos!$E:$E,$A10,Jogos!$N:$N,\"D\")+COUNTIFS(Jogos!$I:$I,$A10,Jogos!$O:$O,\"D\")","v":3},{"$f":"SUMIFS(Jogos!$F:$F,Jogos!$E:$E,$A10)+SUMIFS(Jogos!$H:$H,Jogos!$I:$I,$A10)","v":15},{"$f":"SUMIFS(Jogos!$H:$H,Jogos!$E:$E,$A10)+SUMIFS(Jogos!$F:$F,Jogos!$I:$I,$A10)+COUNTIFS(Jogos!$S:$S,\"WWIND\",Jogos!$E:$E,$A10)*2+COUNTIFS(Jogos!$S:$S,\"WWIND\",Jogos!$I:$I,$A10)*2","v":9},6,9,{"v":0.5925925925925926,"d":"59.3%"},{"$f":"INDEX(ClaFIN!B:C,MATCH(B10,ClaFIN!C:C,0),1)","v":{"v":5,"d":"5º"}}]
["Andre Brandao","AABB/ACAFUMA [C]",15,{"$f":"COUNTIFS(Jogos!$E:$E,$A11,Jogos!$N:$N,\"V\")+COUNTIFS(Jogos!$I:$I,$A11,Jogos!$O:$O,\"V\")","v":4},{"$f":"COUNTIFS(Jogos!$E:$E,$A11,Jogos!$N:$N,\"E\")+COUNTIFS(Jogos!$I:$I,$A11,Jogos!$O:$O,\"E\")","v":3},{"$f":"COUNTIFS(Jogos!$E:$E,$A11,Jogos!$N:$N,\"D\")+COUNTIFS(Jogos!$I:$I,$A11,Jogos!$O:$O,\"D\")","v":3},{"$f":"SUMIFS(Jogos!$F:$F,Jogos!$E:$E,$A11)+SUMIFS(Jogos!$H:$H,Jogos!$I:$I,$A11)","v":10},{"$f":"SUMIFS(Jogos!$H:$H,Jogos!$E:$E,$A11)+SUMIFS(Jogos!$F:$F,Jogos!$I:$I,$A11)+COUNTIFS(Jogos!$S:$S,\"WWIND\",Jogos!$E:$E,$A11)*2+COUNTIFS(Jogos!$S:$S,\"WWIND\",Jogos!$I:$I,$A11)*2","v":14},-4,10,{"v":0.5,"d":"50.0%"},{"$f":"INDEX(ClaFIN!B:C,MATCH(B11,ClaFIN!C:C,0),1)","v":{"v":8,"d":"8º"}}]
["Antonio Carlos Almeida","AABB/ACAFUMA [A]",10,{"$f":"COUNTIFS(Jogos!$E:$E,$A12,Jogos!$N:$N,\"V\")+COUNTIFS(Jogos!$I:$I,$A12,Jogos!$O:$O,\"V\")","v":2},{"$f":"COUNTIFS(Jogos!$E:$E,$A12,Jogos!$N:$N,\"E\")+COUNTIFS(Jogos!$I:$I,$A12,Jogos!$O:$O,\"E\")","v":4},{"$f":"COUNTIFS(Jogos!$E:$E,$A12,Jogos!$N:$N,\"D\")+COUNTIFS(Jogos!$I:$I,$A12,Jogos!$O:$O,\"D\")","v":3},{"$f":"SUMIFS(Jogos!$F:$F,Jogos!$E:$E,$A12)+SUMIFS(Jogos!$H:$H,Jogos!$I:$I,$A12)","v":9},{"$f":"SUMIFS(Jogos!$H:$H,Jogos!$E:$E,$A12)+SUMIFS(Jogos!$F:$F,Jogos!$I:$I,$A12)+COUNTIFS(Jogos!$S:$S,\"WWIND\",Jogos!$E:$E,$A12)*2+COUNTIFS(Jogos!$S:$S,\"WWIND\",Jogos!$I:$I,$A12)*2","v":8},1,9,{"v":0.37037037037037035,"d":"37.0%"},{"$f":"INDEX(ClaFIN!B:C,MATCH(B12,ClaFIN!C:C,0),1)","v":{"v":9,"d":"9º"}}]
["Bernardo Pires","ELDORADO",2,{"$f":"COUNTIFS(Jogos!$E:$E,$A13,Jogos!$N:$N,\"V\")+COUNTIFS(Jogos!$I:$I,$A13,Jogos!$O:$O,\"V\")","v":0},{"$f":"COUNTIFS(Jogos!$E:$E,$A13,Jogos!$N:$N,\"E\")+COUNTIFS(Jogos!$I:$I,$A13,Jogos!$O:$O,\"E\")","v":2},{"$f":"COUNTIFS(Jogos!$E:$E,$A13,Jogos!$N:$N,\"D\")+COUNTIFS(Jogos!$I:$I,$A13,Jogos!$O:$O,\"D\")","v":7},{"$f":"SUMIFS(Jogos!$F:$F,Jogos!$E:$E,$A13)+SUMIFS(Jogos!$H:$H,Jogos!$I:$I,$A13)","v":2},{"$f":"SUMIFS(Jogos!$H:$H,Jogos!$E:$E,$A13)+SUMIFS(Jogos!$F:$F,Jogos!$I:$I,$A13)+COUNTIFS(Jogos!$S:$S,\"WWIND\",Jogos!$E:$E,$A13)*2+COUNTIFS(Jogos!$S:$S,\"WWIND\",Jogos!$I:$I,$A13)*2","v":13},-11,9,{"v":0.07407407407407407,"d":"7.4%"},{"$f":"INDEX(ClaFIN!B:C,MATCH(B13,ClaFIN!C:C,0),1)","v":{"v":14,"d":"14º"}}]
["Breno Ribeiro","LIBERDADE [A]",20,{"$f":"COUNTIFS(Jogos!$E:$E,$A14,Jogos!$N:$N,\"V\")+COUNTIFS(Jogos!$I:$I,$A14,Jogos!$O:$O,\"V\")","v":6},{"$f":"COUNTIFS(Jogos!$E:$E,$A14,Jogos!$N:$N,\"E\")+COUNTIFS(Jogos!$I:$I,$A14,Jogos!$O:$O,\"E\")","v":2},{"$f":"COUNTIFS(Jogos!$E:$E,$A14,Jogos!$N:$N,\"D\")+COUNTIFS(Jogos!$I:$I,$A14,Jogos!$O:$O,\"D\")","v":2},{"$f":"SUMIFS(Jogos!$F:$F,Jogos!$E:$E,$A14)+SUMIFS(Jogos!$H:$H,Jogos!$I:$I,$A14)","v":13},{"$f":"SUMIFS(Jogos!$H:$H,Jogos!$E:$E,$A14)+SUMIFS(Jogos!$F:$F,Jogos!$I:$I,$A14)+COUNTIFS(Jogos!$S:$S,\"WWIND\",Jogos!$E:$E,$A14)*2+COUNTIFS(Jogos!$S:$S,\"WWIND\",Jogos!$I:$I,$A14)*2","v":7},6,10,{"v":0.6666666666666666,"d":"66.7%"},{"$f":"INDEX(ClaFIN!B:C,MATCH(B14,ClaFIN!C:C,0),1)","v":{"v":1,"d":"1º"}}]
["Brunno Gill","MATIAS [A]",18,{"$f":"COUNTIFS(Jogos!$E:$E,$A15,Jogos!$N:$N,\"V\")+COUNTIFS(Jogos!$I:$I,$A15,Jogos!$O:$O,\"V\")","v":6},{"$f":"COUNTIFS(Jogos!$E:$E,$A15,Jogos!$N:$N,\"E\")+COUNTIFS(Jogos!$I:$I,$A15,Jogos!$O:$O,\"E\")","v":0},{"$f":"COUNTIFS(Jogos!$E:$E,$A15,Jogos!$N:$N,\"D\")+COUNTIFS(Jogos!$I:$I,$A15,Jogos!$O:$O,\"D\")","v":3},{"$f":"SUMIFS(Jogos!$F:$F,Jogos!$E:$E,$A15)+SUMIFS(Jogos!$H:$H,Jogos!$I:$I,$A15)","v":12},{"$f":"SUMIFS(Jogos!$H:$H,Jogos!$E:$E,$A15)+SUMIFS(Jogos!$F:$F,Jogos!$I:$I,$A15)+COUNTIFS(Jogos!$S:$S,\"WWIND\",Jogos!$E:$E,$A15)*2+COUNTIFS(Jogos!$S:$S,\"WWIND\",Jogos!$I:$I,$A15)*2","v":6},6,9,{"v":0.6666666666666666,"d":"66.7%"},{"$f":"INDEX(ClaFIN!B:C,MATCH(B15,ClaFIN!C:C,0),1)","v":{"v":3,"d":"3º"}}]
["Bruno Machado","BOTAFOGO",0,{"$f":"COUNTIFS(Jogos!$E:$E,$A16,Jogos!$N:$N,\"V\")+COUNTIFS(Jogos!$I:$I,$A16,Jogos!$O:$O,\"V\")","v":0},{"$f":"COUNTIFS(Jogos!$E:$E,$A16,Jogos!$N:$N,\"E\")+COUNTIFS(Jogos!$I:$I,$A16,Jogos!$O:$O,\"E\")","v":0},{"$f":"COUNTIFS(Jogos!$E:$E,$A16,Jogos!$N:$N,\"D\")+COUNTIFS(Jogos!$I:$I,$A16,Jogos!$O:$O,\"D\")","v":1},{"$f":"SUMIFS(Jogos!$F:$F,Jogos!$E:$E,$A16)+SUMIFS(Jogos!$H:$H,Jogos!$I:$I,$A16)","v":0},{"$f":"SUMIFS(Jogos!$H:$H,Jogos!$E:$E,$A16)+SUMIFS(Jogos!$F:$F,Jogos!$I:$I,$A16)+COUNTIFS(Jogos!$S:$S,\"WWIND\",Jogos!$E:$E,$A16)*2+COUNTIFS(Jogos!$S:$S,\"WWIND\",Jogos!$I:$I,$A16)*2","v":1},-1,1,{"v":0,"d":"0.0%"},{"$f":"INDEX(ClaFIN!B:C,MATCH(B16,ClaFIN!C:C,0),1)","v":{"v":5,"d":"5º"}}]
["Carlos Antonio Miranda","TUPI [A]",20,{"$f":"COUNTIFS(Jogos!$E:$E,$A17,Jogos!$N:$N,\"V\")+COUNTIFS(Jogos!$I:$I,$A17,Jogos!$O:$O,\"V\")","v":6},{"$f":"COUNTIFS(Jogos!$E:$E,$A17,Jogos!$N:$N,\"E\")+COUNTIFS(Jogos!$I:$I,$A17,Jogos!$O:$O,\"E\")","v":2},{"$f":"COUNTIFS(Jogos!$E:$E,$A17,Jogos!$N:$N,\"D\")+COUNTIFS(Jogos!$I:$I,$A17,Jogos!$O:$O,\"D\")","v":1},{"$f":"SUMIFS(Jogos!$F:$F,Jogos!$E:$E,$A17)+SUMIFS(Jogos!$H:$H,Jogos!$I:$I,$A17)","v":14},{"$f":"SUMIFS(Jogos!$H:$H,Jogos!$E:$E,$A17)+SUMIFS(Jogos!$F:$F,Jogos!$I:$I,$A17)+COUNTIFS(Jogos!$S:$S,\"WWIND\",Jogos!$E:$E,$A17)*2+COUNTIFS(Jogos!$S:$S,\"WWIND\",Jogos!$I:$I,$A17)*2","v":7},7,9,{"v":0.7407407407407407,"d":"74.1%"},{"$f":"INDEX(ClaFIN!B:C,MATCH(B17,ClaFIN!C:C,0),1)","v":{"v":2,"d":"2º"}}]
["Carlos Henrique Garcia","LIBERDADE [A]",20,{"$f":"COUNTIFS(Jogos!$E:$E,$A18,Jogos!$N:$N,\"V\")+COUNTIFS(Jogos!$I:$I,$A18,Jogos!$O:$O,\"V\")","v":6},{"$f":"COUNTIFS(Jogos!$E:$E,$A18,Jogos!$N:$N,\"E\")+COUNTIFS(Jogos!$I:$I,$A18,Jogos!$O:$O,\"E\")","v":2},{"$f":"COUNTIFS(Jogos!$E:$E,$A18,Jogos!$N:$N,\"D\")+COUNTIFS(Jogos!$I:$I,$A18,Jogos!$O:$O,\"D\")","v":2},{"$f":"SUMIFS(Jogos!$F:$F,Jogos!$E:$E,$A18)+SUMIFS(Jogos!$H:$H,Jogos!$I:$I,$A18)","v":19},{"$f":"SUMIFS(Jogos!$H:$H,Jogos!$E:$E,$A18)+SUMIFS(Jogos!$F:$F,Jogos!$I:$I,$A18)+COUNTIFS(Jogos!$S:$S,\"WWIND\",Jogos!$E:$E,$A18)*2+COUNTIFS(Jogos!$S:$S,\"WWIND\",Jogos!$I:$I,$A18)*2","v":7},12,10,{"v":0.6666666666666666,"d":"66.7%"},{"$f":"INDEX(ClaFIN!B:C,MATCH(B18,ClaFIN!C:C,0),1)","v":{"v":1,"d":"1º"}}]
["Claudio Figueiredo","COMARY",4,{"$f":"COUNTIFS(Jogos!$E:$E,$A19,Jogos!$N:$N,\"V\")+COUNTIFS(Jogos!$I:$I,$A19,Jogos!$O:$O,\"V\")","v":1},{"$f":"COUNTIFS(Jogos!$E:$E,$A19,Jogos!$N:$N,\"E\")+COUNTIFS(Jogos!$I:$I,$A19,Jogos!$O:$O,\"E\")","v":1},{"$f":"COUNTIFS(Jogos!$E:$E,$A19,Jogos!$N:$N,\"D\")+COUNTIFS(Jogos!$I:$I,$A19,Jogos!$O:$O,\"D\")","v":2},{"$f":"SUMIFS(Jogos!$F:$F,Jogos!$E:$E,$A19)+SUMIFS(Jogos!$H:$H,Jogos!$I:$I,$A19)","v":3},{"$f":"SUMIFS(Jogos!$H:$H,Jogos!$E:$E,$A19)+SUMIFS(Jogos!$F:$F,Jogos!$I:$I,$A19)+COUNTIFS(Jogos!$S:$S,\"WWIND\",Jogos!$E:$E,$A19)*2+COUNTIFS(Jogos!$S:$S,\"WWIND\",Jogos!$I:$I,$A19)*2","v":8},-5,4,{"v":0.3333333333333333,"d":"33.3%"},{"$f":"INDEX(ClaFIN!B:C,MATCH(B19,ClaFIN!C:C,0),1)","v":{"v":12,"d":"12º"}}]
["Constancio Moura","UNIÃO INDEPENDENTE/UBERABA",14,{"$f":"COUNTIFS(Jogos!$E:$E,$A20,Jogos!$N:$N,\"V\")+COUNTIFS(Jogos!$I:$I,$A20,Jogos!$O:$O,\"V\")","v":4},{"$f":"COUNTIFS(Jogos!$E:$E,$A20,Jogos!$N:$N,\"E\")+COUNTIFS(Jogos!$I:$I,$A20,Jogos!$O:$O,\"E\")","v":2},{"$f":"COUNTIFS(Jogos!$E:$E,$A20,Jogos!$N:$N,\"D\")+COUNTIFS(Jogos!$I:$I,$A20,Jogos!$O:$O,\"D\")","v":3},{"$f":"SUMIFS(Jogos!$F:$F,Jogos!$E:$E,$A20)+SUMIFS(Jogos!$H:$H,Jogos!$I:$I,$A20)","v":12},{"$f":"SUMIFS(Jogos!$H:$H,Jogos!$E:$E,$A20)+SUMIFS(Jogos!$F:$F,Jogos!$I:$I,$A20)+COUNTIFS(Jogos!$S:$S,\"WWIND\",Jogos!$E:$E,$A20)*2+COUNTIFS(Jogos!$S:$S,\"WWIND\",Jogos!$I:$I,$A20)*2","v":10},2,9,{"v":0.5185185185185185,"d":"51.9%"},{"$f":"INDEX(ClaFIN!B:C,MATCH(B20,ClaFIN!C:C,0),1)","v":{"v":4,"d":"4º"}}]
["Daniel Oliveira","LIBERDADE [B]",4,{"$f":"COUNTIFS(Jogos!$E:$E,$A21,Jogos!$N:$N,\"V\")+COUNTIFS(Jogos!$I:$I,$A21,Jogos!$O:$O,\"V\")","v":1},{"$f":"COUNTIFS(Jogos!$E:$E,$A21,Jogos!$N:$N,\"E\")+COUNTIFS(Jogos!$I:$I,$A21,Jogos!$O:$O,\"E\")","v":1},{"$f":"COUNTIFS(Jogos!$E:$E,$A21,Jogos!$N:$N,\"D\")+COUNTIFS(Jogos!$I:$I,$A21,Jogos!$O:$O,\"D\")","v":3},{"$f":"SUMIFS(Jogos!$F:$F,Jogos!$E:$E,$A21)+SUMIFS(Jogos!$H:$H,Jogos!$I:$I,$A21)","v":4},{"$f":"SUMIFS(Jogos!$H:$H,Jogos!$E:$E,$A21)+SUMIFS(Jogos!$F:$F,Jogos!$I:$I,$A21)+COUNTIFS(Jogos!$S:$S,\"WWIND\",Jogos!$E:$E,$A21)*2+COUNTIFS(Jogos!$S:$S,\"WWIND\",Jogos!$I:$I,$A21)*2","v":7},-3,5,{"v":0.26666666666666666,"d":"26.7%"},{"$f":"INDEX(ClaFIN!B:C,MATCH(B21,ClaFIN!C:C,0),1)","v":{"v":6,"d":"6º"}}]
["Diego Americo","BOTAFOGO",17,{"$f":"COUNTIFS(Jogos!$E:$E,$A22,Jogos!$N:$N,\"V\")+COUNTIFS(Jogos!$I:$I,$A22,Jogos!$O:$O,\"V\")","v":4},{"$f":"COUNTIFS(Jogos!$E:$E,$A22,Jogos!$N:$N,\"E\")+COUNTIFS(Jogos!$I:$I,$A22,Jogos!$O:$O,\"E\")","v":5},{"$f":"COUNTIFS(Jogos!$E:$E,$A22,Jogos!$N:$N,\"D\")+COUNTIFS(Jogos!$I:$I,$A22,Jogos!$O:$O,\"D\")","v":0},{"$f":"SUMIFS(Jogos!$F:$F,Jogos!$E:$E,$A22)+SUMIFS(Jogos!$H:$H,Jogos!$I:$I,$A22)","v":10},{"$f":"SUMIFS(Jogos!$H:$H,Jogos!$E:$E,$A22)+SUMIFS(Jogos!$F:$F,Jogos!$I:$I,$A22)+COUNTIFS(Jogos!$S:$S,\"WWIND\",Jogos!$E:$E,$A22)*2+COUNTIFS(Jogos!$S:$S,\"WWIND\",Jogos!$I:$I,$A22)*2","v":3},7,9,{"v":0.6296296296296297,"d":"63.0%"},{"$f":"INDEX(ClaFIN!B:C,MATCH(B22,ClaFIN!C:C,0),1)","v":{"v":5,"d":"5º"}}]
["Eber Chapinotti","MATIAS [B]",8,{"$f":"COUNTIFS(Jogos!$E:$E,$A23,Jogos!$N:$N,\"V\")+COUNTIFS(Jogos!$I:$I,$A23,Jogos!$O:$O,\"V\")","v":2},{"$f":"COUNTIFS(Jogos!$E:$E,$A23,Jogos!$N:$N,\"E\")+COUNTIFS(Jogos!$I:$I,$A23,Jogos!$O:$O,\"E\")","v":2},{"$f":"COUNTIFS(Jogos!$E:$E,$A23,Jogos!$N:$N,\"D\")+COUNTIFS(Jogos!$I:$I,$A23,Jogos!$O:$O,\"D\")","v":3},{"$f":"SUMIFS(Jogos!$F:$F,Jogos!$E:$E,$A23)+SUMIFS(Jogos!$H:$H,Jogos!$I:$I,$A23)","v":5},{"$f":"SUMIFS(Jogos!$H:$H,Jogos!$E:$E,$A23)+SUMIFS(Jogos!$F:$F,Jogos!$I:$I,$A23)+COUNTIFS(Jogos!$S:$S,\"WWIND\",Jogos!$E:$E,$A23)*2+COUNTIFS(Jogos!$S:$S,\"WWIND\",Jogos!$I:$I,$A23)*2","v":8},-3,7,{"v":0.38095238095238093,"d":"38.1%"},{"$f":"INDEX(ClaFIN!B:C,MATCH(B23,ClaFIN!C:C,0),1)","v":{"v":16,"d":"16º"}}]
["Eder Patrocinio","VASCO DA GAMA",8,{"$f":"COUNTIFS(Jogos!$E:$E,$A24,Jogos!$N:$N,\"V\")+COUNTIFS(Jogos!$I:$I,$A24,Jogos!$O:$O,\"V\")","v":2},{"$f":"COUNTIFS(Jogos!$E:$E,$A24,Jogos!$N:$N,\"E\")+COUNTIFS(Jogos!$I:$I,$A24,Jogos!$O:$O,\"E\")","v":2},{"$f":"COUNTIFS(Jogos!$E:$E,$A24,Jogos!$N:$N,\"D\")+COUNTIFS(Jogos!$I:$I,$A24,Jogos!$O:$O,\"D\")","v":1},{"$f":"SUMIFS(Jogos!$F:$F,Jogos!$E:$E,$A24)+SUMIFS(Jogos!$H:$H,Jogos!$I:$I,$A24)","v":8},{"$f":"SUMIFS(Jogos!$H:$H,Jogos!$E:$E,$A24)+SUMIFS(Jogos!$F:$F,Jogos!$I:$I,$A24)+COUNTIFS(Jogos!$S:$S,\"WWIND\",Jogos!$E:$E,$A24)*2+COUNTIFS(Jogos!$S:$S,\"WWIND\",Jogos!$I:$I,$A24)*2","v":8},0,5,{"v":0.5333333333333333,"d":"53.3%"},{"$f":"INDEX(ClaFIN!B:C,MATCH(B24,ClaFIN!C:C,0),1)","v":{"v":7,"d":"7º"}}]
["Eduardo Costa","VASCO DA GAMA",7,{"$f":"COUNTIFS(Jogos!$E:$E,$A25,Jogos!$N:$N,\"V\")+COUNTIFS(Jogos!$I:$I,$A25,Jogos!$O:$O,\"V\")","v":2},{"$f":"COUNTIFS(Jogos!$E:$E,$A25,Jogos!$N:$N,\"E\")+COUNTIFS(Jogos!$I:$I,$A25,Jogos!$O:$O,\"E\")","v":1},{"$f":"COUNTIFS(Jogos!$E:$E,$A25,Jogos!$N:$N,\"D\")+COUNTIFS(Jogos!$I:$I,$A25,Jogos!$O:$O,\"D\")","v":1},{"$f":"SUMIFS(Jogos!$F:$F,Jogos!$E:$E,$A25)+SUMIFS(Jogos!$H:$H,Jogos!$I:$I,$A25)","v":5},{"$f":"SUMIFS(Jogos!$H:$H,Jogos!$E:$E,$A25)+SUMIFS(Jogos!$F:$F,Jogos!$I:$I,$A25)+COUNTIFS(Jogos!$S:$S,\"WWIND\",Jogos!$E:$E,$A25)*2+COUNTIFS(Jogos!$S:$S,\"WWIND\",Jogos!$I:$I,$A25)*2","v":1},4,4,{"v":0.5833333333333334,"d":"58.3%"},{"$f":"INDEX(ClaFIN!B:C,MATCH(B25,ClaFIN!C:C,0),1)","v":{"v":7,"d":"7º"}}]
["Eduardo Guerra","TUPI [A]",10,{"$f":"COUNTIFS(Jogos!$E:$E,$A26,Jogos!$N:$N,\"V\")+COUNTIFS(Jogos!$I:$I,$A26,Jogos!$O:$O,\"V\")","v":3},{"$f":"COUNTIFS(Jogos!$E:$E,$A26,Jogos!$N:$N,\"E\")+COUNTIFS(Jogos!$I:$I,$A26,Jogos!$O:$O,\"E\")","v":1},{"$f":"COUNTIFS(Jogos!$E:$E,$A26,Jogos!$N:$N,\"D\")+COUNTIFS(Jogos!$I:$I,$A26,Jogos!$O:$O,\"D\")","v":0},{"$f":"SUMIFS(Jogos!$F:$F,Jogos!$E:$E,$A26)+SUMIFS(Jogos!$H:$H,Jogos!$I:$I,$A26)","v":9},{"$f":"SUMIFS(Jogos!$H:$H,Jogos!$E:$E,$A26)+SUMIFS(Jogos!$F:$F,Jogos!$I:$I,$A26)+COUNTIFS(Jogos!$S:$S,\"WWIND\",Jogos!$E:$E,$A26)*2+COUNTIFS(Jogos!$S:$S,\"WWIND\",Jogos!$I:$I,$A26)*2","v":3},6,4,{"v":0.8333333333333334,"d":"83.3%"},{"$f":"INDEX(ClaFIN!B:C,MATCH(B26,ClaFIN!C:C,0),1)","v":{"v":2,"d":"2º"}}]
["Eduardo Tavares","COMARY",8,{"$f":"COUNTIFS(Jogos!$E:$E,$A27,Jogos!$N:$N,\"V\")+COUNTIFS(Jogos!$I:$I,$A27,Jogos!$O:$O,\"V\")","v":2},{"$f":"COUNTIFS(Jogos!$E:$E,$A27,Jogos!$N:$N,\"E\")+COUNTIFS(Jogos!$I:$I,$A27,Jogos!$O:$O,\"E\")","v":2},{"$f":"COUNTIFS(Jogos!$E:$E,$A27,Jogos!$N:$N,\"D\")+COUNTIFS(Jogos!$I:$I,$A27,Jogos!$O:$O,\"D\")","v":4},{"$f":"SUMIFS(Jogos!$F:$F,Jogos!$E:$E,$A27)+SUMIFS(Jogos!$H:$H,Jogos!$I:$I,$A27)","v":5},{"$f":"SUMIFS(Jogos!$H:$H,Jogos!$E:$E,$A27)+SUMIFS(Jogos!$F:$F,Jogos!$I:$I,$A27)+COUNTIFS(Jogos!$S:$S,\"WWIND\",Jogos!$E:$E,$A27)*2+COUNTIFS(Jogos!$S:$S,\"WWIND\",Jogos!$I:$I,$A27)*2","v":8},-3,8,{"v":0.3333333333333333,"d":"33.3%"},{"$f":"INDEX(ClaFIN!B:C,MATCH(B27,ClaFIN!C:C,0),1)","v":{"v":12,"d":"12º"}}]
["Emerson Claudino","UNIÃO INDEPENDENTE/UBERABA",15,{"$f":"COUNTIFS(Jogos!$E:$E,$A28,Jogos!$N:$N,\"V\")+COUNTIFS(Jogos!$I:$I,$A28,Jogos!$O:$O,\"V\")","v":4},{"$f":"COUNTIFS(Jogos!$E:$E,$A28,Jogos!$N:$N,\"E\")+COUNTIFS(Jogos!$I:$I,$A28,Jogos!$O:$O,\"E\")","v":3},{"$f":"COUNTIFS(Jogos!$E:$E,$A28,Jogos!$N:$N,\"D\")+COUNTIFS(Jogos!$I:$I,$A28,Jogos!$O:$O,\"D\")","v":2},{"$f":"SUMIFS(Jogos!$F:$F,Jogos!$E:$E,$A28)+SUMIFS(Jogos!$H:$H,Jogos!$I:$I,$A28)","v":9},{"$f":"SUMIFS(Jogos!$H:$H,Jogos!$E:$E,$A28)+SUMIFS(Jogos!$F:$F,Jogos!$I:$I,$A28)+COUNTIFS(Jogos!$S:$S,\"WWIND\",Jogos!$E:$E,$A28)*2+COUNTIFS(Jogos!$S:$S,\"WWIND\",Jogos!$I:$I,$A28)*2","v":4},5,9,{"v":0.5555555555555556,"d":"55.6%"},{"$f":"INDEX(ClaFIN!B:C,MATCH(B28,ClaFIN!C:C,0),1)","v":{"v":4,"d":"4º"}}]
["Evandro Gomes","VASCO DA GAMA",4,{"$f":"COUNTIFS(Jogos!$E:$E,$A29,Jogos!$N:$N,\"V\")+COUNTIFS(Jogos!$I:$I,$A29,Jogos!$O:$O,\"V\")","v":1},{"$f":"COUNTIFS(Jogos!$E:$E,$A29,Jogos!$N:$N,\"E\")+COUNTIFS(Jogos!$I:$I,$A29,Jogos!$O:$O,\"E\")","v":1},{"$f":"COUNTIFS(Jogos!$E:$E,$A29,Jogos!$N:$N,\"D\")+COUNTIFS(Jogos!$I:$I,$A29,Jogos!$O:$O,\"D\")","v":3},{"$f":"SUMIFS(Jogos!$F:$F,Jogos!$E:$E,$A29)+SUMIFS(Jogos!$H:$H,Jogos!$I:$I,$A29)","v":7},{"$f":"SUMIFS(Jogos!$H:$H,Jogos!$E:$E,$A29)+SUMIFS(Jogos!$F:$F,Jogos!$I:$I,$A29)+COUNTIFS(Jogos!$S:$S,\"WWIND\",Jogos!$E:$E,$A29)*2+COUNTIFS(Jogos!$S:$S,\"WWIND\",Jogos!$I:$I,$A29)*2","v":6},1,5,{"v":0.26666666666666666,"d":"26.7%"},{"$f":"INDEX(ClaFIN!B:C,MATCH(B29,ClaFIN!C:C,0),1)","v":{"v":7,"d":"7º"}}]
["Everton Costa","CHACAL [B]",2,{"$f":"COUNTIFS(Jogos!$E:$E,$A30,Jogos!$N:$N,\"V\")+COUNTIFS(Jogos!$I:$I,$A30,Jogos!$O:$O,\"V\")","v":0},{"$f":"COUNTIFS(Jogos!$E:$E,$A30,Jogos!$N:$N,\"E\")+COUNTIFS(Jogos!$I:$I,$A30,Jogos!$O:$O,\"E\")","v":2},{"$f":"COUNTIFS(Jogos!$E:$E,$A30,Jogos!$N:$N,\"D\")+COUNTIFS(Jogos!$I:$I,$A30,Jogos!$O:$O,\"D\")","v":4},{"$f":"SUMIFS(Jogos!$F:$F,Jogos!$E:$E,$A30)+SUMIFS(Jogos!$H:$H,Jogos!$I:$I,$A30)","v":1},{"$f":"SUMIFS(Jogos!$H:$H,Jogos!$E:$E,$A30)+SUMIFS(Jogos!$F:$F,Jogos!$I:$I,$A30)+COUNTIFS(Jogos!$S:$S,\"WWIND\",Jogos!$E:$E,$A30)*2+COUNTIFS(Jogos!$S:$S,\"WWIND\",Jogos!$I:$I,$A30)*2","v":10},-9,6,{"v":0.1111111111111111,"d":"11.1%"},{"$f":"INDEX(ClaFIN!B:C,MATCH(B30,ClaFIN!C:C,0),1)","v":{"v":17,"d":"17º"}}]
["Fernando Ferreira","VASCO DA GAMA",17,{"$f":"COUNTIFS(Jogos!$E:$E,$A31,Jogos!$N:$N,\"V\")+COUNTIFS(Jogos!$I:$I,$A31,Jogos!$O:$O,\"V\")","v":5},{"$f":"COUNTIFS(Jogos!$E:$E,$A31,Jogos!$N:$N,\"E\")+COUNTIFS(Jogos!$I:$I,$A31,Jogos!$O:$O,\"E\")","v":2},{"$f":"COUNTIFS(Jogos!$E:$E,$A31,Jogos!$N:$N,\"D\")+COUNTIFS(Jogos!$I:$I,$A31,Jogos!$O:$O,\"D\")","v":2},{"$f":"SUMIFS(Jogos!$F:$F,Jogos!$E:$E,$A31)+SUMIFS(Jogos!$H:$H,Jogos!$I:$I,$A31)","v":15},{"$f":"SUMIFS(Jogos!$H:$H,Jogos!$E:$E,$A31)+SUMIFS(Jogos!$F:$F,Jogos!$I:$I,$A31)+COUNTIFS(Jogos!$S:$S,\"WWIND\",Jogos!$E:$E,$A31)*2+COUNTIFS(Jogos!$S:$S,\"WWIND\",Jogos!$I:$I,$A31)*2","v":8},7,9,{"v":0.6296296296296297,"d":"63.0%"},{"$f":"INDEX(ClaFIN!B:C,MATCH(B31,ClaFIN!C:C,0),1)","v":{"v":7,"d":"7º"}}]
["Fernando Vianna","GRÊMIO MINEIRO",5,{"$f":"COUNTIFS(Jogos!$E:$E,$A32,Jogos!$N:$N,\"V\")+COUNTIFS(Jogos!$I:$I,$A32,Jogos!$O:$O,\"V\")","v":1},{"$f":"COUNTIFS(Jogos!$E:$E,$A32,Jogos!$N:$N,\"E\")+COUNTIFS(Jogos!$I:$I,$A32,Jogos!$O:$O,\"E\")","v":2},{"$f":"COUNTIFS(Jogos!$E:$E,$A32,Jogos!$N:$N,\"D\")+COUNTIFS(Jogos!$I:$I,$A32,Jogos!$O:$O,\"D\")","v":6},{"$f":"SUMIFS(Jogos!$F:$F,Jogos!$E:$E,$A32)+SUMIFS(Jogos!$H:$H,Jogos!$I:$I,$A32)","v":5},{"$f":"SUMIFS(Jogos!$H:$H,Jogos!$E:$E,$A32)+SUMIFS(Jogos!$F:$F,Jogos!$I:$I,$A32)+COUNTIFS(Jogos!$S:$S,\"WWIND\",Jogos!$E:$E,$A32)*2+COUNTIFS(Jogos!$S:$S,\"WWIND\",Jogos!$I:$I,$A32)*2","v":14},-9,9,{"v":0.18518518518518517,"d":"18.5%"},{"$f":"INDEX(ClaFIN!B:C,MATCH(B32,ClaFIN!C:C,0),1)","v":{"v":15,"d":"15º"}}]
["Flavio Scarpelli","TUPI [B]",11,{"$f":"COUNTIFS(Jogos!$E:$E,$A33,Jogos!$N:$N,\"V\")+COUNTIFS(Jogos!$I:$I,$A33,Jogos!$O:$O,\"V\")","v":3},{"$f":"COUNTIFS(Jogos!$E:$E,$A33,Jogos!$N:$N,\"E\")+COUNTIFS(Jogos!$I:$I,$A33,Jogos!$O:$O,\"E\")","v":2},{"$f":"COUNTIFS(Jogos!$E:$E,$A33,Jogos!$N:$N,\"D\")+COUNTIFS(Jogos!$I:$I,$A33,Jogos!$O:$O,\"D\")","v":3},{"$f":"SUMIFS(Jogos!$F:$F,Jogos!$E:$E,$A33)+SUMIFS(Jogos!$H:$H,Jogos!$I:$I,$A33)","v":11},{"$f":"SUMIFS(Jogos!$H:$H,Jogos!$E:$E,$A33)+SUMIFS(Jogos!$F:$F,Jogos!$I:$I,$A33)+COUNTIFS(Jogos!$S:$S,\"WWIND\",Jogos!$E:$E,$A33)*2+COUNTIFS(Jogos!$S:$S,\"WWIND\",Jogos!$I:$I,$A33)*2","v":9},2,8,{"v":0.4583333333333333,"d":"45.8%"},{"$f":"INDEX(ClaFIN!B:C,MATCH(B33,ClaFIN!C:C,0),1)","v":{"v":10,"d":"10º"}}]
["Gustavo Lopes","GRÊMIO MINEIRO",10,{"$f":"COUNTIFS(Jogos!$E:$E,$A34,Jogos!$N:$N,\"V\")+COUNTIFS(Jogos!$I:$I,$A34,Jogos!$O:$O,\"V\")","v":2},{"$f":"COUNTIFS(Jogos!$E:$E,$A34,Jogos!$N:$N,\"E\")+COUNTIFS(Jogos!$I:$I,$A34,Jogos!$O:$O,\"E\")","v":4},{"$f":"COUNTIFS(Jogos!$E:$E,$A34,Jogos!$N:$N,\"D\")+COUNTIFS(Jogos!$I:$I,$A34,Jogos!$O:$O,\"D\")","v":3},{"$f":"SUMIFS(Jogos!$F:$F,Jogos!$E:$E,$A34)+SUMIFS(Jogos!$H:$H,Jogos!$I:$I,$A34)","v":7},{"$f":"SUMIFS(Jogos!$H:$H,Jogos!$E:$E,$A34)+SUMIFS(Jogos!$F:$F,Jogos!$I:$I,$A34)+COUNTIFS(Jogos!$S:$S,\"WWIND\",Jogos!$E:$E,$A34)*2+COUNTIFS(Jogos!$S:$S,\"WWIND\",Jogos!$I:$I,$A34)*2","v":7},0,9,{"v":0.37037037037037035,"d":"37.0%"},{"$f":"INDEX(ClaFIN!B:C,MATCH(B34,ClaFIN!C:C,0),1)","v":{"v":15,"d":"15º"}}]
["Heman Junior","CHACAL [B]",1,{"$f":"COUNTIFS(Jogos!$E:$E,$A35,Jogos!$N:$N,\"V\")+COUNTIFS(Jogos!$I:$I,$A35,Jogos!$O:$O,\"V\")","v":0},{"$f":"COUNTIFS(Jogos!$E:$E,$A35,Jogos!$N:$N,\"E\")+COUNTIFS(Jogos!$I:$I,$A35,Jogos!$O:$O,\"E\")","v":1},{"$f":"COUNTIFS(Jogos!$E:$E,$A35,Jogos!$N:$N,\"D\")+COUNTIFS(Jogos!$I:$I,$A35,Jogos!$O:$O,\"D\")","v":3},{"$f":"SUMIFS(Jogos!$F:$F,Jogos!$E:$E,$A35)+SUMIFS(Jogos!$H:$H,Jogos!$I:$I,$A35)","v":1},{"$f":"SUMIFS(Jogos!$H:$H,Jogos!$E:$E,$A35)+SUMIFS(Jogos!$F:$F,Jogos!$I:$I,$A35)+COUNTIFS(Jogos!$S:$S,\"WWIND\",Jogos!$E:$E,$A35)*2+COUNTIFS(Jogos!$S:$S,\"WWIND\",Jogos!$I:$I,$A35)*2","v":7},-6,4,{"v":0.08333333333333333,"d":"8.3%"},{"$f":"INDEX(ClaFIN!B:C,MATCH(B35,ClaFIN!C:C,0),1)","v":{"v":17,"d":"17º"}}]
["Henrique Madeira","VASCO DA GAMA",6,{"$f":"COUNTIFS(Jogos!$E:$E,$A36,Jogos!$N:$N,\"V\")+COUNTIFS(Jogos!$I:$I,$A36,Jogos!$O:$O,\"V\")","v":2},{"$f":"COUNTIFS(Jogos!$E:$E,$A36,Jogos!$N:$N,\"E\")+COUNTIFS(Jogos!$I:$I,$A36,Jogos!$O:$O,\"E\")","v":0},{"$f":"COUNTIFS(Jogos!$E:$E,$A36,Jogos!$N:$N,\"D\")+COUNTIFS(Jogos!$I:$I,$A36,Jogos!$O:$O,\"D\")","v":3},{"$f":"SUMIFS(Jogos!$F:$F,Jogos!$E:$E,$A36)+SUMIFS(Jogos!$H:$H,Jogos!$I:$I,$A36)","v":6},{"$f":"SUMIFS(Jogos!$H:$H,Jogos!$E:$E,$A36)+SUMIFS(Jogos!$F:$F,Jogos!$I:$I,$A36)+COUNTIFS(Jogos!$S:$S,\"WWIND\",Jogos!$E:$E,$A36)*2+COUNTIFS(Jogos!$S:$S,\"WWIND\",Jogos!$I:$I,$A36)*2","v":5},1,5,{"v":0.4,"d":"40.0%"},{"$f":"INDEX(ClaFIN!B:C,MATCH(B36,ClaFIN!C:C,0),1)","v":{"v":7,"d":"7º"}}]
["Humberto Ramos","MATIAS [B]",0,{"$f":"COUNTIFS(Jogos!$E:$E,$A37,Jogos!$N:$N,\"V\")+COUNTIFS(Jogos!$I:$I,$A37,Jogos!$O:$O,\"V\")","v":0},{"$f":"COUNTIFS(Jogos!$E:$E,$A37,Jogos!$N:$N,\"E\")+COUNTIFS(Jogos!$I:$I,$A37,Jogos!$O:$O,\"E\")","v":0},{"$f":"COUNTIFS(Jogos!$E:$E,$A37,Jogos!$N:$N,\"D\")+COUNTIFS(Jogos!$I:$I,$A37,Jogos!$O:$O,\"D\")","v":3},{"$f":"SUMIFS(Jogos!$F:$F,Jogos!$E:$E,$A37)+SUMIFS(Jogos!$H:$H,Jogos!$I:$I,$A37)","v":0},{"$f":"SUMIFS(Jogos!$H:$H,Jogos!$E:$E,$A37)+SUMIFS(Jogos!$F:$F,Jogos!$I:$I,$A37)+COUNTIFS(Jogos!$S:$S,\"WWIND\",Jogos!$E:$E,$A37)*2+COUNTIFS(Jogos!$S:$S,\"WWIND\",Jogos!$I:$I,$A37)*2","v":11},-11,3,{"v":0,"d":"0.0%"},{"$f":"INDEX(ClaFIN!B:C,MATCH(B37,ClaFIN!C:C,0),1)","v":{"v":16,"d":"16º"}}]
["Igor Guarilha","COMARY",{"$f":"IF(J38=0,-0.001,D38*3+E38)","v":15},{"$f":"COUNTIFS(Jogos!$E:$E,$A38,Jogos!$N:$N,\"V\")+COUNTIFS(Jogos!$I:$I,$A38,Jogos!$O:$O,\"V\")","v":4},{"$f":"COUNTIFS(Jogos!$E:$E,$A38,Jogos!$N:$N,\"E\")+COUNTIFS(Jogos!$I:$I,$A38,Jogos!$O:$O,\"E\")","v":3},{"$f":"COUNTIFS(Jogos!$E:$E,$A38,Jogos!$N:$N,\"D\")+COUNTIFS(Jogos!$I:$I,$A38,Jogos!$O:$O,\"D\")","v":2},{"$f":"SUMIFS(Jogos!$F:$F,Jogos!$E:$E,$A38)+SUMIFS(Jogos!$H:$H,Jogos!$I:$I,$A38)","v":10},{"$f":"SUMIFS(Jogos!$H:$H,Jogos!$E:$E,$A38)+SUMIFS(Jogos!$F:$F,Jogos!$I:$I,$A38)+COUNTIFS(Jogos!$S:$S,\"WWIND\",Jogos!$E:$E,$A38)*2+COUNTIFS(Jogos!$S:$S,\"WWIND\",Jogos!$I:$I,$A38)*2","v":7},{"$f":"G38-H38","v":3},{"$f":"SUM(D38:F38)","v":9},{"$f":"IF(J38=0,-0.00001,C38/(J38*3))","v":{"v":0.5555555555555556,"d":"55.6%"}},{"$f":"INDEX(ClaFIN!B:C,MATCH(B38,ClaFIN!C:C,0),1)","v":{"v":12,"d":"12º"}}]
["Janilson Pereira","CHACAL [A]",13,{"$f":"COUNTIFS(Jogos!$E:$E,$A39,Jogos!$N:$N,\"V\")+COUNTIFS(Jogos!$I:$I,$A39,Jogos!$O:$O,\"V\")","v":4},{"$f":"COUNTIFS(Jogos!$E:$E,$A39,Jogos!$N:$N,\"E\")+COUNTIFS(Jogos!$I:$I,$A39,Jogos!$O:$O,\"E\")","v":1},{"$f":"COUNTIFS(Jogos!$E:$E,$A39,Jogos!$N:$N,\"D\")+COUNTIFS(Jogos!$I:$I,$A39,Jogos!$O:$O,\"D\")","v":4},{"$f":"SUMIFS(Jogos!$F:$F,Jogos!$E:$E,$A39)+SUMIFS(Jogos!$H:$H,Jogos!$I:$I,$A39)","v":12},{"$f":"SUMIFS(Jogos!$H:$H,Jogos!$E:$E,$A39)+SUMIFS(Jogos!$F:$F,Jogos!$I:$I,$A39)+COUNTIFS(Jogos!$S:$S,\"WWIND\",Jogos!$E:$E,$A39)*2+COUNTIFS(Jogos!$S:$S,\"WWIND\",Jogos!$I:$I,$A39)*2","v":10},2,9,{"v":0.48148148148148145,"d":"48.1%"},{"$f":"INDEX(ClaFIN!B:C,MATCH(B39,ClaFIN!C:C,0),1)","v":{"v":13,"d":"13º"}}]
["Jefferson Rosa","CHACAL [B]",3,{"$f":"COUNTIFS(Jogos!$E:$E,$A40,Jogos!$N:$N,\"V\")+COUNTIFS(Jogos!$I:$I,$A40,Jogos!$O:$O,\"V\")","v":1},{"$f":"COUNTIFS(Jogos!$E:$E,$A40,Jogos!$N:$N,\"E\")+COUNTIFS(Jogos!$I:$I,$A40,Jogos!$O:$O,\"E\")","v":0},{"$f":"COUNTIFS(Jogos!$E:$E,$A40,Jogos!$N:$N,\"D\")+COUNTIFS(Jogos!$I:$I,$A40,Jogos!$O:$O,\"D\")","v":4},{"$f":"SUMIFS(Jogos!$F:$F,Jogos!$E:$E,$A40)+SUMIFS(Jogos!$H:$H,Jogos!$I:$I,$A40)","v":2},{"$f":"SUMIFS(Jogos!$H:$H,Jogos!$E:$E,$A40)+SUMIFS(Jogos!$F:$F,Jogos!$I:$I,$A40)+COUNTIFS(Jogos!$S:$S,\"WWIND\",Jogos!$E:$E,$A40)*2+COUNTIFS(Jogos!$S:$S,\"WWIND\",Jogos!$I:$I,$A40)*2","v":13},-11,5,{"v":0.2,"d":"20.0%"},{"$f":"INDEX(ClaFIN!B:C,MATCH(B40,ClaFIN!C:C,0),1)","v":{"v":17,"d":"17º"}}]
["Joao Eduardo Pereira","LIBERDADE [B]",9,{"$f":"COUNTIFS(Jogos!$E:$E,$A41,Jogos!$N:$N,\"V\")+COUNTIFS(Jogos!$I:$I,$A41,Jogos!$O:$O,\"V\")","v":2},{"$f":"COUNTIFS(Jogos!$E:$E,$A41,Jogos!$N:$N,\"E\")+COUNTIFS(Jogos!$I:$I,$A41,Jogos!$O:$O,\"E\")","v":3},{"$f":"COUNTIFS(Jogos!$E:$E,$A41,Jogos!$N:$N,\"D\")+COUNTIFS(Jogos!$I:$I,$A41,Jogos!$O:$O,\"D\")","v":1},{"$f":"SUMIFS(Jogos!$F:$F,Jogos!$E:$E,$A41)+SUMIFS(Jogos!$H:$H,Jogos!$I:$I,$A41)","v":6},{"$f":"SUMIFS(Jogos!$H:$H,Jogos!$E:$E,$A41)+SUMIFS(Jogos!$F:$F,Jogos!$I:$I,$A41)+COUNTIFS(Jogos!$S:$S,\"WWIND\",Jogos!$E:$E,$A41)*2+COUNTIFS(Jogos!$S:$S,\"WWIND\",Jogos!$I:$I,$A41)*2","v":6},0,6,{"v":0.5,"d":"50.0%"},{"$f":"INDEX(ClaFIN!B:C,MATCH(B41,ClaFIN!C:C,0),1)","v":{"v":6,"d":"6º"}}]
["Joao Francisco Stephan","CHACAL [A]",4,{"$f":"COUNTIFS(Jogos!$E:$E,$A42,Jogos!$N:$N,\"V\")+COUNTIFS(Jogos!$I:$I,$A42,Jogos!$O:$O,\"V\")","v":1},{"$f":"COUNTIFS(Jogos!$E:$E,$A42,Jogos!$N:$N,\"E\")+COUNTIFS(Jogos!$I:$I,$A42,Jogos!$O:$O,\"E\")","v":1},{"$f":"COUNTIFS(Jogos!$E:$E,$A42,Jogos!$N:$N,\"D\")+COUNTIFS(Jogos!$I:$I,$A42,Jogos!$O:$O,\"D\")","v":1},{"$f":"SUMIFS(Jogos!$F:$F,Jogos!$E:$E,$A42)+SUMIFS(Jogos!$H:$H,Jogos!$I:$I,$A42)","v":4},{"$f":"SUMIFS(Jogos!$H:$H,Jogos!$E:$E,$A42)+SUMIFS(Jogos!$F:$F,Jogos!$I:$I,$A42)+COUNTIFS(Jogos!$S:$S,\"WWIND\",Jogos!$E:$E,$A42)*2+COUNTIFS(Jogos!$S:$S,\"WWIND\",Jogos!$I:$I,$A42)*2","v":3},1,3,{"v":0.4444444444444444,"d":"44.4%"},{"$f":"INDEX(ClaFIN!B:C,MATCH(B42,ClaFIN!C:C,0),1)","v":{"v":13,"d":"13º"}}]
["Jorge Dias","ELDORADO",8,{"$f":"COUNTIFS(Jogos!$E:$E,$A43,Jogos!$N:$N,\"V\")+COUNTIFS(Jogos!$I:$I,$A43,Jogos!$O:$O,\"V\")","v":2},{"$f":"COUNTIFS(Jogos!$E:$E,$A43,Jogos!$N:$N,\"E\")+COUNTIFS(Jogos!$I:$I,$A43,Jogos!$O:$O,\"E\")","v":2},{"$f":"COUNTIFS(Jogos!$E:$E,$A43,Jogos!$N:$N,\"D\")+COUNTIFS(Jogos!$I:$I,$A43,Jogos!$O:$O,\"D\")","v":5},{"$f":"SUMIFS(Jogos!$F:$F,Jogos!$E:$E,$A43)+SUMIFS(Jogos!$H:$H,Jogos!$I:$I,$A43)","v":7},{"$f":"SUMIFS(Jogos!$H:$H,Jogos!$E:$E,$A43)+SUMIFS(Jogos!$F:$F,Jogos!$I:$I,$A43)+COUNTIFS(Jogos!$S:$S,\"WWIND\",Jogos!$E:$E,$A43)*2+COUNTIFS(Jogos!$S:$S,\"WWIND\",Jogos!$I:$I,$A43)*2","v":9},-2,9,{"v":0.2962962962962963,"d":"29.6%"},{"$f":"INDEX(ClaFIN!B:C,MATCH(B43,ClaFIN!C:C,0),1)","v":{"v":14,"d":"14º"}}]
["Jose Lessa","MATIAS [A]",19,{"$f":"COUNTIFS(Jogos!$E:$E,$A44,Jogos!$N:$N,\"V\")+COUNTIFS(Jogos!$I:$I,$A44,Jogos!$O:$O,\"V\")","v":6},{"$f":"COUNTIFS(Jogos!$E:$E,$A44,Jogos!$N:$N,\"E\")+COUNTIFS(Jogos!$I:$I,$A44,Jogos!$O:$O,\"E\")","v":1},{"$f":"COUNTIFS(Jogos!$E:$E,$A44,Jogos!$N:$N,\"D\")+COUNTIFS(Jogos!$I:$I,$A44,Jogos!$O:$O,\"D\")","v":2},{"$f":"SUMIFS(Jogos!$F:$F,Jogos!$E:$E,$A44)+SUMIFS(Jogos!$H:$H,Jogos!$I:$I,$A44)","v":12},{"$f":"SUMIFS(Jogos!$H:$H,Jogos!$E:$E,$A44)+SUMIFS(Jogos!$F:$F,Jogos!$I:$I,$A44)+COUNTIFS(Jogos!$S:$S,\"WWIND\",Jogos!$E:$E,$A44)*2+COUNTIFS(Jogos!$S:$S,\"WWIND\",Jogos!$I:$I,$A44)*2","v":7},5,9,{"v":0.7037037037037037,"d":"70.4%"},{"$f":"INDEX(ClaFIN!B:C,MATCH(B44,ClaFIN!C:C,0),1)","v":{"v":3,"d":"3º"}}]
["Jose Pires","ELDORADO",13,{"$f":"COUNTIFS(Jogos!$E:$E,$A45,Jogos!$N:$N,\"V\")+COUNTIFS(Jogos!$I:$I,$A45,Jogos!$O:$O,\"V\")","v":3},{"$f":"COUNTIFS(Jogos!$E:$E,$A45,Jogos!$N:$N,\"E\")+COUNTIFS(Jogos!$I:$I,$A45,Jogos!$O:$O,\"E\")","v":4},{"$f":"COUNTIFS(Jogos!$E:$E,$A45,Jogos!$N:$N,\"D\")+COUNTIFS(Jogos!$I:$I,$A45,Jogos!$O:$O,\"D\")","v":2},{"$f":"SUMIFS(Jogos!$F:$F,Jogos!$E:$E,$A45)+SUMIFS(Jogos!$H:$H,Jogos!$I:$I,$A45)","v":6},{"$f":"SUMIFS(Jogos!$H:$H,Jogos!$E:$E,$A45)+SUMIFS(Jogos!$F:$F,Jogos!$I:$I,$A45)+COUNTIFS(Jogos!$S:$S,\"WWIND\",Jogos!$E:$E,$A45)*2+COUNTIFS(Jogos!$S:$S,\"WWIND\",Jogos!$I:$I,$A45)*2","v":5},1,9,{"v":0.48148148148148145,"d":"48.1%"},{"$f":"INDEX(ClaFIN!B:C,MATCH(B45,ClaFIN!C:C,0),1)","v":{"v":14,"d":"14º"}}]
["Juliano Gomes","UNIÃO INDEPENDENTE/UBERABA",14,{"$f":"COUNTIFS(Jogos!$E:$E,$A46,Jogos!$N:$N,\"V\")+COUNTIFS(Jogos!$I:$I,$A46,Jogos!$O:$O,\"V\")","v":4},{"$f":"COUNTIFS(Jogos!$E:$E,$A46,Jogos!$N:$N,\"E\")+COUNTIFS(Jogos!$I:$I,$A46,Jogos!$O:$O,\"E\")","v":2},{"$f":"COUNTIFS(Jogos!$E:$E,$A46,Jogos!$N:$N,\"D\")+COUNTIFS(Jogos!$I:$I,$A46,Jogos!$O:$O,\"D\")","v":3},{"$f":"SUMIFS(Jogos!$F:$F,Jogos!$E:$E,$A46)+SUMIFS(Jogos!$H:$H,Jogos!$I:$I,$A46)","v":12},{"$f":"SUMIFS(Jogos!$H:$H,Jogos!$E:$E,$A46)+SUMIFS(Jogos!$F:$F,Jogos!$I:$I,$A46)+COUNTIFS(Jogos!$S:$S,\"WWIND\",Jogos!$E:$E,$A46)*2+COUNTIFS(Jogos!$S:$S,\"WWIND\",Jogos!$I:$I,$A46)*2","v":11},1,9,{"v":0.5185185185185185,"d":"51.9%"},{"$f":"INDEX(ClaFIN!B:C,MATCH(B46,ClaFIN!C:C,0),1)","v":{"v":4,"d":"4º"}}]
["Julio Celio Braga","CHACAL [A]",7,{"$f":"COUNTIFS(Jogos!$E:$E,$A47,Jogos!$N:$N,\"V\")+COUNTIFS(Jogos!$I:$I,$A47,Jogos!$O:$O,\"V\")","v":1},{"$f":"COUNTIFS(Jogos!$E:$E,$A47,Jogos!$N:$N,\"E\")+COUNTIFS(Jogos!$I:$I,$A47,Jogos!$O:$O,\"E\")","v":4},{"$f":"COUNTIFS(Jogos!$E:$E,$A47,Jogos!$N:$N,\"D\")+COUNTIFS(Jogos!$I:$I,$A47,Jogos!$O:$O,\"D\")","v":4},{"$f":"SUMIFS(Jogos!$F:$F,Jogos!$E:$E,$A47)+SUMIFS(Jogos!$H:$H,Jogos!$I:$I,$A47)","v":12},{"$f":"SUMIFS(Jogos!$H:$H,Jogos!$E:$E,$A47)+SUMIFS(Jogos!$F:$F,Jogos!$I:$I,$A47)+COUNTIFS(Jogos!$S:$S,\"WWIND\",Jogos!$E:$E,$A47)*2+COUNTIFS(Jogos!$S:$S,\"WWIND\",Jogos!$I:$I,$A47)*2","v":14},-2,9,{"v":0.25925925925925924,"d":"25.9%"},{"$f":"INDEX(ClaFIN!B:C,MATCH(B47,ClaFIN!C:C,0),1)","v":{"v":13,"d":"13º"}}]
["Leandro Benicio","TUPI [B]",11,{"$f":"COUNTIFS(Jogos!$E:$E,$A48,Jogos!$N:$N,\"V\")+COUNTIFS(Jogos!$I:$I,$A48,Jogos!$O:$O,\"V\")","v":3},{"$f":"COUNTIFS(Jogos!$E:$E,$A48,Jogos!$N:$N,\"E\")+COUNTIFS(Jogos!$I:$I,$A48,Jogos!$O:$O,\"E\")","v":2},{"$f":"COUNTIFS(Jogos!$E:$E,$A48,Jogos!$N:$N,\"D\")+COUNTIFS(Jogos!$I:$I,$A48,Jogos!$O:$O,\"D\")","v":3},{"$f":"SUMIFS(Jogos!$F:$F,Jogos!$E:$E,$A48)+SUMIFS(Jogos!$H:$H,Jogos!$I:$I,$A48)","v":10},{"$f":"SUMIFS(Jogos!$H:$H,Jogos!$E:$E,$A48)+SUMIFS(Jogos!$F:$F,Jogos!$I:$I,$A48)+COUNTIFS(Jogos!$S:$S,\"WWIND\",Jogos!$E:$E,$A48)*2+COUNTIFS(Jogos!$S:$S,\"WWIND\",Jogos!$I:$I,$A48)*2","v":10},0,8,{"v":0.4583333333333333,"d":"45.8%"},{"$f":"INDEX(ClaFIN!B:C,MATCH(B48,ClaFIN!C:C,0),1)","v":{"v":10,"d":"10º"}}]
["Leonardo de Oliveira","MATIAS [A]",12,{"$f":"COUNTIFS(Jogos!$E:$E,$A49,Jogos!$N:$N,\"V\")+COUNTIFS(Jogos!$I:$I,$A49,Jogos!$O:$O,\"V\")","v":4},{"$f":"COUNTIFS(Jogos!$E:$E,$A49,Jogos!$N:$N,\"E\")+COUNTIFS(Jogos!$I:$I,$A49,Jogos!$O:$O,\"E\")","v":0},{"$f":"COUNTIFS(Jogos!$E:$E,$A49,Jogos!$N:$N,\"D\")+COUNTIFS(Jogos!$I:$I,$A49,Jogos!$O:$O,\"D\")","v":5},{"$f":"SUMIFS(Jogos!$F:$F,Jogos!$E:$E,$A49)+SUMIFS(Jogos!$H:$H,Jogos!$I:$I,$A49)","v":10},{"$f":"SUMIFS(Jogos!$H:$H,Jogos!$E:$E,$A49)+SUMIFS(Jogos!$F:$F,Jogos!$I:$I,$A49)+COUNTIFS(Jogos!$S:$S,\"WWIND\",Jogos!$E:$E,$A49)*2+COUNTIFS(Jogos!$S:$S,\"WWIND\",Jogos!$I:$I,$A49)*2","v":11},-1,9,{"v":0.4444444444444444,"d":"44.4%"},{"$f":"INDEX(ClaFIN!B:C,MATCH(B49,ClaFIN!C:C,0),1)","v":{"v":3,"d":"3º"}}]
["Leonardo Duguet","LIBERDADE [A]",19,{"$f":"COUNTIFS(Jogos!$E:$E,$A50,Jogos!$N:$N,\"V\")+COUNTIFS(Jogos!$I:$I,$A50,Jogos!$O:$O,\"V\")","v":6},{"$f":"COUNTIFS(Jogos!$E:$E,$A50,Jogos!$N:$N,\"E\")+COUNTIFS(Jogos!$I:$I,$A50,Jogos!$O:$O,\"E\")","v":1},{"$f":"COUNTIFS(Jogos!$E:$E,$A50,Jogos!$N:$N,\"D\")+COUNTIFS(Jogos!$I:$I,$A50,Jogos!$O:$O,\"D\")","v":1},{"$f":"SUMIFS(Jogos!$F:$F,Jogos!$E:$E,$A50)+SUMIFS(Jogos!$H:$H,Jogos!$I:$I,$A50)","v":10},{"$f":"SUMIFS(Jogos!$H:$H,Jogos!$E:$E,$A50)+SUMIFS(Jogos!$F:$F,Jogos!$I:$I,$A50)+COUNTIFS(Jogos!$S:$S,\"WWIND\",Jogos!$E:$E,$A50)*2+COUNTIFS(Jogos!$S:$S,\"WWIND\",Jogos!$I:$I,$A50)*2","v":5},5,8,{"v":0.7916666666666666,"d":"79.2%"},{"$f":"INDEX(ClaFIN!B:C,MATCH(B50,ClaFIN!C:C,0),1)","v":{"v":1,"d":"1º"}}]
["Leonardo Stumpf","TUPI [A]",23,{"$f":"COUNTIFS(Jogos!$E:$E,$A51,Jogos!$N:$N,\"V\")+COUNTIFS(Jogos!$I:$I,$A51,Jogos!$O:$O,\"V\")","v":7},{"$f":"COUNTIFS(Jogos!$E:$E,$A51,Jogos!$N:$N,\"E\")+COUNTIFS(Jogos!$I:$I,$A51,Jogos!$O:$O,\"E\")","v":2},{"$f":"COUNTIFS(Jogos!$E:$E,$A51,Jogos!$N:$N,\"D\")+COUNTIFS(Jogos!$I:$I,$A51,Jogos!$O:$O,\"D\")","v":2},{"$f":"SUMIFS(Jogos!$F:$F,Jogos!$E:$E,$A51)+SUMIFS(Jogos!$H:$H,Jogos!$I:$I,$A51)","v":23},{"$f":"SUMIFS(Jogos!$H:$H,Jogos!$E:$E,$A51)+SUMIFS(Jogos!$F:$F,Jogos!$I:$I,$A51)+COUNTIFS(Jogos!$S:$S,\"WWIND\",Jogos!$E:$E,$A51)*2+COUNTIFS(Jogos!$S:$S,\"WWIND\",Jogos!$I:$I,$A51)*2","v":9},14,11,{"v":0.696969696969697,"d":"69.7%"},{"$f":"INDEX(ClaFIN!B:C,MATCH(B51,ClaFIN!C:C,0),1)","v":{"v":2,"d":"2º"}}]
["Lorival Ribeiro","LIBERDADE [A]",23,{"$f":"COUNTIFS(Jogos!$E:$E,$A52,Jogos!$N:$N,\"V\")+COUNTIFS(Jogos!$I:$I,$A52,Jogos!$O:$O,\"V\")","v":7},{"$f":"COUNTIFS(Jogos!$E:$E,$A52,Jogos!$N:$N,\"E\")+COUNTIFS(Jogos!$I:$I,$A52,Jogos!$O:$O,\"E\")","v":2},{"$f":"COUNTIFS(Jogos!$E:$E,$A52,Jogos!$N:$N,\"D\")+COUNTIFS(Jogos!$I:$I,$A52,Jogos!$O:$O,\"D\")","v":0},{"$f":"SUMIFS(Jogos!$F:$F,Jogos!$E:$E,$A52)+SUMIFS(Jogos!$H:$H,Jogos!$I:$I,$A52)","v":19},{"$f":"SUMIFS(Jogos!$H:$H,Jogos!$E:$E,$A52)+SUMIFS(Jogos!$F:$F,Jogos!$I:$I,$A52)+COUNTIFS(Jogos!$S:$S,\"WWIND\",Jogos!$E:$E,$A52)*2+COUNTIFS(Jogos!$S:$S,\"WWIND\",Jogos!$I:$I,$A52)*2","v":6},13,9,{"v":0.8518518518518519,"d":"85.2%"},{"$f":"INDEX(ClaFIN!B:C,MATCH(B52,ClaFIN!C:C,0),1)","v":{"v":1,"d":"1º"}}]
["Lucas Luna","CHACAL [B]",3,{"$f":"COUNTIFS(Jogos!$E:$E,$A53,Jogos!$N:$N,\"V\")+COUNTIFS(Jogos!$I:$I,$A53,Jogos!$O:$O,\"V\")","v":1},{"$f":"COUNTIFS(Jogos!$E:$E,$A53,Jogos!$N:$N,\"E\")+COUNTIFS(Jogos!$I:$I,$A53,Jogos!$O:$O,\"E\")","v":0},{"$f":"COUNTIFS(Jogos!$E:$E,$A53,Jogos!$N:$N,\"D\")+COUNTIFS(Jogos!$I:$I,$A53,Jogos!$O:$O,\"D\")","v":6},{"$f":"SUMIFS(Jogos!$F:$F,Jogos!$E:$E,$A53)+SUMIFS(Jogos!$H:$H,Jogos!$I:$I,$A53)","v":4},{"$f":"SUMIFS(Jogos!$H:$H,Jogos!$E:$E,$A53)+SUMIFS(Jogos!$F:$F,Jogos!$I:$I,$A53)+COUNTIFS(Jogos!$S:$S,\"WWIND\",Jogos!$E:$E,$A53)*2+COUNTIFS(Jogos!$S:$S,\"WWIND\",Jogos!$I:$I,$A53)*2","v":17},-13,7,{"v":0.14285714285714285,"d":"14.3%"},{"$f":"INDEX(ClaFIN!B:C,MATCH(B53,ClaFIN!C:C,0),1)","v":{"v":17,"d":"17º"}}]
["Luiz Carlos Guerra","LIBERDADE [B]",17,{"$f":"COUNTIFS(Jogos!$E:$E,$A54,Jogos!$N:$N,\"V\")+COUNTIFS(Jogos!$I:$I,$A54,Jogos!$O:$O,\"V\")","v":5},{"$f":"COUNTIFS(Jogos!$E:$E,$A54,Jogos!$N:$N,\"E\")+COUNTIFS(Jogos!$I:$I,$A54,Jogos!$O:$O,\"E\")","v":2},{"$f":"COUNTIFS(Jogos!$E:$E,$A54,Jogos!$N:$N,\"D\")+COUNTIFS(Jogos!$I:$I,$A54,Jogos!$O:$O,\"D\")","v":2},{"$f":"SUMIFS(Jogos!$F:$F,Jogos!$E:$E,$A54)+SUMIFS(Jogos!$H:$H,Jogos!$I:$I,$A54)","v":15},{"$f":"SUMIFS(Jogos!$H:$H,Jogos!$E:$E,$A54)+SUMIFS(Jogos!$F:$F,Jogos!$I:$I,$A54)+COUNTIFS(Jogos!$S:$S,\"WWIND\",Jogos!$E:$E,$A54)*2+COUNTIFS(Jogos!$S:$S,\"WWIND\",Jogos!$I:$I,$A54)*2","v":7},8,9,{"v":0.6296296296296297,"d":"63.0%"},{"$f":"INDEX(ClaFIN!B:C,MATCH(B54,ClaFIN!C:C,0),1)","v":{"v":6,"d":"6º"}}]
["Luiz Claudio Caruso","AABB/ACAFUMA [A]",19,{"$f":"COUNTIFS(Jogos!$E:$E,$A55,Jogos!$N:$N,\"V\")+COUNTIFS(Jogos!$I:$I,$A55,Jogos!$O:$O,\"V\")","v":6},{"$f":"COUNTIFS(Jogos!$E:$E,$A55,Jogos!$N:$N,\"E\")+COUNTIFS(Jogos!$I:$I,$A55,Jogos!$O:$O,\"E\")","v":1},{"$f":"COUNTIFS(Jogos!$E:$E,$A55,Jogos!$N:$N,\"D\")+COUNTIFS(Jogos!$I:$I,$A55,Jogos!$O:$O,\"D\")","v":2},{"$f":"SUMIFS(Jogos!$F:$F,Jogos!$E:$E,$A55)+SUMIFS(Jogos!$H:$H,Jogos!$I:$I,$A55)","v":16},{"$f":"SUMIFS(Jogos!$H:$H,Jogos!$E:$E,$A55)+SUMIFS(Jogos!$F:$F,Jogos!$I:$I,$A55)+COUNTIFS(Jogos!$S:$S,\"WWIND\",Jogos!$E:$E,$A55)*2+COUNTIFS(Jogos!$S:$S,\"WWIND\",Jogos!$I:$I,$A55)*2","v":7},9,9,{"v":0.7037037037037037,"d":"70.4%"},{"$f":"INDEX(ClaFIN!B:C,MATCH(B55,ClaFIN!C:C,0),1)","v":{"v":9,"d":"9º"}}]
["Luiz Henrique Colla","TUPI [B]",12,{"$f":"COUNTIFS(Jogos!$E:$E,$A56,Jogos!$N:$N,\"V\")+COUNTIFS(Jogos!$I:$I,$A56,Jogos!$O:$O,\"V\")","v":3},{"$f":"COUNTIFS(Jogos!$E:$E,$A56,Jogos!$N:$N,\"E\")+COUNTIFS(Jogos!$I:$I,$A56,Jogos!$O:$O,\"E\")","v":3},{"$f":"COUNTIFS(Jogos!$E:$E,$A56,Jogos!$N:$N,\"D\")+COUNTIFS(Jogos!$I:$I,$A56,Jogos!$O:$O,\"D\")","v":2},{"$f":"SUMIFS(Jogos!$F:$F,Jogos!$E:$E,$A56)+SUMIFS(Jogos!$H:$H,Jogos!$I:$I,$A56)","v":9},{"$f":"SUMIFS(Jogos!$H:$H,Jogos!$E:$E,$A56)+SUMIFS(Jogos!$F:$F,Jogos!$I:$I,$A56)+COUNTIFS(Jogos!$S:$S,\"WWIND\",Jogos!$E:$E,$A56)*2+COUNTIFS(Jogos!$S:$S,\"WWIND\",Jogos!$I:$I,$A56)*2","v":7},2,8,{"v":0.5,"d":"50.0%"},{"$f":"INDEX(ClaFIN!B:C,MATCH(B56,ClaFIN!C:C,0),1)","v":{"v":10,"d":"10º"}}]
["Luiz Humberto","UNIÃO INDEPENDENTE/UBERABA",13,{"$f":"COUNTIFS(Jogos!$E:$E,$A57,Jogos!$N:$N,\"V\")+COUNTIFS(Jogos!$I:$I,$A57,Jogos!$O:$O,\"V\")","v":3},{"$f":"COUNTIFS(Jogos!$E:$E,$A57,Jogos!$N:$N,\"E\")+COUNTIFS(Jogos!$I:$I,$A57,Jogos!$O:$O,\"E\")","v":4},{"$f":"COUNTIFS(Jogos!$E:$E,$A57,Jogos!$N:$N,\"D\")+COUNTIFS(Jogos!$I:$I,$A57,Jogos!$O:$O,\"D\")","v":2},{"$f":"SUMIFS(Jogos!$F:$F,Jogos!$E:$E,$A57)+SUMIFS(Jogos!$H:$H,Jogos!$I:$I,$A57)","v":7},{"$f":"SUMIFS(Jogos!$H:$H,Jogos!$E:$E,$A57)+SUMIFS(Jogos!$F:$F,Jogos!$I:$I,$A57)+COUNTIFS(Jogos!$S:$S,\"WWIND\",Jogos!$E:$E,$A57)*2+COUNTIFS(Jogos!$S:$S,\"WWIND\",Jogos!$I:$I,$A57)*2","v":5},2,9,{"v":0.48148148148148145,"d":"48.1%"},{"$f":"INDEX(ClaFIN!B:C,MATCH(B57,ClaFIN!C:C,0),1)","v":{"v":4,"d":"4º"}}]
["Marcelo Ferreira","AABB/ACAFUMA [B]",9,{"$f":"COUNTIFS(Jogos!$E:$E,$A58,Jogos!$N:$N,\"V\")+COUNTIFS(Jogos!$I:$I,$A58,Jogos!$O:$O,\"V\")","v":2},{"$f":"COUNTIFS(Jogos!$E:$E,$A58,Jogos!$N:$N,\"E\")+COUNTIFS(Jogos!$I:$I,$A58,Jogos!$O:$O,\"E\")","v":3},{"$f":"COUNTIFS(Jogos!$E:$E,$A58,Jogos!$N:$N,\"D\")+COUNTIFS(Jogos!$I:$I,$A58,Jogos!$O:$O,\"D\")","v":2},{"$f":"SUMIFS(Jogos!$F:$F,Jogos!$E:$E,$A58)+SUMIFS(Jogos!$H:$H,Jogos!$I:$I,$A58)","v":3},{"$f":"SUMIFS(Jogos!$H:$H,Jogos!$E:$E,$A58)+SUMIFS(Jogos!$F:$F,Jogos!$I:$I,$A58)+COUNTIFS(Jogos!$S:$S,\"WWIND\",Jogos!$E:$E,$A58)*2+COUNTIFS(Jogos!$S:$S,\"WWIND\",Jogos!$I:$I,$A58)*2","v":6},-3,7,{"v":0.42857142857142855,"d":"42.9%"},{"$f":"INDEX(ClaFIN!B:C,MATCH(B58,ClaFIN!C:C,0),1)","v":{"v":11,"d":"11º"}}]
["Marcelo Henrique","MATIAS [A]",8,{"$f":"COUNTIFS(Jogos!$E:$E,$A59,Jogos!$N:$N,\"V\")+COUNTIFS(Jogos!$I:$I,$A59,Jogos!$O:$O,\"V\")","v":2},{"$f":"COUNTIFS(Jogos!$E:$E,$A59,Jogos!$N:$N,\"E\")+COUNTIFS(Jogos!$I:$I,$A59,Jogos!$O:$O,\"E\")","v":2},{"$f":"COUNTIFS(Jogos!$E:$E,$A59,Jogos!$N:$N,\"D\")+COUNTIFS(Jogos!$I:$I,$A59,Jogos!$O:$O,\"D\")","v":5},{"$f":"SUMIFS(Jogos!$F:$F,Jogos!$E:$E,$A59)+SUMIFS(Jogos!$H:$H,Jogos!$I:$I,$A59)","v":5},{"$f":"SUMIFS(Jogos!$H:$H,Jogos!$E:$E,$A59)+SUMIFS(Jogos!$F:$F,Jogos!$I:$I,$A59)+COUNTIFS(Jogos!$S:$S,\"WWIND\",Jogos!$E:$E,$A59)*2+COUNTIFS(Jogos!$S:$S,\"WWIND\",Jogos!$I:$I,$A59)*2","v":7},-2,9,{"v":0.2962962962962963,"d":"29.6%"},{"$f":"INDEX(ClaFIN!B:C,MATCH(B59,ClaFIN!C:C,0),1)","v":{"v":3,"d":"3º"}}]
["Marcelo Lima","VASCO DA GAMA",6,{"$f":"COUNTIFS(Jogos!$E:$E,$A60,Jogos!$N:$N,\"V\")+COUNTIFS(Jogos!$I:$I,$A60,Jogos!$O:$O,\"V\")","v":1},{"$f":"COUNTIFS(Jogos!$E:$E,$A60,Jogos!$N:$N,\"E\")+COUNTIFS(Jogos!$I:$I,$A60,Jogos!$O:$O,\"E\")","v":3},{"$f":"COUNTIFS(Jogos!$E:$E,$A60,Jogos!$N:$N,\"D\")+COUNTIFS(Jogos!$I:$I,$A60,Jogos!$O:$O,\"D\")","v":0},{"$f":"SUMIFS(Jogos!$F:$F,Jogos!$E:$E,$A60)+SUMIFS(Jogos!$H:$H,Jogos!$I:$I,$A60)","v":4},{"$f":"SUMIFS(Jogos!$H:$H,Jogos!$E:$E,$A60)+SUMIFS(Jogos!$F:$F,Jogos!$I:$I,$A60)+COUNTIFS(Jogos!$S:$S,\"WWIND\",Jogos!$E:$E,$A60)*2+COUNTIFS(Jogos!$S:$S,\"WWIND\",Jogos!$I:$I,$A60)*2","v":1},3,4,{"v":0.5,"d":"50.0%"},{"$f":"INDEX(ClaFIN!B:C,MATCH(B60,ClaFIN!C:C,0),1)","v":{"v":7,"d":"7º"}}]
["Marcelo Silva","AABB/ACAFUMA [C]",15,{"$f":"COUNTIFS(Jogos!$E:$E,$A61,Jogos!$N:$N,\"V\")+COUNTIFS(Jogos!$I:$I,$A61,Jogos!$O:$O,\"V\")","v":4},{"$f":"COUNTIFS(Jogos!$E:$E,$A61,Jogos!$N:$N,\"E\")+COUNTIFS(Jogos!$I:$I,$A61,Jogos!$O:$O,\"E\")","v":3},{"$f":"COUNTIFS(Jogos!$E:$E,$A61,Jogos!$N:$N,\"D\")+COUNTIFS(Jogos!$I:$I,$A61,Jogos!$O:$O,\"D\")","v":3},{"$f":"SUMIFS(Jogos!$F:$F,Jogos!$E:$E,$A61)+SUMIFS(Jogos!$H:$H,Jogos!$I:$I,$A61)","v":7},{"$f":"SUMIFS(Jogos!$H:$H,Jogos!$E:$E,$A61)+SUMIFS(Jogos!$F:$F,Jogos!$I:$I,$A61)+COUNTIFS(Jogos!$S:$S,\"WWIND\",Jogos!$E:$E,$A61)*2+COUNTIFS(Jogos!$S:$S,\"WWIND\",Jogos!$I:$I,$A61)*2","v":10},-3,10,{"v":0.5,"d":"50.0%"},{"$f":"INDEX(ClaFIN!B:C,MATCH(B61,ClaFIN!C:C,0),1)","v":{"v":8,"d":"8º"}}]
["Marcelo Virgilio","LIBERDADE [B]",13,{"$f":"COUNTIFS(Jogos!$E:$E,$A62,Jogos!$N:$N,\"V\")+COUNTIFS(Jogos!$I:$I,$A62,Jogos!$O:$O,\"V\")","v":4},{"$f":"COUNTIFS(Jogos!$E:$E,$A62,Jogos!$N:$N,\"E\")+COUNTIFS(Jogos!$I:$I,$A62,Jogos!$O:$O,\"E\")","v":1},{"$f":"COUNTIFS(Jogos!$E:$E,$A62,Jogos!$N:$N,\"D\")+COUNTIFS(Jogos!$I:$I,$A62,Jogos!$O:$O,\"D\")","v":3},{"$f":"SUMIFS(Jogos!$F:$F,Jogos!$E:$E,$A62)+SUMIFS(Jogos!$H:$H,Jogos!$I:$I,$A62)","v":6},{"$f":"SUMIFS(Jogos!$H:$H,Jogos!$E:$E,$A62)+SUMIFS(Jogos!$F:$F,Jogos!$I:$I,$A62)+COUNTIFS(Jogos!$S:$S,\"WWIND\",Jogos!$E:$E,$A62)*2+COUNTIFS(Jogos!$S:$S,\"WWIND\",Jogos!$I:$I,$A62)*2","v":4},2,8,{"v":0.5416666666666666,"d":"54.2%"},{"$f":"INDEX(ClaFIN!B:C,MATCH(B62,ClaFIN!C:C,0),1)","v":{"v":6,"d":"6º"}}]
["Marco Andre Veloso","COMARY",7,{"$f":"COUNTIFS(Jogos!$E:$E,$A63,Jogos!$N:$N,\"V\")+COUNTIFS(Jogos!$I:$I,$A63,Jogos!$O:$O,\"V\")","v":2},{"$f":"COUNTIFS(Jogos!$E:$E,$A63,Jogos!$N:$N,\"E\")+COUNTIFS(Jogos!$I:$I,$A63,Jogos!$O:$O,\"E\")","v":1},{"$f":"COUNTIFS(Jogos!$E:$E,$A63,Jogos!$N:$N,\"D\")+COUNTIFS(Jogos!$I:$I,$A63,Jogos!$O:$O,\"D\")","v":3},{"$f":"SUMIFS(Jogos!$F:$F,Jogos!$E:$E,$A63)+SUMIFS(Jogos!$H:$H,Jogos!$I:$I,$A63)","v":6},{"$f":"SUMIFS(Jogos!$H:$H,Jogos!$E:$E,$A63)+SUMIFS(Jogos!$F:$F,Jogos!$I:$I,$A63)+COUNTIFS(Jogos!$S:$S,\"WWIND\",Jogos!$E:$E,$A63)*2+COUNTIFS(Jogos!$S:$S,\"WWIND\",Jogos!$I:$I,$A63)*2","v":9},-3,6,{"v":0.3888888888888889,"d":"38.9%"},{"$f":"INDEX(ClaFIN!B:C,MATCH(B63,ClaFIN!C:C,0),1)","v":{"v":12,"d":"12º"}}]
["Marcos Ferreira","BOTAFOGO",3,{"$f":"COUNTIFS(Jogos!$E:$E,$A64,Jogos!$N:$N,\"V\")+COUNTIFS(Jogos!$I:$I,$A64,Jogos!$O:$O,\"V\")","v":1},{"$f":"COUNTIFS(Jogos!$E:$E,$A64,Jogos!$N:$N,\"E\")+COUNTIFS(Jogos!$I:$I,$A64,Jogos!$O:$O,\"E\")","v":0},{"$f":"COUNTIFS(Jogos!$E:$E,$A64,Jogos!$N:$N,\"D\")+COUNTIFS(Jogos!$I:$I,$A64,Jogos!$O:$O,\"D\")","v":0},{"$f":"SUMIFS(Jogos!$F:$F,Jogos!$E:$E,$A64)+SUMIFS(Jogos!$H:$H,Jogos!$I:$I,$A64)","v":2},{"$f":"SUMIFS(Jogos!$H:$H,Jogos!$E:$E,$A64)+SUMIFS(Jogos!$F:$F,Jogos!$I:$I,$A64)+COUNTIFS(Jogos!$S:$S,\"WWIND\",Jogos!$E:$E,$A64)*2+COUNTIFS(Jogos!$S:$S,\"WWIND\",Jogos!$I:$I,$A64)*2","v":0},2,1,{"v":1,"d":"100.0%"},{"$f":"INDEX(ClaFIN!B:C,MATCH(B64,ClaFIN!C:C,0),1)","v":{"v":5,"d":"5º"}}]
["Marcus Monteiro","TUPI [A]",22,{"$f":"COUNTIFS(Jogos!$E:$E,$A65,Jogos!$N:$N,\"V\")+COUNTIFS(Jogos!$I:$I,$A65,Jogos!$O:$O,\"V\")","v":6},{"$f":"COUNTIFS(Jogos!$E:$E,$A65,Jogos!$N:$N,\"E\")+COUNTIFS(Jogos!$I:$I,$A65,Jogos!$O:$O,\"E\")","v":4},{"$f":"COUNTIFS(Jogos!$E:$E,$A65,Jogos!$N:$N,\"D\")+COUNTIFS(Jogos!$I:$I,$A65,Jogos!$O:$O,\"D\")","v":1},{"$f":"SUMIFS(Jogos!$F:$F,Jogos!$E:$E,$A65)+SUMIFS(Jogos!$H:$H,Jogos!$I:$I,$A65)","v":17},{"$f":"SUMIFS(Jogos!$H:$H,Jogos!$E:$E,$A65)+SUMIFS(Jogos!$F:$F,Jogos!$I:$I,$A65)+COUNTIFS(Jogos!$S:$S,\"WWIND\",Jogos!$E:$E,$A65)*2+COUNTIFS(Jogos!$S:$S,\"WWIND\",Jogos!$I:$I,$A65)*2","v":9},8,11,{"v":0.6666666666666666,"d":"66.7%"},{"$f":"INDEX(ClaFIN!B:C,MATCH(B65,ClaFIN!C:C,0),1)","v":{"v":2,"d":"2º"}}]
["Mario Cleber","MATIAS [B]",1,{"$f":"COUNTIFS(Jogos!$E:$E,$A66,Jogos!$N:$N,\"V\")+COUNTIFS(Jogos!$I:$I,$A66,Jogos!$O:$O,\"V\")","v":0},{"$f":"COUNTIFS(Jogos!$E:$E,$A66,Jogos!$N:$N,\"E\")+COUNTIFS(Jogos!$I:$I,$A66,Jogos!$O:$O,\"E\")","v":1},{"$f":"COUNTIFS(Jogos!$E:$E,$A66,Jogos!$N:$N,\"D\")+COUNTIFS(Jogos!$I:$I,$A66,Jogos!$O:$O,\"D\")","v":4},{"$f":"SUMIFS(Jogos!$F:$F,Jogos!$E:$E,$A66)+SUMIFS(Jogos!$H:$H,Jogos!$I:$I,$A66)","v":0},{"$f":"SUMIFS(Jogos!$H:$H,Jogos!$E:$E,$A66)+SUMIFS(Jogos!$F:$F,Jogos!$I:$I,$A66)+COUNTIFS(Jogos!$S:$S,\"WWIND\",Jogos!$E:$E,$A66)*2+COUNTIFS(Jogos!$S:$S,\"WWIND\",Jogos!$I:$I,$A66)*2","v":10},-10,5,{"v":0.06666666666666667,"d":"6.7%"},{"$f":"INDEX(ClaFIN!B:C,MATCH(B66,ClaFIN!C:C,0),1)","v":{"v":16,"d":"16º"}}]
["Pablino Colen","CHACAL [B]",0,{"$f":"COUNTIFS(Jogos!$E:$E,$A67,Jogos!$N:$N,\"V\")+COUNTIFS(Jogos!$I:$I,$A67,Jogos!$O:$O,\"V\")","v":0},{"$f":"COUNTIFS(Jogos!$E:$E,$A67,Jogos!$N:$N,\"E\")+COUNTIFS(Jogos!$I:$I,$A67,Jogos!$O:$O,\"E\")","v":0},{"$f":"COUNTIFS(Jogos!$E:$E,$A67,Jogos!$N:$N,\"D\")+COUNTIFS(Jogos!$I:$I,$A67,Jogos!$O:$O,\"D\")","v":2},{"$f":"SUMIFS(Jogos!$F:$F,Jogos!$E:$E,$A67)+SUMIFS(Jogos!$H:$H,Jogos!$I:$I,$A67)","v":0},{"$f":"SUMIFS(Jogos!$H:$H,Jogos!$E:$E,$A67)+SUMIFS(Jogos!$F:$F,Jogos!$I:$I,$A67)+COUNTIFS(Jogos!$S:$S,\"WWIND\",Jogos!$E:$E,$A67)*2+COUNTIFS(Jogos!$S:$S,\"WWIND\",Jogos!$I:$I,$A67)*2","v":3},-3,2,{"v":0,"d":"0.0%"},{"$f":"INDEX(ClaFIN!B:C,MATCH(B67,ClaFIN!C:C,0),1)","v":{"v":17,"d":"17º"}}]
["Pablo Sidarta","COMARY",11,{"$f":"COUNTIFS(Jogos!$E:$E,$A68,Jogos!$N:$N,\"V\")+COUNTIFS(Jogos!$I:$I,$A68,Jogos!$O:$O,\"V\")","v":2},{"$f":"COUNTIFS(Jogos!$E:$E,$A68,Jogos!$N:$N,\"E\")+COUNTIFS(Jogos!$I:$I,$A68,Jogos!$O:$O,\"E\")","v":5},{"$f":"COUNTIFS(Jogos!$E:$E,$A68,Jogos!$N:$N,\"D\")+COUNTIFS(Jogos!$I:$I,$A68,Jogos!$O:$O,\"D\")","v":2},{"$f":"SUMIFS(Jogos!$F:$F,Jogos!$E:$E,$A68)+SUMIFS(Jogos!$H:$H,Jogos!$I:$I,$A68)","v":11},{"$f":"SUMIFS(Jogos!$H:$H,Jogos!$E:$E,$A68)+SUMIFS(Jogos!$F:$F,Jogos!$I:$I,$A68)+COUNTIFS(Jogos!$S:$S,\"WWIND\",Jogos!$E:$E,$A68)*2+COUNTIFS(Jogos!$S:$S,\"WWIND\",Jogos!$I:$I,$A68)*2","v":10},1,9,{"v":0.4074074074074074,"d":"40.7%"},{"$f":"INDEX(ClaFIN!B:C,MATCH(B68,ClaFIN!C:C,0),1)","v":{"v":12,"d":"12º"}}]
["Paulo Airton Junior","AABB/ACAFUMA [C]",14,{"$f":"COUNTIFS(Jogos!$E:$E,$A69,Jogos!$N:$N,\"V\")+COUNTIFS(Jogos!$I:$I,$A69,Jogos!$O:$O,\"V\")","v":4},{"$f":"COUNTIFS(Jogos!$E:$E,$A69,Jogos!$N:$N,\"E\")+COUNTIFS(Jogos!$I:$I,$A69,Jogos!$O:$O,\"E\")","v":2},{"$f":"COUNTIFS(Jogos!$E:$E,$A69,Jogos!$N:$N,\"D\")+COUNTIFS(Jogos!$I:$I,$A69,Jogos!$O:$O,\"D\")","v":4},{"$f":"SUMIFS(Jogos!$F:$F,Jogos!$E:$E,$A69)+SUMIFS(Jogos!$H:$H,Jogos!$I:$I,$A69)","v":10},{"$f":"SUMIFS(Jogos!$H:$H,Jogos!$E:$E,$A69)+SUMIFS(Jogos!$F:$F,Jogos!$I:$I,$A69)+COUNTIFS(Jogos!$S:$S,\"WWIND\",Jogos!$E:$E,$A69)*2+COUNTIFS(Jogos!$S:$S,\"WWIND\",Jogos!$I:$I,$A69)*2","v":11},-1,10,{"v":0.4666666666666667,"d":"46.7%"},{"$f":"INDEX(ClaFIN!B:C,MATCH(B69,ClaFIN!C:C,0),1)","v":{"v":8,"d":"8º"}}]
["Paulo Caruso","AABB/ACAFUMA [A]",{"$f":"IF(J70=0,-0.001,D70*3+E70)","v":13},{"$f":"COUNTIFS(Jogos!$E:$E,$A70,Jogos!$N:$N,\"V\")+COUNTIFS(Jogos!$I:$I,$A70,Jogos!$O:$O,\"V\")","v":4},{"$f":"COUNTIFS(Jogos!$E:$E,$A70,Jogos!$N:$N,\"E\")+COUNTIFS(Jogos!$I:$I,$A70,Jogos!$O:$O,\"E\")","v":1},{"$f":"COUNTIFS(Jogos!$E:$E,$A70,Jogos!$N:$N,\"D\")+COUNTIFS(Jogos!$I:$I,$A70,Jogos!$O:$O,\"D\")","v":4},{"$f":"SUMIFS(Jogos!$F:$F,Jogos!$E:$E,$A70)+SUMIFS(Jogos!$H:$H,Jogos!$I:$I,$A70)","v":10},{"$f":"SUMIFS(Jogos!$H:$H,Jogos!$E:$E,$A70)+SUMIFS(Jogos!$F:$F,Jogos!$I:$I,$A70)+COUNTIFS(Jogos!$S:$S,\"WWIND\",Jogos!$E:$E,$A70)*2+COUNTIFS(Jogos!$S:$S,\"WWIND\",Jogos!$I:$I,$A70)*2","v":7},{"$f":"G70-H70","v":3},{"$f":"SUM(D70:F70)","v":9},{"$f":"IF(J70=0,-0.00001,C70/(J70*3))","v":{"v":0.48148148148148145,"d":"48.1%"}},{"$f":"INDEX(ClaFIN!B:C,MATCH(B70,ClaFIN!C:C,0),1)","v":{"v":9,"d":"9º"}}]
["Paulo Cesar Faria","AABB/ACAFUMA [B]",12,{"$f":"COUNTIFS(Jogos!$E:$E,$A71,Jogos!$N:$N,\"V\")+COUNTIFS(Jogos!$I:$I,$A71,Jogos!$O:$O,\"V\")","v":3},{"$f":"COUNTIFS(Jogos!$E:$E,$A71,Jogos!$N:$N,\"E\")+COUNTIFS(Jogos!$I:$I,$A71,Jogos!$O:$O,\"E\")","v":3},{"$f":"COUNTIFS(Jogos!$E:$E,$A71,Jogos!$N:$N,\"D\")+COUNTIFS(Jogos!$I:$I,$A71,Jogos!$O:$O,\"D\")","v":1},{"$f":"SUMIFS(Jogos!$F:$F,Jogos!$E:$E,$A71)+SUMIFS(Jogos!$H:$H,Jogos!$I:$I,$A71)","v":6},{"$f":"SUMIFS(Jogos!$H:$H,Jogos!$E:$E,$A71)+SUMIFS(Jogos!$F:$F,Jogos!$I:$I,$A71)+COUNTIFS(Jogos!$S:$S,\"WWIND\",Jogos!$E:$E,$A71)*2+COUNTIFS(Jogos!$S:$S,\"WWIND\",Jogos!$I:$I,$A71)*2","v":6},0,7,{"v":0.5714285714285714,"d":"57.1%"},{"$f":"INDEX(ClaFIN!B:C,MATCH(B71,ClaFIN!C:C,0),1)","v":{"v":11,"d":"11º"}}]
["Paulo Mangia","CHACAL [A]",4,{"$f":"COUNTIFS(Jogos!$E:$E,$A72,Jogos!$N:$N,\"V\")+COUNTIFS(Jogos!$I:$I,$A72,Jogos!$O:$O,\"V\")","v":0},{"$f":"COUNTIFS(Jogos!$E:$E,$A72,Jogos!$N:$N,\"E\")+COUNTIFS(Jogos!$I:$I,$A72,Jogos!$O:$O,\"E\")","v":4},{"$f":"COUNTIFS(Jogos!$E:$E,$A72,Jogos!$N:$N,\"D\")+COUNTIFS(Jogos!$I:$I,$A72,Jogos!$O:$O,\"D\")","v":5},{"$f":"SUMIFS(Jogos!$F:$F,Jogos!$E:$E,$A72)+SUMIFS(Jogos!$H:$H,Jogos!$I:$I,$A72)","v":4},{"$f":"SUMIFS(Jogos!$H:$H,Jogos!$E:$E,$A72)+SUMIFS(Jogos!$F:$F,Jogos!$I:$I,$A72)+COUNTIFS(Jogos!$S:$S,\"WWIND\",Jogos!$E:$E,$A72)*2+COUNTIFS(Jogos!$S:$S,\"WWIND\",Jogos!$I:$I,$A72)*2","v":12},-8,9,{"v":0.14814814814814814,"d":"14.8%"},{"$f":"INDEX(ClaFIN!B:C,MATCH(B72,ClaFIN!C:C,0),1)","v":{"v":13,"d":"13º"}}]
["Paulo Marcos de França","TUPI [A]",18,{"$f":"COUNTIFS(Jogos!$E:$E,$A73,Jogos!$N:$N,\"V\")+COUNTIFS(Jogos!$I:$I,$A73,Jogos!$O:$O,\"V\")","v":5},{"$f":"COUNTIFS(Jogos!$E:$E,$A73,Jogos!$N:$N,\"E\")+COUNTIFS(Jogos!$I:$I,$A73,Jogos!$O:$O,\"E\")","v":3},{"$f":"COUNTIFS(Jogos!$E:$E,$A73,Jogos!$N:$N,\"D\")+COUNTIFS(Jogos!$I:$I,$A73,Jogos!$O:$O,\"D\")","v":1},{"$f":"SUMIFS(Jogos!$F:$F,Jogos!$E:$E,$A73)+SUMIFS(Jogos!$H:$H,Jogos!$I:$I,$A73)","v":9},{"$f":"SUMIFS(Jogos!$H:$H,Jogos!$E:$E,$A73)+SUMIFS(Jogos!$F:$F,Jogos!$I:$I,$A73)+COUNTIFS(Jogos!$S:$S,\"WWIND\",Jogos!$E:$E,$A73)*2+COUNTIFS(Jogos!$S:$S,\"WWIND\",Jogos!$I:$I,$A73)*2","v":3},6,9,{"v":0.6666666666666666,"d":"66.7%"},{"$f":"INDEX(ClaFIN!B:C,MATCH(B73,ClaFIN!C:C,0),1)","v":{"v":2,"d":"2º"}}]
["Paulo Ricardo Souza","TUPI [B]",13,{"$f":"COUNTIFS(Jogos!$E:$E,$A74,Jogos!$N:$N,\"V\")+COUNTIFS(Jogos!$I:$I,$A74,Jogos!$O:$O,\"V\")","v":3},{"$f":"COUNTIFS(Jogos!$E:$E,$A74,Jogos!$N:$N,\"E\")+COUNTIFS(Jogos!$I:$I,$A74,Jogos!$O:$O,\"E\")","v":4},{"$f":"COUNTIFS(Jogos!$E:$E,$A74,Jogos!$N:$N,\"D\")+COUNTIFS(Jogos!$I:$I,$A74,Jogos!$O:$O,\"D\")","v":1},{"$f":"SUMIFS(Jogos!$F:$F,Jogos!$E:$E,$A74)+SUMIFS(Jogos!$H:$H,Jogos!$I:$I,$A74)","v":10},{"$f":"SUMIFS(Jogos!$H:$H,Jogos!$E:$E,$A74)+SUMIFS(Jogos!$F:$F,Jogos!$I:$I,$A74)+COUNTIFS(Jogos!$S:$S,\"WWIND\",Jogos!$E:$E,$A74)*2+COUNTIFS(Jogos!$S:$S,\"WWIND\",Jogos!$I:$I,$A74)*2","v":5},5,8,{"v":0.5416666666666666,"d":"54.2%"},{"$f":"INDEX(ClaFIN!B:C,MATCH(B74,ClaFIN!C:C,0),1)","v":{"v":10,"d":"10º"}}]
["Rafael Pena","LIBERDADE [B]",9,{"$f":"COUNTIFS(Jogos!$E:$E,$A75,Jogos!$N:$N,\"V\")+COUNTIFS(Jogos!$I:$I,$A75,Jogos!$O:$O,\"V\")","v":2},{"$f":"COUNTIFS(Jogos!$E:$E,$A75,Jogos!$N:$N,\"E\")+COUNTIFS(Jogos!$I:$I,$A75,Jogos!$O:$O,\"E\")","v":3},{"$f":"COUNTIFS(Jogos!$E:$E,$A75,Jogos!$N:$N,\"D\")+COUNTIFS(Jogos!$I:$I,$A75,Jogos!$O:$O,\"D\")","v":3},{"$f":"SUMIFS(Jogos!$F:$F,Jogos!$E:$E,$A75)+SUMIFS(Jogos!$H:$H,Jogos!$I:$I,$A75)","v":5},{"$f":"SUMIFS(Jogos!$H:$H,Jogos!$E:$E,$A75)+SUMIFS(Jogos!$F:$F,Jogos!$I:$I,$A75)+COUNTIFS(Jogos!$S:$S,\"WWIND\",Jogos!$E:$E,$A75)*2+COUNTIFS(Jogos!$S:$S,\"WWIND\",Jogos!$I:$I,$A75)*2","v":6},-1,8,{"v":0.375,"d":"37.5%"},{"$f":"INDEX(ClaFIN!B:C,MATCH(B75,ClaFIN!C:C,0),1)","v":{"v":6,"d":"6º"}}]
["Renato Negreiros","BOTAFOGO",9,{"$f":"COUNTIFS(Jogos!$E:$E,$A76,Jogos!$N:$N,\"V\")+COUNTIFS(Jogos!$I:$I,$A76,Jogos!$O:$O,\"V\")","v":2},{"$f":"COUNTIFS(Jogos!$E:$E,$A76,Jogos!$N:$N,\"E\")+COUNTIFS(Jogos!$I:$I,$A76,Jogos!$O:$O,\"E\")","v":3},{"$f":"COUNTIFS(Jogos!$E:$E,$A76,Jogos!$N:$N,\"D\")+COUNTIFS(Jogos!$I:$I,$A76,Jogos!$O:$O,\"D\")","v":3},{"$f":"SUMIFS(Jogos!$F:$F,Jogos!$E:$E,$A76)+SUMIFS(Jogos!$H:$H,Jogos!$I:$I,$A76)","v":7},{"$f":"SUMIFS(Jogos!$H:$H,Jogos!$E:$E,$A76)+SUMIFS(Jogos!$F:$F,Jogos!$I:$I,$A76)+COUNTIFS(Jogos!$S:$S,\"WWIND\",Jogos!$E:$E,$A76)*2+COUNTIFS(Jogos!$S:$S,\"WWIND\",Jogos!$I:$I,$A76)*2","v":9},-2,8,{"v":0.375,"d":"37.5%"},{"$f":"INDEX(ClaFIN!B:C,MATCH(B76,ClaFIN!C:C,0),1)","v":{"v":5,"d":"5º"}}]
["Ricardo Machado","COMARY",4,{"$f":"COUNTIFS(Jogos!$E:$E,$A77,Jogos!$N:$N,\"V\")+COUNTIFS(Jogos!$I:$I,$A77,Jogos!$O:$O,\"V\")","v":1},{"$f":"COUNTIFS(Jogos!$E:$E,$A77,Jogos!$N:$N,\"E\")+COUNTIFS(Jogos!$I:$I,$A77,Jogos!$O:$O,\"E\")","v":1},{"$f":"COUNTIFS(Jogos!$E:$E,$A77,Jogos!$N:$N,\"D\")+COUNTIFS(Jogos!$I:$I,$A77,Jogos!$O:$O,\"D\")","v":2},{"$f":"SUMIFS(Jogos!$F:$F,Jogos!$E:$E,$A77)+SUMIFS(Jogos!$H:$H,Jogos!$I:$I,$A77)","v":3},{"$f":"SUMIFS(Jogos!$H:$H,Jogos!$E:$E,$A77)+SUMIFS(Jogos!$F:$F,Jogos!$I:$I,$A77)+COUNTIFS(Jogos!$S:$S,\"WWIND\",Jogos!$E:$E,$A77)*2+COUNTIFS(Jogos!$S:$S,\"WWIND\",Jogos!$I:$I,$A77)*2","v":6},-3,4,{"v":0.3333333333333333,"d":"33.3%"},{"$f":"INDEX(ClaFIN!B:C,MATCH(B77,ClaFIN!C:C,0),1)","v":{"v":12,"d":"12º"}}]
["Ricardo Sartine","MATIAS [B]",0,{"$f":"COUNTIFS(Jogos!$E:$E,$A78,Jogos!$N:$N,\"V\")+COUNTIFS(Jogos!$I:$I,$A78,Jogos!$O:$O,\"V\")","v":0},{"$f":"COUNTIFS(Jogos!$E:$E,$A78,Jogos!$N:$N,\"E\")+COUNTIFS(Jogos!$I:$I,$A78,Jogos!$O:$O,\"E\")","v":0},{"$f":"COUNTIFS(Jogos!$E:$E,$A78,Jogos!$N:$N,\"D\")+COUNTIFS(Jogos!$I:$I,$A78,Jogos!$O:$O,\"D\")","v":3},{"$f":"SUMIFS(Jogos!$F:$F,Jogos!$E:$E,$A78)+SUMIFS(Jogos!$H:$H,Jogos!$I:$I,$A78)","v":0},{"$f":"SUMIFS(Jogos!$H:$H,Jogos!$E:$E,$A78)+SUMIFS(Jogos!$F:$F,Jogos!$I:$I,$A78)+COUNTIFS(Jogos!$S:$S,\"WWIND\",Jogos!$E:$E,$A78)*2+COUNTIFS(Jogos!$S:$S,\"WWIND\",Jogos!$I:$I,$A78)*2","v":8},-8,3,{"v":0,"d":"0.0%"},{"$f":"INDEX(ClaFIN!B:C,MATCH(B78,ClaFIN!C:C,0),1)","v":{"v":16,"d":"16º"}}]
["Rodolfo Magalhaes","CHACAL [B]",3,{"$f":"COUNTIFS(Jogos!$E:$E,$A79,Jogos!$N:$N,\"V\")+COUNTIFS(Jogos!$I:$I,$A79,Jogos!$O:$O,\"V\")","v":0},{"$f":"COUNTIFS(Jogos!$E:$E,$A79,Jogos!$N:$N,\"E\")+COUNTIFS(Jogos!$I:$I,$A79,Jogos!$O:$O,\"E\")","v":3},{"$f":"COUNTIFS(Jogos!$E:$E,$A79,Jogos!$N:$N,\"D\")+COUNTIFS(Jogos!$I:$I,$A79,Jogos!$O:$O,\"D\")","v":2},{"$f":"SUMIFS(Jogos!$F:$F,Jogos!$E:$E,$A79)+SUMIFS(Jogos!$H:$H,Jogos!$I:$I,$A79)","v":2},{"$f":"SUMIFS(Jogos!$H:$H,Jogos!$E:$E,$A79)+SUMIFS(Jogos!$F:$F,Jogos!$I:$I,$A79)+COUNTIFS(Jogos!$S:$S,\"WWIND\",Jogos!$E:$E,$A79)*2+COUNTIFS(Jogos!$S:$S,\"WWIND\",Jogos!$I:$I,$A79)*2","v":6},-4,5,{"v":0.2,"d":"20.0%"},{"$f":"INDEX(ClaFIN!B:C,MATCH(B79,ClaFIN!C:C,0),1)","v":{"v":17,"d":"17º"}}]
["Rodrigo Caruso","AABB/ACAFUMA [B]",2,{"$f":"COUNTIFS(Jogos!$E:$E,$A80,Jogos!$N:$N,\"V\")+COUNTIFS(Jogos!$I:$I,$A80,Jogos!$O:$O,\"V\")","v":0},{"$f":"COUNTIFS(Jogos!$E:$E,$A80,Jogos!$N:$N,\"E\")+COUNTIFS(Jogos!$I:$I,$A80,Jogos!$O:$O,\"E\")","v":2},{"$f":"COUNTIFS(Jogos!$E:$E,$A80,Jogos!$N:$N,\"D\")+COUNTIFS(Jogos!$I:$I,$A80,Jogos!$O:$O,\"D\")","v":4},{"$f":"SUMIFS(Jogos!$F:$F,Jogos!$E:$E,$A80)+SUMIFS(Jogos!$H:$H,Jogos!$I:$I,$A80)","v":2},{"$f":"SUMIFS(Jogos!$H:$H,Jogos!$E:$E,$A80)+SUMIFS(Jogos!$F:$F,Jogos!$I:$I,$A80)+COUNTIFS(Jogos!$S:$S,\"WWIND\",Jogos!$E:$E,$A80)*2+COUNTIFS(Jogos!$S:$S,\"WWIND\",Jogos!$I:$I,$A80)*2","v":7},-5,6,{"v":0.1111111111111111,"d":"11.1%"},{"$f":"INDEX(ClaFIN!B:C,MATCH(B80,ClaFIN!C:C,0),1)","v":{"v":11,"d":"11º"}}]
["Rodrigo Primola","GRÊMIO MINEIRO",1,{"$f":"COUNTIFS(Jogos!$E:$E,$A81,Jogos!$N:$N,\"V\")+COUNTIFS(Jogos!$I:$I,$A81,Jogos!$O:$O,\"V\")","v":0},{"$f":"COUNTIFS(Jogos!$E:$E,$A81,Jogos!$N:$N,\"E\")+COUNTIFS(Jogos!$I:$I,$A81,Jogos!$O:$O,\"E\")","v":1},{"$f":"COUNTIFS(Jogos!$E:$E,$A81,Jogos!$N:$N,\"D\")+COUNTIFS(Jogos!$I:$I,$A81,Jogos!$O:$O,\"D\")","v":8},{"$f":"SUMIFS(Jogos!$F:$F,Jogos!$E:$E,$A81)+SUMIFS(Jogos!$H:$H,Jogos!$I:$I,$A81)","v":5},{"$f":"SUMIFS(Jogos!$H:$H,Jogos!$E:$E,$A81)+SUMIFS(Jogos!$F:$F,Jogos!$I:$I,$A81)+COUNTIFS(Jogos!$S:$S,\"WWIND\",Jogos!$E:$E,$A81)*2+COUNTIFS(Jogos!$S:$S,\"WWIND\",Jogos!$I:$I,$A81)*2","v":25},-20,9,{"v":0.037037037037037035,"d":"3.7%"},{"$f":"INDEX(ClaFIN!B:C,MATCH(B81,ClaFIN!C:C,0),1)","v":{"v":15,"d":"15º"}}]
["Romualdo Piccinini","MATIAS [B]",9,{"$f":"COUNTIFS(Jogos!$E:$E,$A82,Jogos!$N:$N,\"V\")+COUNTIFS(Jogos!$I:$I,$A82,Jogos!$O:$O,\"V\")","v":2},{"$f":"COUNTIFS(Jogos!$E:$E,$A82,Jogos!$N:$N,\"E\")+COUNTIFS(Jogos!$I:$I,$A82,Jogos!$O:$O,\"E\")","v":3},{"$f":"COUNTIFS(Jogos!$E:$E,$A82,Jogos!$N:$N,\"D\")+COUNTIFS(Jogos!$I:$I,$A82,Jogos!$O:$O,\"D\")","v":4},{"$f":"SUMIFS(Jogos!$F:$F,Jogos!$E:$E,$A82)+SUMIFS(Jogos!$H:$H,Jogos!$I:$I,$A82)","v":7},{"$f":"SUMIFS(Jogos!$H:$H,Jogos!$E:$E,$A82)+SUMIFS(Jogos!$F:$F,Jogos!$I:$I,$A82)+COUNTIFS(Jogos!$S:$S,\"WWIND\",Jogos!$E:$E,$A82)*2+COUNTIFS(Jogos!$S:$S,\"WWIND\",Jogos!$I:$I,$A82)*2","v":7},0,9,{"v":0.3333333333333333,"d":"33.3%"},{"$f":"INDEX(ClaFIN!B:C,MATCH(B82,ClaFIN!C:C,0),1)","v":{"v":16,"d":"16º"}}]
["Sergio Falcometa","BOTAFOGO",18,{"$f":"COUNTIFS(Jogos!$E:$E,$A83,Jogos!$N:$N,\"V\")+COUNTIFS(Jogos!$I:$I,$A83,Jogos!$O:$O,\"V\")","v":6},{"$f":"COUNTIFS(Jogos!$E:$E,$A83,Jogos!$N:$N,\"E\")+COUNTIFS(Jogos!$I:$I,$A83,Jogos!$O:$O,\"E\")","v":0},{"$f":"COUNTIFS(Jogos!$E:$E,$A83,Jogos!$N:$N,\"D\")+COUNTIFS(Jogos!$I:$I,$A83,Jogos!$O:$O,\"D\")","v":2},{"$f":"SUMIFS(Jogos!$F:$F,Jogos!$E:$E,$A83)+SUMIFS(Jogos!$H:$H,Jogos!$I:$I,$A83)","v":10},{"$f":"SUMIFS(Jogos!$H:$H,Jogos!$E:$E,$A83)+SUMIFS(Jogos!$F:$F,Jogos!$I:$I,$A83)+COUNTIFS(Jogos!$S:$S,\"WWIND\",Jogos!$E:$E,$A83)*2+COUNTIFS(Jogos!$S:$S,\"WWIND\",Jogos!$I:$I,$A83)*2","v":7},3,8,{"v":0.75,"d":"75.0%"},{"$f":"INDEX(ClaFIN!B:C,MATCH(B83,ClaFIN!C:C,0),1)","v":{"v":5,"d":"5º"}}]
["Simplicio Santos","AABB/ACAFUMA [C]",11,{"$f":"COUNTIFS(Jogos!$E:$E,$A84,Jogos!$N:$N,\"V\")+COUNTIFS(Jogos!$I:$I,$A84,Jogos!$O:$O,\"V\")","v":3},{"$f":"COUNTIFS(Jogos!$E:$E,$A84,Jogos!$N:$N,\"E\")+COUNTIFS(Jogos!$I:$I,$A84,Jogos!$O:$O,\"E\")","v":2},{"$f":"COUNTIFS(Jogos!$E:$E,$A84,Jogos!$N:$N,\"D\")+COUNTIFS(Jogos!$I:$I,$A84,Jogos!$O:$O,\"D\")","v":5},{"$f":"SUMIFS(Jogos!$F:$F,Jogos!$E:$E,$A84)+SUMIFS(Jogos!$H:$H,Jogos!$I:$I,$A84)","v":11},{"$f":"SUMIFS(Jogos!$H:$H,Jogos!$E:$E,$A84)+SUMIFS(Jogos!$F:$F,Jogos!$I:$I,$A84)+COUNTIFS(Jogos!$S:$S,\"WWIND\",Jogos!$E:$E,$A84)*2+COUNTIFS(Jogos!$S:$S,\"WWIND\",Jogos!$I:$I,$A84)*2","v":16},-5,10,{"v":0.36666666666666664,"d":"36.7%"},{"$f":"INDEX(ClaFIN!B:C,MATCH(B84,ClaFIN!C:C,0),1)","v":{"v":8,"d":"8º"}}]
["Tarcizio Dinoa Junior","AABB/ACAFUMA [A]",15,{"$f":"COUNTIFS(Jogos!$E:$E,$A85,Jogos!$N:$N,\"V\")+COUNTIFS(Jogos!$I:$I,$A85,Jogos!$O:$O,\"V\")","v":4},{"$f":"COUNTIFS(Jogos!$E:$E,$A85,Jogos!$N:$N,\"E\")+COUNTIFS(Jogos!$I:$I,$A85,Jogos!$O:$O,\"E\")","v":3},{"$f":"COUNTIFS(Jogos!$E:$E,$A85,Jogos!$N:$N,\"D\")+COUNTIFS(Jogos!$I:$I,$A85,Jogos!$O:$O,\"D\")","v":2},{"$f":"SUMIFS(Jogos!$F:$F,Jogos!$E:$E,$A85)+SUMIFS(Jogos!$H:$H,Jogos!$I:$I,$A85)","v":15},{"$f":"SUMIFS(Jogos!$H:$H,Jogos!$E:$E,$A85)+SUMIFS(Jogos!$F:$F,Jogos!$I:$I,$A85)+COUNTIFS(Jogos!$S:$S,\"WWIND\",Jogos!$E:$E,$A85)*2+COUNTIFS(Jogos!$S:$S,\"WWIND\",Jogos!$I:$I,$A85)*2","v":9},6,9,{"v":0.5555555555555556,"d":"55.6%"},{"$f":"INDEX(ClaFIN!B:C,MATCH(B85,ClaFIN!C:C,0),1)","v":{"v":9,"d":"9º"}}]
["Thiago Stephan","CHACAL [A]",16,{"$f":"COUNTIFS(Jogos!$E:$E,$A86,Jogos!$N:$N,\"V\")+COUNTIFS(Jogos!$I:$I,$A86,Jogos!$O:$O,\"V\")","v":4},{"$f":"COUNTIFS(Jogos!$E:$E,$A86,Jogos!$N:$N,\"E\")+COUNTIFS(Jogos!$I:$I,$A86,Jogos!$O:$O,\"E\")","v":4},{"$f":"COUNTIFS(Jogos!$E:$E,$A86,Jogos!$N:$N,\"D\")+COUNTIFS(Jogos!$I:$I,$A86,Jogos!$O:$O,\"D\")","v":2},{"$f":"SUMIFS(Jogos!$F:$F,Jogos!$E:$E,$A86)+SUMIFS(Jogos!$H:$H,Jogos!$I:$I,$A86)","v":16},{"$f":"SUMIFS(Jogos!$H:$H,Jogos!$E:$E,$A86)+SUMIFS(Jogos!$F:$F,Jogos!$I:$I,$A86)+COUNTIFS(Jogos!$S:$S,\"WWIND\",Jogos!$E:$E,$A86)*2+COUNTIFS(Jogos!$S:$S,\"WWIND\",Jogos!$I:$I,$A86)*2","v":11},5,10,{"v":0.5333333333333333,"d":"53.3%"},{"$f":"INDEX(ClaFIN!B:C,MATCH(B86,ClaFIN!C:C,0),1)","v":{"v":13,"d":"13º"}}]
["Valmir Silva","VASCO DA GAMA",5,{"$f":"COUNTIFS(Jogos!$E:$E,$A87,Jogos!$N:$N,\"V\")+COUNTIFS(Jogos!$I:$I,$A87,Jogos!$O:$O,\"V\")","v":1},{"$f":"COUNTIFS(Jogos!$E:$E,$A87,Jogos!$N:$N,\"E\")+COUNTIFS(Jogos!$I:$I,$A87,Jogos!$O:$O,\"E\")","v":2},{"$f":"COUNTIFS(Jogos!$E:$E,$A87,Jogos!$N:$N,\"D\")+COUNTIFS(Jogos!$I:$I,$A87,Jogos!$O:$O,\"D\")","v":1},{"$f":"SUMIFS(Jogos!$F:$F,Jogos!$E:$E,$A87)+SUMIFS(Jogos!$H:$H,Jogos!$I:$I,$A87)","v":3},{"$f":"SUMIFS(Jogos!$H:$H,Jogos!$E:$E,$A87)+SUMIFS(Jogos!$F:$F,Jogos!$I:$I,$A87)+COUNTIFS(Jogos!$S:$S,\"WWIND\",Jogos!$E:$E,$A87)*2+COUNTIFS(Jogos!$S:$S,\"WWIND\",Jogos!$I:$I,$A87)*2","v":2},1,4,{"v":0.4166666666666667,"d":"41.7%"},{"$f":"INDEX(ClaFIN!B:C,MATCH(B87,ClaFIN!C:C,0),1)","v":{"v":7,"d":"7º"}}]
["Vander Felipe","GRÊMIO MINEIRO",12,{"$f":"COUNTIFS(Jogos!$E:$E,$A88,Jogos!$N:$N,\"V\")+COUNTIFS(Jogos!$I:$I,$A88,Jogos!$O:$O,\"V\")","v":4},{"$f":"COUNTIFS(Jogos!$E:$E,$A88,Jogos!$N:$N,\"E\")+COUNTIFS(Jogos!$I:$I,$A88,Jogos!$O:$O,\"E\")","v":0},{"$f":"COUNTIFS(Jogos!$E:$E,$A88,Jogos!$N:$N,\"D\")+COUNTIFS(Jogos!$I:$I,$A88,Jogos!$O:$O,\"D\")","v":5},{"$f":"SUMIFS(Jogos!$F:$F,Jogos!$E:$E,$A88)+SUMIFS(Jogos!$H:$H,Jogos!$I:$I,$A88)","v":16},{"$f":"SUMIFS(Jogos!$H:$H,Jogos!$E:$E,$A88)+SUMIFS(Jogos!$F:$F,Jogos!$I:$I,$A88)+COUNTIFS(Jogos!$S:$S,\"WWIND\",Jogos!$E:$E,$A88)*2+COUNTIFS(Jogos!$S:$S,\"WWIND\",Jogos!$I:$I,$A88)*2","v":17},-1,9,{"v":0.4444444444444444,"d":"44.4%"},{"$f":"INDEX(ClaFIN!B:C,MATCH(B88,ClaFIN!C:C,0),1)","v":{"v":15,"d":"15º"}}]
["Vanderley da Silva","CHACAL [B]",0,{"$f":"COUNTIFS(Jogos!$E:$E,$A89,Jogos!$N:$N,\"V\")+COUNTIFS(Jogos!$I:$I,$A89,Jogos!$O:$O,\"V\")","v":0},{"$f":"COUNTIFS(Jogos!$E:$E,$A89,Jogos!$N:$N,\"E\")+COUNTIFS(Jogos!$I:$I,$A89,Jogos!$O:$O,\"E\")","v":0},{"$f":"COUNTIFS(Jogos!$E:$E,$A89,Jogos!$N:$N,\"D\")+COUNTIFS(Jogos!$I:$I,$A89,Jogos!$O:$O,\"D\")","v":3},{"$f":"SUMIFS(Jogos!$F:$F,Jogos!$E:$E,$A89)+SUMIFS(Jogos!$H:$H,Jogos!$I:$I,$A89)","v":0},{"$f":"SUMIFS(Jogos!$H:$H,Jogos!$E:$E,$A89)+SUMIFS(Jogos!$F:$F,Jogos!$I:$I,$A89)+COUNTIFS(Jogos!$S:$S,\"WWIND\",Jogos!$E:$E,$A89)*2+COUNTIFS(Jogos!$S:$S,\"WWIND\",Jogos!$I:$I,$A89)*2","v":12},-12,3,{"v":0,"d":"0.0%"},{"$f":"INDEX(ClaFIN!B:C,MATCH(B89,ClaFIN!C:C,0),1)","v":{"v":17,"d":"17º"}}]
["Wendel Cordeiro","LIBERDADE [A]",2,{"$f":"COUNTIFS(Jogos!$E:$E,$A90,Jogos!$N:$N,\"V\")+COUNTIFS(Jogos!$I:$I,$A90,Jogos!$O:$O,\"V\")","v":0},{"$f":"COUNTIFS(Jogos!$E:$E,$A90,Jogos!$N:$N,\"E\")+COUNTIFS(Jogos!$I:$I,$A90,Jogos!$O:$O,\"E\")","v":2},{"$f":"COUNTIFS(Jogos!$E:$E,$A90,Jogos!$N:$N,\"D\")+COUNTIFS(Jogos!$I:$I,$A90,Jogos!$O:$O,\"D\")","v":1},{"$f":"SUMIFS(Jogos!$F:$F,Jogos!$E:$E,$A90)+SUMIFS(Jogos!$H:$H,Jogos!$I:$I,$A90)","v":1},{"$f":"SUMIFS(Jogos!$H:$H,Jogos!$E:$E,$A90)+SUMIFS(Jogos!$F:$F,Jogos!$I:$I,$A90)+COUNTIFS(Jogos!$S:$S,\"WWIND\",Jogos!$E:$E,$A90)*2+COUNTIFS(Jogos!$S:$S,\"WWIND\",Jogos!$I:$I,$A90)*2","v":3},-2,3,{"v":0.2222222222222222,"d":"22.2%"},{"$f":"INDEX(ClaFIN!B:C,MATCH(B90,ClaFIN!C:C,0),1)","v":{"v":1,"d":"1º"}}]