{"text_format":"3","workbook":"xlsx","n_sheets":9,"sheets":["Capa","Info","Clubes Participantes","Tecnicos Participantes","Jogos","ClaFIN","ClaOUR","ClaPRA","ClaIND"],"not_rendered":{"images":2,"macros":1,"defined_names":19},"read":"whole","date_system":"1900"}

{"sheet":"Capa","index":0,"n_rows":49,"n_cols":4,"rows_kept":49,"merged":[[37,0,43,5],[44,0,45,2],[44,3,45,5],[48,0,49,4]]}
{"$rows_empty":37}
[{"$f":"\"BRASILEIRO INTERCLUBES\"&+CHAR(10)&+YEAR(Jogos!C6)","v":"BRASILEIRO INTERCLUBES\n2022"}]
[]
[]
[]
[]
[]
[]
{"$rows_left_out":6}
{"sheet":"Info","index":1,"n_rows":73,"n_cols":34,"rows_kept":73,"merged":[[5,10,5,15],[5,16,5,21],[5,25,5,35],[6,10,6,12],[6,13,6,15],[6,16,6,18],[6,19,6,21],[6,33,6,35],[7,10,7,12],[7,13,7,15],[7,16,7,18],[7,19,7,21],[7,33,7,35],[8,10,8,12],[8,13,8,15],[8,16,8,18],[8,19,8,21],[9,10,9,12],[9,13,9,15],[9,16,9,18],[9,19,9,21],[9,33,9,35],[10,10,10,12],[10,13,10,15],[10,16,10,18],[10,19,10,21],[10,33,10,35],[11,10,11,12],[11,13,11,15],[11,16,11,18],[11,19,11,21],[11,33,11,35],[12,10,12,12],[12,13,12,15],[12,16,12,18],[12,19,12,21],[16,0,37,0],[16,11,16,15],[16,17,16,19],[16,22,16,24],[17,2,21,36],[23,12,24,14],[25,17,26,19],[27,2,28,4],[27,7,28,9],[27,12,28,14],[29,22,30,24],[31,2,32,4],[31,7,32,9],[31,12,32,14],[33,17,34,19],[35,12,36,14],[39,0,56,0],[39,12,39,14],[39,17,39,19],[40,7,44,36],[46,7,47,9],[48,12,49,14],[50,7,51,9],[50,17,51,19],[52,12,53,14],[54,7,55,9],[69,0,69,36],[70,0,70,36]]}
[{"$f":"\"XL CAMPEONATO BRASILEIRO INTERCLUBES / \"&+RIGHT(A2,4)","v":"XL CAMPEONATO BRASILEIRO INTERCLUBES / 2022"}]
[{"$f":"Capa!A45&+\", \"&+Capa!D45","v":"Matias Barbosa / MG, 15 a 17 de abril de 2022"}]
[]
["ESTATISTICAS:"]
[]
[{"$nulls":10},"EQUIPES",{"$nulls":5},"INDIVIDUAIS",{"$nulls":8},"PARTICIPANTES"]
[null,"JOGOS",{"$nulls":8},{"$f":"SUM(K8:K13)","v":79},null,null,{"$f":"IF(K7=MAX(Jogos!A:A),\"\",\"erro\")","v":""},null,null,{"$f":"SUM(Q8:Q13)","v":316},null,null,{"$f":"IF(Q7=MAX(Jogos!B:B),\"\",\"erro\")&+IF(Q7-Q13=ClaIND!W3,\"\",\"erro\")","v":""},{"$nulls":5},"CLUBES/EQUIPES",{"$nulls":7},{"$f":"COUNTA('Clubes Participantes'!B:B)-1","v":17}]
[null,null,"VITÓRIAS|DERROTAS",{"$nulls":7},{"$f":"COUNTIFS(Jogos!A:A,\">0\",Jogos!N:N,\"V\")+COUNTIFS(Jogos!A:A,\">0\",Jogos!N:N,\"D\")-K10-K13","v":70},null,null,{"$f":"K8/$K$7","v":{"v":0.8860759493670886,"d":"89%"}},null,null,{"$f":"COUNTIFS(Jogos!B:B,\">0\",Jogos!N:N,\"V\")+COUNTIFS(Jogos!B:B,\">0\",Jogos!N:N,\"D\")-Q10-Q13","v":232},null,null,{"$f":"Q8/$Q$7","v":{"v":0.7341772151898734,"d":"73%"}},{"$nulls":5},"BOTONISTAS",{"$nulls":7},{"$f":"COUNTA('Tecnicos Participantes'!A:A)-3","v":85}]
{"$rows_left_out":66}
{"sheet":"Clubes Participantes","index":2,"n_rows":21,"n_cols":2,"rows_kept":21}
[{"$f":"Info!A1","v":"XL CAMPEONATO BRASILEIRO INTERCLUBES / 2022"}]
[{"$f":"Info!A2","v":"Matias Barbosa / MG, 15 a 17 de abril de 2022"}]
[]
["CLUBE","CIDADE / UF"]
["AABB/ACAFUMA [A]","Brasilia / DF"]
["AABB/ACAFUMA [B]","Brasilia / DF"]
["AABB/ACAFUMA [C]","Brasilia / DF"]
["BOTAFOGO","Rio de Janeiro / RJ"]
{"$rows_left_out":14}
{"sheet":"Tecnicos Participantes","index":3,"n_rows":89,"n_cols":2,"rows_kept":89}
[{"$f":"Info!A1","v":"XL CAMPEONATO BRASILEIRO INTERCLUBES / 2022"}]
[{"$f":"Info!A2","v":"Matias Barbosa / MG, 15 a 17 de abril de 2022"}]
[]
["BOTONISTA","CLUBE"]
["Adolpho Parente","AABB/ACAFUMA [B]"]
["Ailson Brites \"Jucao\"","MATIAS [B]"]
["Alcides Figueira","AABB/ACAFUMA [B]"]
["Alex Lage","ELDORADO"]
{"$rows_left_out":82}
{"sheet":"Jogos","index":4,"n_rows":400,"n_cols":26,"rows_kept":400,"merged":[[2,10,2,13],[2,14,2,17],[2,18,3,18],[3,24,3,25]]}
[{"$f":"Info!A1","v":"XL CAMPEONATO BRASILEIRO INTERCLUBES / 2022"}]
[{"$f":"Info!A2","v":"Matias Barbosa / MG, 15 a 17 de abril de 2022"},{"$nulls":19},"↓ selecione a EQUIPE ou BOTONISTA ↓"]
[{"$nulls":10},"MANDANTE",{"$nulls":3},"VISITANTE",{"$nulls":3},"WO|WW",{"$nulls":3},"←←←←←←←←←←←←←",{"$f":"IFERROR(VLOOKUP(U3,Y:Z,2,FALSE),\"--\")","v":"--"}]
["JG.CLU","JG.IND","DATA","GRUPO","PARTIDA",{"$nulls":5},"PG","GP","GPI","V|E|D",null,"GPI","GP","PG",null,null,"JOGOS DA EQUIPE ou BOTONISTA",null,"MANDANTE","VISITANTE","EQUIPE ou BOTONISTA"]
[]
[{"v":1,"d":"001"},null,"2022-04-15",{"v":2,"d":"02"},"AABB/ACAFUMA [B]",1,"x",2,"MATIAS [A]",null,{"$f":"IF(N6=\"V\",3,IF(N6=\"E\",1,0))","v":0},{"$f":"F6","v":1},{"$f":"SUM(M7:M10)","v":2},{"$f":"IF(F6&+H6=\"WW\",\"D\",IF(F6>H6,\"V\",IF(F6=H6,\"E\",\"D\")))","v":"D"},{"$f":"IF(F6&+H6=\"WW\",\"D\",IF(F6<H6,\"V\",IF(F6=H6,\"E\",\"D\")))","v":"V"},{"$f":"SUM(P7:P10)","v":4},{"$f":"H6","v":2},{"$f":"IF(O6=\"V\",3,IF(O6=\"E\",1,0))","v":3},{"$f":"IF(LEFT(E6,7)=\"\",\"AUS\"&+IF(B6>0,\"IND\",\"\"),IF(LEFT(I6,7)=\"\",\"AUS\"&+IF(B6>0,\"IND\",\"\"),IF(LEFT(E6,7)=\"Ausente\",\"AUS\"&+IF(B6>0,\"IND\",\"\"),IF(LEFT(I6,7)=\"Ausente\",\"AUS\"&+IF(B6>0,\"IND\",\"\"),IF(RIGHT(F6,1)=\"*\",\"NULO\"&+IF(B6>0,\"IND\",\"\"),IF(F6&H6=\"----\",\"NULO\"&+IF(B6>0,\"IND\",\"\"),IF(F6&H6=\"W0\",\"W0\"&+IF(B6>0,\"IND\",\"\"),IF(F6&H6=\"0W\",\"W0\"&+IF(B6>0,\"IND\",\"\"),IF(F6&H6=\"WW\",\"WW\"&+IF(B6>0,\"IND\",\"\"),\"--\")))))))))","v":"--"},null,{"$f":"IF($X$3=\"BOTONISTA\",(IF($U$3=E6,$U$3,IF($U$3=I6,$U$3,\"--\"))),IF($X$3=\"EQUIPE\",(IF($U$3=W6,$U$3,IF($U$3=X6,$U$3,\"--\"))),\"--\"))","v":"--"},null,{"$f":"E6","v":"AABB/ACAFUMA [B]"},{"$f":"I6","v":"MATIAS [A]"},"LIBERDADE [A]",{"$f":"IF(LEFT(Y6,7)=\"AUSENTE\",\"EQUIPE\",IF(IFERROR(VLOOKUP(Y6,'Clubes Participantes'!A:B,1,FALSE),\"BOTONISTA\")=\"BOTONISTA\",\"BOTONISTA\",\"EQUIPE\"))","v":"EQUIPE"}]
[null,{"v":1,"d":"001"},null,null,"Adolpho Parente",1,"x",0,"Jose Lessa",{"$nulls":3},{"$f":"IF(F7&H7=\"WW\",0,IF(F7&H7=\"W0\",2,F7))","v":1},{"$f":"IF(F7&+H7=\"WW\",\"D\",IF(F7>H7,\"V\",IF(F7=H7,\"E\",\"D\")))","v":"V"},{"$f":"IF(F7&+H7=\"WW\",\"D\",IF(F7<H7,\"V\",IF(F7=H7,\"E\",\"D\")))","v":"D"},{"$f":"IF(F7&H7=\"WW\",0,IF(F7&H7=\"0W\",2,H7))","v":0},null,null,{"$f":"IF(LEFT(E7,7)=\"\",\"AUS\"&+IF(B7>0,\"IND\",\"\"),IF(LEFT(I7,7)=\"\",\"AUS\"&+IF(B7>0,\"IND\",\"\"),IF(LEFT(E7,7)=\"Ausente\",\"AUS\"&+IF(B7>0,\"IND\",\"\"),IF(LEFT(I7,7)=\"Ausente\",\"AUS\"&+IF(B7>0,\"IND\",\"\"),IF(RIGHT(F7,1)=\"*\",\"NULO\"&+IF(B7>0,\"IND\",\"\"),IF(F7&H7=\"----\",\"NULO\"&+IF(B7>0,\"IND\",\"\"),IF(F7&H7=\"W0\",\"W0\"&+IF(B7>0,\"IND\",\"\"),IF(F7&H7=\"0W\",\"W0\"&+IF(B7>0,\"IND\",\"\"),IF(F7&H7=\"WW\",\"WW\"&+IF(B7>0,\"IND\",\"\"),\"--\")))))))))","v":"--"},null,"--",null,{"$f":"W6","v":"AABB/ACAFUMA [B]"},{"$f":"X6","v":"MATIAS [A]"},"Breno Ribeiro",{"$f":"IF(LEFT(Y7,7)=\"AUSENTE\",\"EQUIPE\",IF(IFERROR(VLOOKUP(Y7,'Clubes Participantes'!A:B,1,FALSE),\"BOTONISTA\")=\"BOTONISTA\",\"BOTONISTA\",\"EQUIPE\"))","v":"BOTONISTA"}]
[null,{"v":2,"d":"002"},null,null,"Paulo Cesar Faria",0,"x",0,"Marcelo Henrique",{"$nulls":3},{"$f":"IF(F8&H8=\"WW\",0,IF(F8&H8=\"W0\",2,F8))","v":0},"E","E",{"$f":"IF(F8&H8=\"WW\",0,IF(F8&H8=\"0W\",2,H8))","v":0},null,null,"--",null,"--",null,{"$f":"W6","v":"AABB/ACAFUMA [B]"},"MATIAS [A]","Carlos Henrique Garcia",{"$f":"IF(LEFT(Y8,7)=\"AUSENTE\",\"EQUIPE\",IF(IFERROR(VLOOKUP(Y8,'Clubes Participantes'!A:B,1,FALSE),\"BOTONISTA\")=\"BOTONISTA\",\"BOTONISTA\",\"EQUIPE\"))","v":"BOTONISTA"}]
{"$rows_left_out":393}
{"sheet":"ClaFIN","index":5,"n_rows":106,"n_cols":15,"rows_kept":106,"merged":[[4,0,61,0],[62,0,105,0]]}
[{"$f":"Info!A1","v":"XL CAMPEONATO BRASILEIRO INTERCLUBES / 2022"}]
[{"$f":"Info!A2","v":"Matias Barbosa / MG, 15 a 17 de abril de 2022"}]
[]
["CLASSIFICAÇÃO FINAL",null,null,"PG","V","E","D","GP","GC","SG","GPI","GCI","SGI","J","REND"]
["TAÇA DE OURO ",{"v":1,"d":"1º"},"LIBERDADE [A]",{"$f":"SUMIFS(ClaOUR!D:D,ClaOUR!$C:$C,$C5)+SUMIFS(ClaPRA!D:D,ClaPRA!$C:$C,$C5)","v":28},{"$f":"SUMIFS(ClaOUR!E:E,ClaOUR!$C:$C,$C5)+SUMIFS(ClaPRA!E:E,ClaPRA!$C:$C,$C5)","v":9},{"$f":"SUMIFS(ClaOUR!F:F,ClaOUR!$C:$C,$C5)+SUMIFS(ClaPRA!F:F,ClaPRA!$C:$C,$C5)","v":1},{"$f":"SUMIFS(ClaOUR!G:G,ClaOUR!$C:$C,$C5)+SUMIFS(ClaPRA!G:G,ClaPRA!$C:$C,$C5)","v":0},{"$f":"SUMIFS(ClaOUR!H:H,ClaOUR!$C:$C,$C5)+SUMIFS(ClaPRA!H:H,ClaPRA!$C:$C,$C5)","v":25},{"$f":"SUMIFS(ClaOUR!I:I,ClaOUR!$C:$C,$C5)+SUMIFS(ClaPRA!I:I,ClaPRA!$C:$C,$C5)","v":6},{"$f":"SUMIFS(ClaOUR!J:J,ClaOUR!$C:$C,$C5)+SUMIFS(ClaPRA!J:J,ClaPRA!$C:$C,$C5)","v":19},{"$f":"SUMIFS(ClaOUR!K:K,ClaOUR!$C:$C,$C5)+SUMIFS(ClaPRA!K:K,ClaPRA!$C:$C,$C5)","v":62},{"$f":"SUMIFS(ClaOUR!L:L,ClaOUR!$C:$C,$C5)+SUMIFS(ClaPRA!L:L,ClaPRA!$C:$C,$C5)","v":28},{"$f":"SUMIFS(ClaOUR!M:M,ClaOUR!$C:$C,$C5)+SUMIFS(ClaPRA!M:M,ClaPRA!$C:$C,$C5)","v":34},{"$f":"SUM(E5:G5)","v":10},{"$f":"D5/(N5*3)","v":{"v":0.9333333333333333,"d":"93.3%"}}]
[null,null,"Breno Ribeiro",{"$f":"IF(N6=0,-0.001,E6*3+F6)","v":20},{"$f":"COUNTIFS(Jogos!$E:$E,$C6,Jogos!$N:$N,\"V\")+COUNTIFS(Jogos!$I:$I,$C6,Jogos!$O:$O,\"V\")","v":6},{"$f":"COUNTIFS(Jogos!$E:$E,$C6,Jogos!$N:$N,\"E\")+COUNTIFS(Jogos!$I:$I,$C6,Jogos!$O:$O,\"E\")","v":2},{"$f":"COUNTIFS(Jogos!$E:$E,$C6,Jogos!$N:$N,\"D\")+COUNTIFS(Jogos!$I:$I,$C6,Jogos!$O:$O,\"D\")","v":2},{"$f":"SUMIFS(Jogos!$F:$F,Jogos!$E:$E,$C6)+SUMIFS(Jogos!$H:$H,Jogos!$I:$I,$C6)","v":13},{"$f":"SUMIFS(Jogos!$H:$H,Jogos!$E:$E,$C6)+SUMIFS(Jogos!$F:$F,Jogos!$I:$I,$C6)+COUNTIFS(Jogos!$S:$S,\"WWIND\",Jogos!$E:$E,$C6)*2+COUNTIFS(Jogos!$S:$S,\"WWIND\",Jogos!$I:$I,$C6)*2","v":7},{"$f":"H6-I6","v":6},{"$nulls":3},10,{"$f":"IF(N6=0,-0.00001,D6/(N6*3))","v":{"v":0.6666666666666666,"d":"66.7%"}}]
[null,null,"Carlos Henrique Garcia",{"$f":"IF(N7=0,-0.001,E7*3+F7)","v":20},{"$f":"COUNTIFS(Jogos!$E:$E,$C7,Jogos!$N:$N,\"V\")+COUNTIFS(Jogos!$I:$I,$C7,Jogos!$O:$O,\"V\")","v":6},{"$f":"COUNTIFS(Jogos!$E:$E,$C7,Jogos!$N:$N,\"E\")+COUNTIFS(Jogos!$I:$I,$C7,Jogos!$O:$O,\"E\")","v":2},{"$f":"COUNTIFS(Jogos!$E:$E,$C7,Jogos!$N:$N,\"D\")+COUNTIFS(Jogos!$I:$I,$C7,Jogos!$O:$O,\"D\")","v":2},{"$f":"SUMIFS(Jogos!$F:$F,Jogos!$E:$E,$C7)+SUMIFS(Jogos!$H:$H,Jogos!$I:$I,$C7)","v":19},{"$f":"SUMIFS(Jogos!$H:$H,Jogos!$E:$E,$C7)+SUMIFS(Jogos!$F:$F,Jogos!$I:$I,$C7)+COUNTIFS(Jogos!$S:$S,\"WWIND\",Jogos!$E:$E,$C7)*2+COUNTIFS(Jogos!$S:$S,\"WWIND\",Jogos!$I:$I,$C7)*2","v":7},{"$f":"H7-I7","v":12},{"$nulls":3},10,{"$f":"IF(N7=0,-0.00001,D7/(N7*3))","v":{"v":0.6666666666666666,"d":"66.7%"}}]
[null,null,"Leonardo Duguet",{"$f":"IF(N8=0,-0.001,E8*3+F8)","v":19},{"$f":"COUNTIFS(Jogos!$E:$E,$C8,Jogos!$N:$N,\"V\")+COUNTIFS(Jogos!$I:$I,$C8,Jogos!$O:$O,\"V\")","v":6},{"$f":"COUNTIFS(Jogos!$E:$E,$C8,Jogos!$N:$N,\"E\")+COUNTIFS(Jogos!$I:$I,$C8,Jogos!$O:$O,\"E\")","v":1},{"$f":"COUNTIFS(Jogos!$E:$E,$C8,Jogos!$N:$N,\"D\")+COUNTIFS(Jogos!$I:$I,$C8,Jogos!$O:$O,\"D\")","v":1},{"$f":"SUMIFS(Jogos!$F:$F,Jogos!$E:$E,$C8)+SUMIFS(Jogos!$H:$H,Jogos!$I:$I,$C8)","v":10},{"$f":"SUMIFS(Jogos!$H:$H,Jogos!$E:$E,$C8)+SUMIFS(Jogos!$F:$F,Jogos!$I:$I,$C8)+COUNTIFS(Jogos!$S:$S,\"WWIND\",Jogos!$E:$E,$C8)*2+COUNTIFS(Jogos!$S:$S,\"WWIND\",Jogos!$I:$I,$C8)*2","v":5},{"$f":"H8-I8","v":5},{"$nulls":3},8,{"$f":"IF(N8=0,-0.00001,D8/(N8*3))","v":{"v":0.7916666666666666,"d":"79.2%"}}]
{"$rows_left_out":99}
{"sheet":"ClaOUR","index":6,"n_rows":52,"n_cols":14,"rows_kept":52}
[{"$f":"ClaFIN!A1","v":"XL CAMPEONATO BRASILEIRO INTERCLUBES / 2022"}]
[{"$f":"ClaFIN!A2","v":"Matias Barbosa / MG, 15 a 17 de abril de 2022"}]
[]
["TAÇA DE OURO",null,null,"PG","V","E","D","GP","GC","SG","GPI","GCI","SGI","J"]
["PRIMEIRA FASE"]
[{"v":1,"d":"01"},{"v":1,"d":"1º"},"TUPI [A]",{"$f":"E6*3+F6","v":24},{"$f":"COUNTIFS(Jogos!$N:$N,\"V\",Jogos!$D:$D,$A6,Jogos!$E:$E,$C6)+COUNTIFS(Jogos!$O:$O,\"V\",Jogos!$D:$D,$A6,Jogos!$I:$I,$C6)","v":8},{"$f":"COUNTIFS(Jogos!$N:$N,\"E\",Jogos!$D:$D,$A6,Jogos!$E:$E,$C6)+COUNTIFS(Jogos!$O:$O,\"E\",Jogos!$D:$D,$A6,Jogos!$I:$I,$C6)","v":0},{"$f":"COUNTIFS(Jogos!$N:$N,\"D\",Jogos!$D:$D,$A6,Jogos!$E:$E,$C6)+COUNTIFS(Jogos!$O:$O,\"D\",Jogos!$D:$D,$A6,Jogos!$I:$I,$C6)","v":0},{"$f":"SUMIFS(Jogos!$L:$L,Jogos!$D:$D,$A6,Jogos!$E:$E,$C6)+SUMIFS(Jogos!$Q:$Q,Jogos!$D:$D,$A6,Jogos!$I:$I,$C6)","v":21},{"$f":"SUMIFS(Jogos!$Q:$Q,Jogos!$D:$D,$A6,Jogos!$E:$E,$C6)+SUMIFS(Jogos!$L:$L,Jogos!$D:$D,$A6,Jogos!$I:$I,$C6)","v":2},{"$f":"H6-I6","v":19},{"$f":"SUMIFS(Jogos!$M:$M,Jogos!$D:$D,$A6,Jogos!$E:$E,$C6)+SUMIFS(Jogos!$P:$P,Jogos!$D:$D,$A6,Jogos!$I:$I,$C6)","v":57},{"$f":"SUMIFS(Jogos!$P:$P,Jogos!$D:$D,$A6,Jogos!$E:$E,$C6)+SUMIFS(Jogos!$M:$M,Jogos!$D:$D,$A6,Jogos!$I:$I,$C6)","v":22},{"$f":"K6-L6","v":35},{"$f":"SUM(E6:G6)","v":8}]
[{"v":1,"d":"01"},{"v":2,"d":"2º"},"BOTAFOGO",16,{"$f":"COUNTIFS(Jogos!$N:$N,\"V\",Jogos!$D:$D,$A7,Jogos!$E:$E,$C7)+COUNTIFS(Jogos!$O:$O,\"V\",Jogos!$D:$D,$A7,Jogos!$I:$I,$C7)","v":5},{"$f":"COUNTIFS(Jogos!$N:$N,\"E\",Jogos!$D:$D,$A7,Jogos!$E:$E,$C7)+COUNTIFS(Jogos!$O:$O,\"E\",Jogos!$D:$D,$A7,Jogos!$I:$I,$C7)","v":1},{"$f":"COUNTIFS(Jogos!$N:$N,\"D\",Jogos!$D:$D,$A7,Jogos!$E:$E,$C7)+COUNTIFS(Jogos!$O:$O,\"D\",Jogos!$D:$D,$A7,Jogos!$I:$I,$C7)","v":2},{"$f":"SUMIFS(Jogos!$L:$L,Jogos!$D:$D,$A7,Jogos!$E:$E,$C7)+SUMIFS(Jogos!$Q:$Q,Jogos!$D:$D,$A7,Jogos!$I:$I,$C7)","v":17},{"$f":"SUMIFS(Jogos!$Q:$Q,Jogos!$D:$D,$A7,Jogos!$E:$E,$C7)+SUMIFS(Jogos!$L:$L,Jogos!$D:$D,$A7,Jogos!$I:$I,$C7)","v":7},10,{"$f":"SUMIFS(Jogos!$M:$M,Jogos!$D:$D,$A7,Jogos!$E:$E,$C7)+SUMIFS(Jogos!$P:$P,Jogos!$D:$D,$A7,Jogos!$I:$I,$C7)","v":41},{"$f":"SUMIFS(Jogos!$P:$P,Jogos!$D:$D,$A7,Jogos!$E:$E,$C7)+SUMIFS(Jogos!$M:$M,Jogos!$D:$D,$A7,Jogos!$I:$I,$C7)","v":24},17,8]
[{"v":1,"d":"01"},{"v":3,"d":"3º"},"LIBERDADE [B]",15,{"$f":"COUNTIFS(Jogos!$N:$N,\"V\",Jogos!$D:$D,$A8,Jogos!$E:$E,$C8)+COUNTIFS(Jogos!$O:$O,\"V\",Jogos!$D:$D,$A8,Jogos!$I:$I,$C8)","v":5},{"$f":"COUNTIFS(Jogos!$N:$N,\"E\",Jogos!$D:$D,$A8,Jogos!$E:$E,$C8)+COUNTIFS(Jogos!$O:$O,\"E\",Jogos!$D:$D,$A8,Jogos!$I:$I,$C8)","v":0},{"$f":"COUNTIFS(Jogos!$N:$N,\"D\",Jogos!$D:$D,$A8,Jogos!$E:$E,$C8)+COUNTIFS(Jogos!$O:$O,\"D\",Jogos!$D:$D,$A8,Jogos!$I:$I,$C8)","v":3},{"$f":"SUMIFS(Jogos!$L:$L,Jogos!$D:$D,$A8,Jogos!$E:$E,$C8)+SUMIFS(Jogos!$Q:$Q,Jogos!$D:$D,$A8,Jogos!$I:$I,$C8)","v":13},{"$f":"SUMIFS(Jogos!$Q:$Q,Jogos!$D:$D,$A8,Jogos!$E:$E,$C8)+SUMIFS(Jogos!$L:$L,Jogos!$D:$D,$A8,Jogos!$I:$I,$C8)","v":11},2,{"$f":"SUMIFS(Jogos!$M:$M,Jogos!$D:$D,$A8,Jogos!$E:$E,$C8)+SUMIFS(Jogos!$P:$P,Jogos!$D:$D,$A8,Jogos!$I:$I,$C8)","v":34},{"$f":"SUMIFS(Jogos!$P:$P,Jogos!$D:$D,$A8,Jogos!$E:$E,$C8)+SUMIFS(Jogos!$M:$M,Jogos!$D:$D,$A8,Jogos!$I:$I,$C8)","v":28},6,8]
{"$rows_left_out":45}
{"sheet":"ClaPRA","index":7,"n_rows":23,"n_cols":14,"rows_kept":23}
[{"$f":"ClaFIN!A1","v":"XL CAMPEONATO BRASILEIRO INTERCLUBES / 2022"}]
[{"$f":"ClaFIN!A2","v":"Matias Barbosa / MG, 15 a 17 de abril de 2022"}]
[]
["TAÇA DE PRATA",null,null,"PG","V","E","D","GP","GC","SG","GPI","GCI","SGI","J"]
["PRIMEIRA FASE"]
["TP.01",{"v":1,"d":"1º"},"ELDORADO",{"$f":"E6*3+F6","v":3},{"$f":"COUNTIFS(Jogos!$N:$N,\"V\",Jogos!$D:$D,$A6,Jogos!$E:$E,$C6)+COUNTIFS(Jogos!$O:$O,\"V\",Jogos!$D:$D,$A6,Jogos!$I:$I,$C6)","v":1},{"$f":"COUNTIFS(Jogos!$N:$N,\"E\",Jogos!$D:$D,$A6,Jogos!$E:$E,$C6)+COUNTIFS(Jogos!$O:$O,\"E\",Jogos!$D:$D,$A6,Jogos!$I:$I,$C6)","v":0},{"$f":"COUNTIFS(Jogos!$N:$N,\"D\",Jogos!$D:$D,$A6,Jogos!$E:$E,$C6)+COUNTIFS(Jogos!$O:$O,\"D\",Jogos!$D:$D,$A6,Jogos!$I:$I,$C6)","v":0},{"$f":"SUMIFS(Jogos!$L:$L,Jogos!$D:$D,$A6,Jogos!$E:$E,$C6)+SUMIFS(Jogos!$Q:$Q,Jogos!$D:$D,$A6,Jogos!$I:$I,$C6)","v":2},{"$f":"SUMIFS(Jogos!$Q:$Q,Jogos!$D:$D,$A6,Jogos!$E:$E,$C6)+SUMIFS(Jogos!$L:$L,Jogos!$D:$D,$A6,Jogos!$I:$I,$C6)","v":0},{"$f":"H6-I6","v":2},{"$f":"SUMIFS(Jogos!$M:$M,Jogos!$D:$D,$A6,Jogos!$E:$E,$C6)+SUMIFS(Jogos!$P:$P,Jogos!$D:$D,$A6,Jogos!$I:$I,$C6)","v":6},{"$f":"SUMIFS(Jogos!$P:$P,Jogos!$D:$D,$A6,Jogos!$E:$E,$C6)+SUMIFS(Jogos!$M:$M,Jogos!$D:$D,$A6,Jogos!$I:$I,$C6)","v":1},{"$f":"K6-L6","v":5},{"$f":"SUM(E6:G6)","v":1}]
["TP.01",{"v":2,"d":"2º"},"MATIAS [B]",0,{"$f":"COUNTIFS(Jogos!$N:$N,\"V\",Jogos!$D:$D,$A7,Jogos!$E:$E,$C7)+COUNTIFS(Jogos!$O:$O,\"V\",Jogos!$D:$D,$A7,Jogos!$I:$I,$C7)","v":0},{"$f":"COUNTIFS(Jogos!$N:$N,\"E\",Jogos!$D:$D,$A7,Jogos!$E:$E,$C7)+COUNTIFS(Jogos!$O:$O,\"E\",Jogos!$D:$D,$A7,Jogos!$I:$I,$C7)","v":0},{"$f":"COUNTIFS(Jogos!$N:$N,\"D\",Jogos!$D:$D,$A7,Jogos!$E:$E,$C7)+COUNTIFS(Jogos!$O:$O,\"D\",Jogos!$D:$D,$A7,Jogos!$I:$I,$C7)","v":1},{"$f":"SUMIFS(Jogos!$L:$L,Jogos!$D:$D,$A7,Jogos!$E:$E,$C7)+SUMIFS(Jogos!$Q:$Q,Jogos!$D:$D,$A7,Jogos!$I:$I,$C7)","v":0},{"$f":"SUMIFS(Jogos!$Q:$Q,Jogos!$D:$D,$A7,Jogos!$E:$E,$C7)+SUMIFS(Jogos!$L:$L,Jogos!$D:$D,$A7,Jogos!$I:$I,$C7)","v":2},-2,{"$f":"SUMIFS(Jogos!$M:$M,Jogos!$D:$D,$A7,Jogos!$E:$E,$C7)+SUMIFS(Jogos!$P:$P,Jogos!$D:$D,$A7,Jogos!$I:$I,$C7)","v":1},{"$f":"SUMIFS(Jogos!$P:$P,Jogos!$D:$D,$A7,Jogos!$E:$E,$C7)+SUMIFS(Jogos!$M:$M,Jogos!$D:$D,$A7,Jogos!$I:$I,$C7)","v":6},-5,1]
["TP.02",{"v":1,"d":"1º"},"CHACAL [A]",{"$f":"E8*3+F8","v":3},{"$f":"COUNTIFS(Jogos!$N:$N,\"V\",Jogos!$D:$D,$A8,Jogos!$E:$E,$C8)+COUNTIFS(Jogos!$O:$O,\"V\",Jogos!$D:$D,$A8,Jogos!$I:$I,$C8)","v":1},{"$f":"COUNTIFS(Jogos!$N:$N,\"E\",Jogos!$D:$D,$A8,Jogos!$E:$E,$C8)+COUNTIFS(Jogos!$O:$O,\"E\",Jogos!$D:$D,$A8,Jogos!$I:$I,$C8)","v":0},{"$f":"COUNTIFS(Jogos!$N:$N,\"D\",Jogos!$D:$D,$A8,Jogos!$E:$E,$C8)+COUNTIFS(Jogos!$O:$O,\"D\",Jogos!$D:$D,$A8,Jogos!$I:$I,$C8)","v":0},{"$f":"SUMIFS(Jogos!$L:$L,Jogos!$D:$D,$A8,Jogos!$E:$E,$C8)+SUMIFS(Jogos!$Q:$Q,Jogos!$D:$D,$A8,Jogos!$I:$I,$C8)","v":3},{"$f":"SUMIFS(Jogos!$Q:$Q,Jogos!$D:$D,$A8,Jogos!$E:$E,$C8)+SUMIFS(Jogos!$L:$L,Jogos!$D:$D,$A8,Jogos!$I:$I,$C8)","v":0},{"$f":"H8-I8","v":3},{"$f":"SUMIFS(Jogos!$M:$M,Jogos!$D:$D,$A8,Jogos!$E:$E,$C8)+SUMIFS(Jogos!$P:$P,Jogos!$D:$D,$A8,Jogos!$I:$I,$C8)","v":13},{"$f":"SUMIFS(Jogos!$P:$P,Jogos!$D:$D,$A8,Jogos!$E:$E,$C8)+SUMIFS(Jogos!$M:$M,Jogos!$D:$D,$A8,Jogos!$I:$I,$C8)","v":1},{"$f":"K8-L8","v":12},{"$f":"SUM(E8:G8)","v":1}]
{"$rows_left_out":16}
{"sheet":"ClaIND","index":8,"n_rows":90,"n_cols":23,"rows_kept":90,"merged":[[0,13,2,14]]}
[{"$f":"Info!A1","v":"XL CAMPEONATO BRASILEIRO INTERCLUBES / 2022"},{"$nulls":12},"linhas de conferencia  ",null,"PG","V","E","D","GP","GC","SG","J"]
[{"$f":"Info!A2","v":"Matias Barbosa / MG, 15 a 17 de abril de 2022"},{"$nulls":15},{"$f":"SUM(D6:D90)","v":232},168,232,692,692,0,632]
[{"$nulls":21},"total de jogos individuais",{"$f":"W2/2","v":316}]
["BOTONISTA","CLUBE","PG","V","E","D","GP","GC","SG","J","REND","POS"]
[]
["Adolpho Parente","AABB/ACAFUMA [B]",{"$f":"IF(J6=0,-0.001,D6*3+E6)","v":23},{"$f":"COUNTIFS(Jogos!$E:$E,$A6,Jogos!$N:$N,\"V\")+COUNTIFS(Jogos!$I:$I,$A6,Jogos!$O:$O,\"V\")","v":7},{"$f":"COUNTIFS(Jogos!$E:$E,$A6,Jogos!$N:$N,\"E\")+COUNTIFS(Jogos!$I:$I,$A6,Jogos!$O:$O,\"E\")","v":2},{"$f":"COUNTIFS(Jogos!$E:$E,$A6,Jogos!$N:$N,\"D\")+COUNTIFS(Jogos!$I:$I,$A6,Jogos!$O:$O,\"D\")","v":1},{"$f":"SUMIFS(Jogos!$F:$F,Jogos!$E:$E,$A6)+SUMIFS(Jogos!$H:$H,Jogos!$I:$I,$A6)","v":17},{"$f":"SUMIFS(Jogos!$H:$H,Jogos!$E:$E,$A6)+SUMIFS(Jogos!$F:$F,Jogos!$I:$I,$A6)+COUNTIFS(Jogos!$S:$S,\"WWIND\",Jogos!$E:$E,$A6)*2+COUNTIFS(Jogos!$S:$S,\"WWIND\",Jogos!$I:$I,$A6)*2","v":5},{"$f":"G6-H6","v":12},{"$f":"SUM(D6:F6)","v":10},{"$f":"IF(J6=0,-0.00001,C6/(J6*3))","v":{"v":0.7666666666666667,"d":"76.7%"}},{"$f":"INDEX(ClaFIN!B:C,MATCH(B6,ClaFIN!C:C,0),1)","v":{"v":11,"d":"11º"}}]
["Ailson Brites","MATIAS [B]",2,{"$f":"COUNTIFS(Jogos!$E:$E,$A7,Jogos!$N:$N,\"V\")+COUNTIFS(Jogos!$I:$I,$A7,Jogos!$O:$O,\"V\")","v":0},{"$f":"COUNTIFS(Jogos!$E:$E,$A7,Jogos!$N:$N,\"E\")+COUNTIFS(Jogos!$I:$I,$A7,Jogos!$O:$O,\"E\")","v":2},{"$f":"COUNTIFS(Jogos!$E:$E,$A7,Jogos!$N:$N,\"D\")+COUNTIFS(Jogos!$I:$I,$A7,Jogos!$O:$O,\"D\")","v":7},{"$f":"SUMIFS(Jogos!$F:$F,Jogos!$E:$E,$A7)+SUMIFS(Jogos!$H:$H,Jogos!$I:$I,$A7)","v":6},{"$f":"SUMIFS(Jogos!$H:$H,Jogos!$E:$E,$A7)+SUMIFS(Jogos!$F:$F,Jogos!$I:$I,$A7)+COUNTIFS(Jogos!$S:$S,\"WWIND\",Jogos!$E:$E,$A7)*2+COUNTIFS(Jogos!$S:$S,\"WWIND\",Jogos!$I:$I,$A7)*2","v":17},-11,9,{"v":0.07407407407407407,"d":"7.4%"},{"$f":"INDEX(ClaFIN!B:C,MATCH(B7,ClaFIN!C:C,0),1)","v":{"v":16,"d":"16º"}}]
["Alcides Figueira","AABB/ACAFUMA [B]",18,{"$f":"COUNTIFS(Jogos!$E:$E,$A8,Jogos!$N:$N,\"V\")+COUNTIFS(Jogos!$I:$I,$A8,Jogos!$O:$O,\"V\")","v":5},{"$f":"COUNTIFS(Jogos!$E:$E,$A8,Jogos!$N:$N,\"E\")+COUNTIFS(Jogos!$I:$I,$A8,Jogos!$O:$O,\"E\")","v":3},{"$f":"COUNTIFS(Jogos!$E:$E,$A8,Jogos!$N:$N,\"D\")+COUNTIFS(Jogos!$I:$I,$A8,Jogos!$O:$O,\"D\")","v":2},{"$f":"SUMIFS(Jogos!$F:$F,Jogos!$E:$E,$A8)+SUMIFS(Jogos!$H:$H,Jogos!$I:$I,$A8)","v":24},{"$f":"SUMIFS(Jogos!$H:$H,Jogos!$E:$E,$A8)+SUMIFS(Jogos!$F:$F,Jogos!$I:$I,$A8)+COUNTIFS(Jogos!$S:$S,\"WWIND\",Jogos!$E:$E,$A8)*2+COUNTIFS(Jogos!$S:$S,\"WWIND\",Jogos!$I:$I,$A8)*2","v":13},11,10,{"v":0.6,"d":"60.0%"},{"$f":"INDEX(ClaFIN!B:C,MATCH(B8,ClaFIN!C:C,0),1)","v":{"v":11,"d":"11º"}}]
{"$rows_left_out":82}