{"text_format":"3","workbook":"xlsx","n_sheets":9,"sheets":["A","B","C","D","E","F","Resumo","Classificação","Grupos Prox Fase"],"not_rendered":{"images":5,"macros":1,"external_links":1,"defined_names":13},"read":"whole","date_system":"1900"}

{"sheet":"A","index":0,"n_rows":53,"n_cols":40,"rows_kept":53,"merged":[[1,1,1,23],[2,1,2,23],[3,1,3,23],[5,1,5,11],[6,2,6,4],[6,8,6,10],[6,14,6,16],[6,20,6,22],[7,2,7,4],[7,8,7,10],[7,14,7,16],[7,20,7,22],[8,2,8,4],[8,8,8,10],[8,14,8,16],[8,20,8,22],[9,2,9,4],[9,8,9,10],[9,14,9,16],[9,20,9,22],[10,1,10,11],[10,13,10,23],[11,2,11,4],[11,8,11,10],[11,14,11,16],[11,20,11,22],[12,2,12,4],[12,8,12,10],[12,14,12,16],[12,20,12,22],[13,2,13,4],[13,8,13,10],[13,14,13,16],[13,20,13,22],[14,2,14,4],[14,8,14,10],[14,14,14,16],[14,20,14,22],[15,1,15,11],[15,13,15,23],[16,2,16,4],[16,8,16,10],[16,14,16,16],[16,20,16,22],[17,2,17,4],[17,8,17,10],[17,14,17,16],[17,20,17,22],[18,2,18,4],[18,8,18,10],[18,14,18,16],[18,20,18,22],[19,2,19,4],[19,8,19,10],[19,14,19,16],[19,20,19,22],[20,1,20,11],[20,13,20,23],[21,2,21,4],[21,8,21,10],[21,14,21,16],[21,20,21,22],[22,2,22,4],[22,8,22,10],[22,14,22,16],[22,20,22,22],[23,2,23,4],[23,8,23,10],[23,14,23,16],[23,20,23,22],[24,2,24,4],[24,8,24,10],[24,14,24,16],[24,20,24,22],[25,1,25,11],[25,13,25,23],[26,2,26,4],[26,8,26,10],[26,14,26,16],[26,20,26,22],[27,2,27,4],[27,8,27,10],[27,14,27,16],[27,20,27,22],[28,2,28,4],[28,8,28,10],[28,14,28,16],[28,20,28,22],[29,2,29,4],[29,8,29,10],[29,14,29,16],[29,20,29,22],[30,1,30,11],[30,13,30,23],[31,2,31,4],[31,8,31,10],[31,14,31,16],[31,20,31,22],[32,2,32,4],[32,8,32,10],[32,14,32,16],[32,20,32,22],[33,2,33,4],[33,8,33,10],[33,14,33,16],[33,20,33,22],[34,2,34,4],[34,8,34,10],[34,14,34,16],[34,20,34,22],[35,1,35,11],[36,2,36,4],[36,8,36,10],[37,2,37,4],[37,8,37,10],[38,2,38,4],[38,8,38,10],[39,2,39,4],[39,8,39,10],[43,1,43,13],[44,1,44,4]]}
[]
[]
[]
[]
[{"$nulls":30},3,1,1,0,null,null,3,1,1,0]
[null,"1ª RODADA",{"$nulls":10},"MESA",{"$nulls":17},"Vitórias","Empates","Empates","Derrotas",null,null,"Vitórias","Empates","Empates","Derrotas"]
[null,2,{"$f":"VLOOKUP(B7,$B$46:$C$53,2,0)","v":"WELLINGTON-ADDP"},null,null,4,"X",2,{"$f":"VLOOKUP(L7,$B$46:$C$53,2,0)","v":"B.MACHADO-BQ"},null,null,7,4,{"$nulls":17},{"$f":"IF(F7>H7,C7,IF(F7=H7,0,I7))","v":"WELLINGTON-ADDP"},{"$f":"(IF(F7<>\"-\",(IF(F7=H7,C7,0)),0))","v":0},{"$f":"(IF(F7<>\"-\",(IF(F7=H7,I7,0)),0))","v":0},{"$f":"IF(F7<H7,C7,IF(F7=H7,0,I7))","v":"B.MACHADO-BQ"},null,null,{"$f":"IF(R7>T7,O7,IF(R7=T7,0,U7))","v":0},{"$f":"(IF(R7<>\"-\",(IF(R7=T7,O7,0)),0))","v":0},{"$f":"(IF(R7<>\"-\",(IF(R7=T7,U7,0)),0))","v":0},{"$f":"IF(R7<T7,O7,IF(R7=T7,0,U7))","v":0}]
[null,3,{"$f":"VLOOKUP(B8,$B$46:$C$53,2,0)","v":"B. RAFAEL-SANTOS"},null,null,5,"X",3,{"$f":"VLOOKUP(L8,$B$46:$C$53,2,0)","v":"PAULINHO-BOT-DF"},null,null,6,5,{"$nulls":17},"B. RAFAEL-SANTOS",0,0,"PAULINHO-BOT-DF",null,null,0,0,0,0]
{"$rows_left_out":46}
{"sheet":"B","index":1,"n_rows":53,"n_cols":40,"rows_kept":53,"merged":[[1,1,1,23],[2,1,2,23],[3,1,3,23],[5,1,5,11],[6,2,6,4],[6,8,6,10],[6,14,6,16],[6,20,6,22],[7,2,7,4],[7,8,7,10],[7,14,7,16],[7,20,7,22],[8,2,8,4],[8,8,8,10],[8,14,8,16],[8,20,8,22],[9,2,9,4],[9,8,9,10],[9,14,9,16],[9,20,9,22],[10,1,10,11],[10,13,10,23],[11,2,11,4],[11,8,11,10],[11,14,11,16],[11,20,11,22],[12,2,12,4],[12,8,12,10],[12,14,12,16],[12,20,12,22],[13,2,13,4],[13,8,13,10],[13,14,13,16],[13,20,13,22],[14,2,14,4],[14,8,14,10],[14,14,14,16],[14,20,14,22],[15,1,15,11],[15,13,15,23],[16,2,16,4],[16,8,16,10],[16,14,16,16],[16,20,16,22],[17,2,17,4],[17,8,17,10],[17,14,17,16],[17,20,17,22],[18,2,18,4],[18,8,18,10],[18,14,18,16],[18,20,18,22],[19,2,19,4],[19,8,19,10],[19,14,19,16],[19,20,19,22],[20,1,20,11],[20,13,20,23],[21,2,21,4],[21,8,21,10],[21,14,21,16],[21,20,21,22],[22,2,22,4],[22,8,22,10],[22,14,22,16],[22,20,22,22],[23,2,23,4],[23,8,23,10],[23,14,23,16],[23,20,23,22],[24,2,24,4],[24,8,24,10],[24,14,24,16],[24,20,24,22],[25,1,25,11],[25,13,25,23],[26,2,26,4],[26,8,26,10],[26,14,26,16],[26,20,26,22],[27,2,27,4],[27,8,27,10],[27,14,27,16],[27,20,27,22],[28,2,28,4],[28,8,28,10],[28,14,28,16],[28,20,28,22],[29,2,29,4],[29,8,29,10],[29,14,29,16],[29,20,29,22],[30,1,30,11],[30,13,30,23],[31,2,31,4],[31,8,31,10],[31,14,31,16],[31,20,31,22],[32,2,32,4],[32,8,32,10],[32,14,32,16],[32,20,32,22],[33,2,33,4],[33,8,33,10],[33,14,33,16],[33,20,33,22],[34,2,34,4],[34,8,34,10],[34,14,34,16],[34,20,34,22],[35,1,35,11],[36,2,36,4],[36,8,36,10],[37,2,37,4],[37,8,37,10],[38,2,38,4],[38,8,38,10],[39,2,39,4],[39,8,39,10],[43,1,43,13],[44,1,44,4]]}
[]
[]
[]
[]
[{"$nulls":30},3,1,1,0,null,null,3,1,1,0]
[null,"1ª RODADA",{"$nulls":10},"MESA",{"$nulls":17},"Vitórias","Empates","Empates","Derrotas",null,null,"Vitórias","Empates","Empates","Derrotas"]
[null,1,{"$f":"VLOOKUP(B7,$B$46:$C$53,2,0)","v":"ROMAR-CRVG"},null,null,1,"X",0,{"$f":"VLOOKUP(L7,$B$46:$C$53,2,0)","v":"VAGO-W.O"},null,null,8,4,{"$nulls":17},{"$f":"IF(F7>H7,C7,IF(F7=H7,0,I7))","v":"ROMAR-CRVG"},{"$f":"(IF(F7<>\"-\",(IF(F7=H7,C7,0)),0))","v":0},{"$f":"(IF(F7<>\"-\",(IF(F7=H7,I7,0)),0))","v":0},{"$f":"IF(F7<H7,C7,IF(F7=H7,0,I7))","v":"VAGO-W.O"},null,null,{"$f":"IF(R7>T7,O7,IF(R7=T7,0,U7))","v":0},{"$f":"(IF(R7<>\"-\",(IF(R7=T7,O7,0)),0))","v":0},{"$f":"(IF(R7<>\"-\",(IF(R7=T7,U7,0)),0))","v":0},{"$f":"IF(R7<T7,O7,IF(R7=T7,0,U7))","v":0}]
[null,2,{"$f":"VLOOKUP(B8,$B$46:$C$53,2,0)","v":"LYAN-FFC"},null,null,2,"X",1,{"$f":"VLOOKUP(L8,$B$46:$C$53,2,0)","v":"P.CARUSO-AABB-DF"},null,null,7,5,{"$nulls":17},{"$f":"IF(F8>H8,C8,IF(F8=H8,0,I8))","v":"LYAN-FFC"},{"$f":"(IF(F8<>\"-\",(IF(F8=H8,C8,0)),0))","v":0},{"$f":"(IF(F8<>\"-\",(IF(F8=H8,I8,0)),0))","v":0},{"$f":"IF(F8<H8,C8,IF(F8=H8,0,I8))","v":"P.CARUSO-AABB-DF"},null,null,{"$f":"IF(R8>T8,O8,IF(R8=T8,0,U8))","v":0},{"$f":"(IF(R8<>\"-\",(IF(R8=T8,O8,0)),0))","v":0},{"$f":"(IF(R8<>\"-\",(IF(R8=T8,U8,0)),0))","v":0},{"$f":"IF(R8<T8,O8,IF(R8=T8,0,U8))","v":0}]
{"$rows_left_out":46}
{"sheet":"C","index":2,"n_rows":53,"n_cols":40,"rows_kept":53,"merged":[[1,1,1,23],[2,1,2,23],[3,1,3,23],[5,1,5,11],[6,2,6,4],[6,8,6,10],[6,14,6,16],[6,20,6,22],[7,2,7,4],[7,8,7,10],[7,14,7,16],[7,20,7,22],[8,2,8,4],[8,8,8,10],[8,14,8,16],[8,20,8,22],[9,2,9,4],[9,8,9,10],[9,14,9,16],[9,20,9,22],[10,1,10,11],[10,13,10,23],[11,2,11,4],[11,8,11,10],[11,14,11,16],[11,20,11,22],[12,2,12,4],[12,8,12,10],[12,14,12,16],[12,20,12,22],[13,2,13,4],[13,8,13,10],[13,14,13,16],[13,20,13,22],[14,2,14,4],[14,8,14,10],[14,14,14,16],[14,20,14,22],[15,1,15,11],[15,13,15,23],[16,2,16,4],[16,8,16,10],[16,14,16,16],[16,20,16,22],[17,2,17,4],[17,8,17,10],[17,14,17,16],[17,20,17,22],[18,2,18,4],[18,8,18,10],[18,14,18,16],[18,20,18,22],[19,2,19,4],[19,8,19,10],[19,14,19,16],[19,20,19,22],[20,1,20,11],[20,13,20,23],[21,2,21,4],[21,8,21,10],[21,14,21,16],[21,20,21,22],[22,2,22,4],[22,8,22,10],[22,14,22,16],[22,20,22,22],[23,2,23,4],[23,8,23,10],[23,14,23,16],[23,20,23,22],[24,2,24,4],[24,8,24,10],[24,14,24,16],[24,20,24,22],[25,1,25,11],[25,13,25,23],[26,2,26,4],[26,8,26,10],[26,14,26,16],[26,20,26,22],[27,2,27,4],[27,8,27,10],[27,14,27,16],[27,20,27,22],[28,2,28,4],[28,8,28,10],[28,14,28,16],[28,20,28,22],[29,2,29,4],[29,8,29,10],[29,14,29,16],[29,20,29,22],[30,1,30,11],[30,13,30,23],[31,2,31,4],[31,8,31,10],[31,14,31,16],[31,20,31,22],[32,2,32,4],[32,8,32,10],[32,14,32,16],[32,20,32,22],[33,2,33,4],[33,8,33,10],[33,14,33,16],[33,20,33,22],[34,2,34,4],[34,8,34,10],[34,14,34,16],[34,20,34,22],[35,1,35,11],[36,2,36,4],[36,8,36,10],[37,2,37,4],[37,8,37,10],[38,2,38,4],[38,8,38,10],[39,2,39,4],[39,8,39,10],[43,1,43,13],[44,1,44,4]]}
[]
[]
[]
[]
[{"$nulls":30},3,1,1,0,null,null,3,1,1,0]
[null,"1ª RODADA",{"$nulls":10},"MESA",{"$nulls":17},"Vitórias","Empates","Empates","Derrotas",null,null,"Vitórias","Empates","Empates","Derrotas"]
[null,1,{"$f":"VLOOKUP(B7,$B$46:$C$53,2,0)","v":"BRAYNER-CRVG"},null,null,1,"X",0,{"$f":"VLOOKUP(L7,$B$46:$C$53,2,0)","v":"VAGO-W.O"},null,null,8,7,{"$nulls":17},{"$f":"IF(F7>H7,C7,IF(F7=H7,0,I7))","v":"BRAYNER-CRVG"},{"$f":"(IF(F7<>\"-\",(IF(F7=H7,C7,0)),0))","v":0},{"$f":"(IF(F7<>\"-\",(IF(F7=H7,I7,0)),0))","v":0},{"$f":"IF(F7<H7,C7,IF(F7=H7,0,I7))","v":"VAGO-W.O"},null,null,{"$f":"IF(R7>T7,O7,IF(R7=T7,0,U7))","v":0},{"$f":"(IF(R7<>\"-\",(IF(R7=T7,O7,0)),0))","v":0},{"$f":"(IF(R7<>\"-\",(IF(R7=T7,U7,0)),0))","v":0},{"$f":"IF(R7<T7,O7,IF(R7=T7,0,U7))","v":0}]
[null,2,{"$f":"VLOOKUP(B8,$B$46:$C$53,2,0)","v":"ALMO-CC"},null,null,4,"X",3,{"$f":"VLOOKUP(L8,$B$46:$C$53,2,0)","v":"CARLOS-APCEF-DF"},null,null,7,8,{"$nulls":17},"ALMO-CC",0,0,"CARLOS-APCEF-DF",null,null,0,0,0,0]
{"$rows_left_out":46}
{"sheet":"D","index":3,"n_rows":53,"n_cols":40,"rows_kept":53,"merged":[[1,1,1,23],[2,1,2,23],[3,1,3,23],[5,1,5,11],[6,2,6,4],[6,8,6,10],[6,14,6,16],[6,20,6,22],[7,2,7,4],[7,8,7,10],[7,14,7,16],[7,20,7,22],[8,2,8,4],[8,8,8,10],[8,14,8,16],[8,20,8,22],[9,2,9,4],[9,8,9,10],[9,14,9,16],[9,20,9,22],[10,1,10,11],[10,13,10,23],[11,2,11,4],[11,8,11,10],[11,14,11,16],[11,20,11,22],[12,2,12,4],[12,8,12,10],[12,14,12,16],[12,20,12,22],[13,2,13,4],[13,8,13,10],[13,14,13,16],[13,20,13,22],[14,2,14,4],[14,8,14,10],[14,14,14,16],[14,20,14,22],[15,1,15,11],[15,13,15,23],[16,2,16,4],[16,8,16,10],[16,14,16,16],[16,20,16,22],[17,2,17,4],[17,8,17,10],[17,14,17,16],[17,20,17,22],[18,2,18,4],[18,8,18,10],[18,14,18,16],[18,20,18,22],[19,2,19,4],[19,8,19,10],[19,14,19,16],[19,20,19,22],[20,1,20,11],[20,13,20,23],[21,2,21,4],[21,8,21,10],[21,14,21,16],[21,20,21,22],[22,2,22,4],[22,8,22,10],[22,14,22,16],[22,20,22,22],[23,2,23,4],[23,8,23,10],[23,14,23,16],[23,20,23,22],[24,2,24,4],[24,8,24,10],[24,14,24,16],[24,20,24,22],[25,1,25,11],[25,13,25,23],[26,2,26,4],[26,8,26,10],[26,14,26,16],[26,20,26,22],[27,2,27,4],[27,8,27,10],[27,14,27,16],[27,20,27,22],[28,2,28,4],[28,8,28,10],[28,14,28,16],[28,20,28,22],[29,2,29,4],[29,8,29,10],[29,14,29,16],[29,20,29,22],[30,1,30,11],[30,13,30,23],[31,2,31,4],[31,8,31,10],[31,14,31,16],[31,20,31,22],[32,2,32,4],[32,8,32,10],[32,14,32,16],[32,20,32,22],[33,2,33,4],[33,8,33,10],[33,14,33,16],[33,20,33,22],[34,2,34,4],[34,8,34,10],[34,14,34,16],[34,20,34,22],[35,1,35,11],[36,2,36,4],[36,8,36,10],[37,2,37,4],[37,8,37,10],[38,2,38,4],[38,8,38,10],[39,2,39,4],[39,8,39,10],[43,1,43,13],[44,1,44,4]]}
[]
[]
[]
[]
[{"$nulls":30},3,1,1,0,null,null,3,1,1,0]
[null,"1ª RODADA",{"$nulls":10},"MESA",{"$nulls":17},"Vitórias","Empates","Empates","Derrotas",null,null,"Vitórias","Empates","Empates","Derrotas"]
[null,1,{"$f":"VLOOKUP(B7,$B$46:$C$53,2,0)","v":"RICARDO-CRF"},null,null,1,"X",0,{"$f":"VLOOKUP(L7,$B$46:$C$53,2,0)","v":"VAGO-W.O"},null,null,8,10,{"$nulls":17},{"$f":"IF(F7>H7,C7,IF(F7=H7,0,I7))","v":"RICARDO-CRF"},{"$f":"(IF(F7<>\"-\",(IF(F7=H7,C7,0)),0))","v":0},{"$f":"(IF(F7<>\"-\",(IF(F7=H7,I7,0)),0))","v":0},{"$f":"IF(F7<H7,C7,IF(F7=H7,0,I7))","v":"VAGO-W.O"},null,null,{"$f":"IF(R7>T7,O7,IF(R7=T7,0,U7))","v":0},{"$f":"(IF(R7<>\"-\",(IF(R7=T7,O7,0)),0))","v":0},{"$f":"(IF(R7<>\"-\",(IF(R7=T7,U7,0)),0))","v":0},{"$f":"IF(R7<T7,O7,IF(R7=T7,0,U7))","v":0}]
[null,2,{"$f":"VLOOKUP(B8,$B$46:$C$53,2,0)","v":"LOPES-RIVER"},null,null,2,"X",2,{"$f":"VLOOKUP(L8,$B$46:$C$53,2,0)","v":"EDWARD-BQ"},null,null,7,11,{"$nulls":17},0,"LOPES-RIVER","EDWARD-BQ",0,null,null,0,0,0,0]
{"$rows_left_out":46}
{"sheet":"E","index":4,"n_rows":53,"n_cols":40,"rows_kept":53,"merged":[[1,1,1,23],[2,1,2,23],[3,1,3,23],[5,1,5,11],[6,2,6,4],[6,8,6,10],[6,14,6,16],[6,20,6,22],[7,2,7,4],[7,8,7,10],[7,14,7,16],[7,20,7,22],[8,2,8,4],[8,8,8,10],[8,14,8,16],[8,20,8,22],[9,2,9,4],[9,8,9,10],[9,14,9,16],[9,20,9,22],[10,1,10,11],[10,13,10,23],[11,2,11,4],[11,8,11,10],[11,14,11,16],[11,20,11,22],[12,2,12,4],[12,8,12,10],[12,14,12,16],[12,20,12,22],[13,2,13,4],[13,8,13,10],[13,14,13,16],[13,20,13,22],[14,2,14,4],[14,8,14,10],[14,14,14,16],[14,20,14,22],[15,1,15,11],[15,13,15,23],[16,2,16,4],[16,8,16,10],[16,14,16,16],[16,20,16,22],[17,2,17,4],[17,8,17,10],[17,14,17,16],[17,20,17,22],[18,2,18,4],[18,8,18,10],[18,14,18,16],[18,20,18,22],[19,2,19,4],[19,8,19,10],[19,14,19,16],[19,20,19,22],[20,1,20,11],[20,13,20,23],[21,2,21,4],[21,8,21,10],[21,14,21,16],[21,20,21,22],[22,2,22,4],[22,8,22,10],[22,14,22,16],[22,20,22,22],[23,2,23,4],[23,8,23,10],[23,14,23,16],[23,20,23,22],[24,2,24,4],[24,8,24,10],[24,14,24,16],[24,20,24,22],[25,1,25,11],[25,13,25,23],[26,2,26,4],[26,8,26,10],[26,14,26,16],[26,20,26,22],[27,2,27,4],[27,8,27,10],[27,14,27,16],[27,20,27,22],[28,2,28,4],[28,8,28,10],[28,14,28,16],[28,20,28,22],[29,2,29,4],[29,8,29,10],[29,14,29,16],[29,20,29,22],[30,1,30,11],[30,13,30,23],[31,2,31,4],[31,8,31,10],[31,14,31,16],[31,20,31,22],[32,2,32,4],[32,8,32,10],[32,14,32,16],[32,20,32,22],[33,2,33,4],[33,8,33,10],[33,14,33,16],[33,20,33,22],[34,2,34,4],[34,8,34,10],[34,14,34,16],[34,20,34,22],[35,1,35,11],[36,2,36,4],[36,8,36,10],[37,2,37,4],[37,8,37,10],[38,2,38,4],[38,8,38,10],[39,2,39,4],[39,8,39,10],[43,1,43,13],[44,1,44,4]]}
[]
[]
[]
[]
[{"$nulls":30},3,1,1,0,null,null,3,1,1,0]
[null,"1ª RODADA",{"$nulls":10},"MESA",{"$nulls":17},"Vitórias","Empates","Empates","Derrotas",null,null,"Vitórias","Empates","Empates","Derrotas"]
[null,1,{"$f":"VLOOKUP(B7,$B$46:$C$53,2,0)","v":"RONALD-CRF"},null,null,1,"X",0,{"$f":"VLOOKUP(L7,$B$46:$C$53,2,0)","v":"VAGO-W.O"},null,null,8,13,{"$nulls":17},{"$f":"IF(F7>H7,C7,IF(F7=H7,0,I7))","v":"RONALD-CRF"},{"$f":"(IF(F7<>\"-\",(IF(F7=H7,C7,0)),0))","v":0},{"$f":"(IF(F7<>\"-\",(IF(F7=H7,I7,0)),0))","v":0},{"$f":"IF(F7<H7,C7,IF(F7=H7,0,I7))","v":"VAGO-W.O"},null,null,{"$f":"IF(R7>T7,O7,IF(R7=T7,0,U7))","v":0},{"$f":"(IF(R7<>\"-\",(IF(R7=T7,O7,0)),0))","v":0},{"$f":"(IF(R7<>\"-\",(IF(R7=T7,U7,0)),0))","v":0},{"$f":"IF(R7<T7,O7,IF(R7=T7,0,U7))","v":0}]
[null,2,{"$f":"VLOOKUP(B8,$B$46:$C$53,2,0)","v":"MATOSO-CRVG"},null,null,1,"X",1,{"$f":"VLOOKUP(L8,$B$46:$C$53,2,0)","v":"ARMANDO-PE"},null,null,7,14,{"$nulls":17},{"$f":"IF(F8>H8,C8,IF(F8=H8,0,I8))","v":0},{"$f":"(IF(F8<>\"-\",(IF(F8=H8,C8,0)),0))","v":"MATOSO-CRVG"},{"$f":"(IF(F8<>\"-\",(IF(F8=H8,I8,0)),0))","v":"ARMANDO-PE"},{"$f":"IF(F8<H8,C8,IF(F8=H8,0,I8))","v":0},null,null,{"$f":"IF(R8>T8,O8,IF(R8=T8,0,U8))","v":0},{"$f":"(IF(R8<>\"-\",(IF(R8=T8,O8,0)),0))","v":0},{"$f":"(IF(R8<>\"-\",(IF(R8=T8,U8,0)),0))","v":0},{"$f":"IF(R8<T8,O8,IF(R8=T8,0,U8))","v":0}]
{"$rows_left_out":46}
{"sheet":"F","index":5,"n_rows":53,"n_cols":40,"rows_kept":53,"merged":[[1,1,1,23],[2,1,2,23],[3,1,3,23],[5,1,5,11],[6,2,6,4],[6,8,6,10],[6,14,6,16],[6,20,6,22],[7,2,7,4],[7,8,7,10],[7,14,7,16],[7,20,7,22],[8,2,8,4],[8,8,8,10],[8,14,8,16],[8,20,8,22],[9,2,9,4],[9,8,9,10],[9,14,9,16],[9,20,9,22],[10,1,10,11],[10,13,10,23],[11,2,11,4],[11,8,11,10],[11,14,11,16],[11,20,11,22],[12,2,12,4],[12,8,12,10],[12,14,12,16],[12,20,12,22],[13,2,13,4],[13,8,13,10],[13,14,13,16],[13,20,13,22],[14,2,14,4],[14,8,14,10],[14,14,14,16],[14,20,14,22],[15,1,15,11],[15,13,15,23],[16,2,16,4],[16,8,16,10],[16,14,16,16],[16,20,16,22],[17,2,17,4],[17,8,17,10],[17,14,17,16],[17,20,17,22],[18,2,18,4],[18,8,18,10],[18,14,18,16],[18,20,18,22],[19,2,19,4],[19,8,19,10],[19,14,19,16],[19,20,19,22],[20,1,20,11],[20,13,20,23],[21,2,21,4],[21,8,21,10],[21,14,21,16],[21,20,21,22],[22,2,22,4],[22,8,22,10],[22,14,22,16],[22,20,22,22],[23,2,23,4],[23,8,23,10],[23,14,23,16],[23,20,23,22],[24,2,24,4],[24,8,24,10],[24,14,24,16],[24,20,24,22],[25,1,25,11],[25,13,25,23],[26,2,26,4],[26,8,26,10],[26,14,26,16],[26,20,26,22],[27,2,27,4],[27,8,27,10],[27,14,27,16],[27,20,27,22],[28,2,28,4],[28,8,28,10],[28,14,28,16],[28,20,28,22],[29,2,29,4],[29,8,29,10],[29,14,29,16],[29,20,29,22],[30,1,30,11],[30,13,30,23],[31,2,31,4],[31,8,31,10],[31,14,31,16],[31,20,31,22],[32,2,32,4],[32,8,32,10],[32,14,32,16],[32,20,32,22],[33,2,33,4],[33,8,33,10],[33,14,33,16],[33,20,33,22],[34,2,34,4],[34,8,34,10],[34,14,34,16],[34,20,34,22],[35,1,35,11],[36,2,36,4],[36,8,36,10],[37,2,37,4],[37,8,37,10],[38,2,38,4],[38,8,38,10],[39,2,39,4],[39,8,39,10],[43,1,43,13],[44,1,44,4]]}
[]
[]
[]
[]
[{"$nulls":30},3,1,1,0,null,null,3,1,1,0]
[null,"1ª RODADA",{"$nulls":10},"MESA",{"$nulls":17},"Vitórias","Empates","Empates","Derrotas",null,null,"Vitórias","Empates","Empates","Derrotas"]
[null,1,{"$f":"VLOOKUP(B7,$B$46:$C$53,2,0)","v":"GATTO-CRVG"},null,null,1,"X",0,{"$f":"VLOOKUP(L7,$B$46:$C$53,2,0)","v":"VAGO-W.O"},null,null,8,16,{"$nulls":17},{"$f":"IF(F7>H7,C7,IF(F7=H7,0,I7))","v":"GATTO-CRVG"},{"$f":"(IF(F7<>\"-\",(IF(F7=H7,C7,0)),0))","v":0},{"$f":"(IF(F7<>\"-\",(IF(F7=H7,I7,0)),0))","v":0},{"$f":"IF(F7<H7,C7,IF(F7=H7,0,I7))","v":"VAGO-W.O"},null,null,{"$f":"IF(R7>T7,O7,IF(R7=T7,0,U7))","v":0},{"$f":"(IF(R7<>\"-\",(IF(R7=T7,O7,0)),0))","v":0},{"$f":"(IF(R7<>\"-\",(IF(R7=T7,U7,0)),0))","v":0},{"$f":"IF(R7<T7,O7,IF(R7=T7,0,U7))","v":0}]
[null,2,{"$f":"VLOOKUP(B8,$B$46:$C$53,2,0)","v":"VERAS-CRF"},null,null,4,"X",3,{"$f":"VLOOKUP(L8,$B$46:$C$53,2,0)","v":"BELMIRO-RIVER"},null,null,7,17,{"$nulls":17},{"$f":"IF(F8>H8,C8,IF(F8=H8,0,I8))","v":"VERAS-CRF"},{"$f":"(IF(F8<>\"-\",(IF(F8=H8,C8,0)),0))","v":0},{"$f":"(IF(F8<>\"-\",(IF(F8=H8,I8,0)),0))","v":0},{"$f":"IF(F8<H8,C8,IF(F8=H8,0,I8))","v":"BELMIRO-RIVER"},null,null,{"$f":"IF(R8>T8,O8,IF(R8=T8,0,U8))","v":0},{"$f":"(IF(R8<>\"-\",(IF(R8=T8,O8,0)),0))","v":0},{"$f":"(IF(R8<>\"-\",(IF(R8=T8,U8,0)),0))","v":0},{"$f":"IF(R8<T8,O8,IF(R8=T8,0,U8))","v":0}]
{"$rows_left_out":46}
{"sheet":"Resumo","index":6,"n_rows":76,"n_cols":15,"rows_kept":76,"merged":[[0,2,0,14],[1,2,1,5],[11,2,11,14],[12,2,12,5],[22,2,22,14],[23,2,23,5],[44,2,44,14],[45,2,45,5],[55,2,55,14],[56,2,56,5],[66,2,66,14],[67,2,67,5]]}
[null,null,"GRUPO A"]
[null,null,"Equipes ",{"$nulls":3},"PG","J","V","E","D","GP","GC","SG","APROV"]
[null,"1º",1,{"$f":"A!$C$46","v":"AUGUSTO-CRF"},null,null,{"$f":"A!$F$46","v":17},{"$f":"A!$G$46","v":7},{"$f":"A!$H$46","v":5},{"$f":"A!$I$46","v":2},{"$f":"A!$J$46","v":0},{"$f":"A!$K$46","v":18},{"$f":"A!$L$46","v":11},{"$f":"A!$M$46","v":7},{"$f":"A!N46","v":{"v":0.8095238095238095,"d":"0.810"}}]
[null,"2º",2,{"$f":"A!$C$47","v":"WELLINGTON-ADDP"},null,null,{"$f":"A!$F$47","v":16},{"$f":"A!$G$47","v":7},{"$f":"A!$H$47","v":5},{"$f":"A!$I$47","v":1},{"$f":"A!$J$47","v":1},{"$f":"A!$K$47","v":15},{"$f":"A!$L$47","v":10},{"$f":"A!$M$47","v":5},{"$f":"A!N47","v":{"v":0.7619047619047619,"d":"0.762"}}]
[null,"3º",3,{"$f":"A!$C$48","v":"B. RAFAEL-SANTOS"},null,null,{"$f":"A!$F$48","v":15},{"$f":"A!$G$48","v":7},{"$f":"A!$H$48","v":5},{"$f":"A!$I$48","v":0},{"$f":"A!$J$48","v":2},{"$f":"A!$K$48","v":15},{"$f":"A!$L$48","v":12},{"$f":"A!$M$48","v":3},{"$f":"A!N48","v":{"v":0.7142857142857143,"d":"0.714"}}]
[null,"4º",4,{"$f":"A!$C$49","v":"PAULINHO-BOT-DF"},null,null,{"$f":"A!$F$49","v":13},{"$f":"A!$G$49","v":7},{"$f":"A!$H$49","v":4},{"$f":"A!$I$49","v":1},{"$f":"A!$J$49","v":2},{"$f":"A!$K$49","v":12},{"$f":"A!$L$49","v":10},{"$f":"A!$M$49","v":2},{"$f":"A!N49","v":{"v":0.6190476190476191,"d":"0.619"}}]
[null,"5º",5,{"$f":"A!$C$50","v":"B.MACHADO-BQ"},null,null,{"$f":"A!$F$50","v":10},{"$f":"A!$G$50","v":7},{"$f":"A!$H$50","v":3},{"$f":"A!$I$50","v":1},{"$f":"A!$J$50","v":3},{"$f":"A!$K$50","v":13},{"$f":"A!$L$50","v":11},{"$f":"A!$M$50","v":2},{"$f":"A!N50","v":{"v":0.47619047619047616,"d":"0.476"}}]
[null,"6º",6,{"$f":"A!$C$51","v":"LIBÓRIO-FFC"},null,null,{"$f":"A!$F$51","v":7},{"$f":"A!$G$51","v":7},{"$f":"A!$H$51","v":2},{"$f":"A!$I$51","v":1},{"$f":"A!$J$51","v":4},{"$f":"A!$K$51","v":11},{"$f":"A!$L$51","v":18},{"$f":"A!$M$51","v":-7},{"$f":"A!N51","v":{"v":0.3333333333333333,"d":"0.333"}}]
{"$rows_left_out":58}
{"sheet":"Classificação","index":7,"n_rows":53,"n_cols":16,"rows_kept":53}
[]
[]
[]
[{"$nulls":5},4,5,6,7,8,9,10,11,12]
["Geral","Série","Atletas",null,null,"PG","J","V","E","D","GP","GC","SG","%","MGP","MGC"]
["1º","OURO/PRATA",{"$f":"'C'!$C$46","v":"BRAYNER-CRVG"},null,null,{"$f":"VLOOKUP($C6,Resumo!$D:$O,F$4,0)","v":19},{"$f":"VLOOKUP($C6,Resumo!$D:$O,G$4,0)","v":7},{"$f":"VLOOKUP($C6,Resumo!$D:$O,H$4,0)","v":6},{"$f":"VLOOKUP($C6,Resumo!$D:$O,I$4,0)","v":1},{"$f":"VLOOKUP($C6,Resumo!$D:$O,J$4,0)","v":0},{"$f":"VLOOKUP($C6,Resumo!$D:$O,K$4,0)","v":26},{"$f":"VLOOKUP($C6,Resumo!$D:$O,L$4,0)","v":12},{"$f":"VLOOKUP($C6,Resumo!$D:$O,M$4,0)","v":14},{"$f":"VLOOKUP($C6,Resumo!$D:$O,N$4,0)","v":{"v":0.9047619047619048,"d":"0.90"}},{"$f":"K6/G6","v":{"v":3.7142857142857144,"d":"3.71"}},{"$f":"L6/G6","v":{"v":1.7142857142857142,"d":"1.71"}}]
["2º","OURO/PRATA",{"$f":"E!$C$46","v":"RONALD-CRF"},null,null,{"$f":"VLOOKUP($C7,Resumo!$D:$O,F$4,0)","v":19},{"$f":"VLOOKUP($C7,Resumo!$D:$O,G$4,0)","v":7},{"$f":"VLOOKUP($C7,Resumo!$D:$O,H$4,0)","v":6},{"$f":"VLOOKUP($C7,Resumo!$D:$O,I$4,0)","v":1},{"$f":"VLOOKUP($C7,Resumo!$D:$O,J$4,0)","v":0},{"$f":"VLOOKUP($C7,Resumo!$D:$O,K$4,0)","v":27},{"$f":"VLOOKUP($C7,Resumo!$D:$O,L$4,0)","v":14},{"$f":"VLOOKUP($C7,Resumo!$D:$O,M$4,0)","v":13},{"$f":"VLOOKUP($C7,Resumo!$D:$O,N$4,0)","v":{"v":0.9047619047619048,"d":"0.90"}},{"v":3.857142857142857,"d":"3.86"},{"v":2,"d":"2.00"}]
["3º","OURO/PRATA",{"$f":"F!$C$46","v":"FERNANDO-BOT-DF"},null,null,{"$f":"VLOOKUP($C8,Resumo!$D:$O,F$4,0)","v":19},{"$f":"VLOOKUP($C8,Resumo!$D:$O,G$4,0)","v":7},{"$f":"VLOOKUP($C8,Resumo!$D:$O,H$4,0)","v":6},{"$f":"VLOOKUP($C8,Resumo!$D:$O,I$4,0)","v":1},{"$f":"VLOOKUP($C8,Resumo!$D:$O,J$4,0)","v":0},{"$f":"VLOOKUP($C8,Resumo!$D:$O,K$4,0)","v":20},{"$f":"VLOOKUP($C8,Resumo!$D:$O,L$4,0)","v":8},{"$f":"VLOOKUP($C8,Resumo!$D:$O,M$4,0)","v":12},{"$f":"VLOOKUP($C8,Resumo!$D:$O,N$4,0)","v":{"v":0.9047619047619048,"d":"0.90"}},{"v":2.857142857142857,"d":"2.86"},{"v":1.1428571428571428,"d":"1.14"}]
{"$rows_left_out":46}
{"sheet":"Grupos Prox Fase","index":8,"n_rows":16,"n_cols":9,"rows_kept":16}
[]
[]
[null,"1º",{"$f":"VLOOKUP(B3,Classificação!$A$6:$C$53,3,0)","v":"BRAYNER-CRVG"},"2º",{"$f":"VLOOKUP(D3,Classificação!$A$6:$C$53,3,0)","v":"RONALD-CRF"},"3º",{"$f":"VLOOKUP(F3,Classificação!$A$6:$C$53,3,0)","v":"FERNANDO-BOT-DF"},"4º",{"$f":"VLOOKUP(H3,Classificação!$A$6:$C$53,3,0)","v":"RICARDO-CRF"}]
[null,"8º",{"$f":"VLOOKUP(B4,Classificação!$A$6:$C$53,3,0)","v":"AUGUSTO-CRF"},"7º",{"$f":"VLOOKUP(D4,Classificação!$A$6:$C$53,3,0)","v":"ALMO-CC"},"6º",{"$f":"VLOOKUP(F4,Classificação!$A$6:$C$53,3,0)","v":"AIRES-ASBAC"},"5º",{"$f":"VLOOKUP(H4,Classificação!$A$6:$C$53,3,0)","v":"ROMAR-CRVG"}]
[null,"9º",{"$f":"VLOOKUP(B5,Classificação!$A$6:$C$53,3,0)","v":"GIUSEPE-BOT-DF"},"10º",{"$f":"VLOOKUP(D5,Classificação!$A$6:$C$53,3,0)","v":"WELLINGTON-ADDP"},"11º",{"$f":"VLOOKUP(F5,Classificação!$A$6:$C$53,3,0)","v":"LUCIANO-CRF"},"12º",{"$f":"VLOOKUP(H5,Classificação!$A$6:$C$53,3,0)","v":"FELIPE-CRF"}]
[null,"16º",{"$f":"VLOOKUP(B6,Classificação!$A$6:$C$53,3,0)","v":"EDWARD-BQ"},"15º",{"$f":"VLOOKUP(D6,Classificação!$A$6:$C$53,3,0)","v":"L.HENRIQUE-TUPI"},"14º",{"$f":"VLOOKUP(F6,Classificação!$A$6:$C$53,3,0)","v":"LOPES-RIVER"},"13º",{"$f":"VLOOKUP(H6,Classificação!$A$6:$C$53,3,0)","v":"B. RAFAEL-SANTOS"}]
[null,"17º",{"$f":"VLOOKUP(B7,Classificação!$A$6:$C$53,3,0)","v":"GATTO-CRVG"},"18º",{"$f":"VLOOKUP(D7,Classificação!$A$6:$C$53,3,0)","v":"P.CARUSO-AABB-DF"},"19º",{"$f":"VLOOKUP(F7,Classificação!$A$6:$C$53,3,0)","v":"MARCUS-BQ"},"20º",{"$f":"VLOOKUP(H7,Classificação!$A$6:$C$53,3,0)","v":"PAULINHO-BOT-DF"}]
[null,"24º",{"$f":"VLOOKUP(B8,Classificação!$A$6:$C$53,3,0)","v":"GILBERTO-ASBAC"},"23º",{"$f":"VLOOKUP(D8,Classificação!$A$6:$C$53,3,0)","v":"MENDEZ-CRVG"},"22º",{"$f":"VLOOKUP(F8,Classificação!$A$6:$C$53,3,0)","v":"VERAS-CRF"},"21º",{"$f":"VLOOKUP(H8,Classificação!$A$6:$C$53,3,0)","v":"LYAN-FFC"}]
{"$rows_left_out":8}