{"text_format":"3","workbook":"xlsx","n_sheets":9,"sheets":["A","B","C","D","E","F","Resumo","Classificação","Grupos Prox Fase"],"not_rendered":{"images":5,"macros":1,"external_links":1,"defined_names":13},"read":"whole","date_system":"1900"}

{"sheet":"A","index":0,"n_rows":53,"n_cols":40,"rows_kept":53,"merged":[[1,1,1,23],[2,1,2,23],[3,1,3,23],[5,1,5,11],[6,2,6,4],[6,8,6,10],[6,14,6,16],[6,20,6,22],[7,2,7,4],[7,8,7,10],[7,14,7,16],[7,20,7,22],[8,2,8,4],[8,8,8,10],[8,14,8,16],[8,20,8,22],[9,2,9,4],[9,8,9,10],[9,14,9,16],[9,20,9,22],[10,1,10,11],[10,13,10,23],[11,2,11,4],[11,8,11,10],[11,14,11,16],[11,20,11,22],[12,2,12,4],[12,8,12,10],[12,14,12,16],[12,20,12,22],[13,2,13,4],[13,8,13,10],[13,14,13,16],[13,20,13,22],[14,2,14,4],[14,8,14,10],[14,14,14,16],[14,20,14,22],[15,1,15,11],[15,13,15,23],[16,2,16,4],[16,8,16,10],[16,14,16,16],[16,20,16,22],[17,2,17,4],[17,8,17,10],[17,14,17,16],[17,20,17,22],[18,2,18,4],[18,8,18,10],[18,14,18,16],[18,20,18,22],[19,2,19,4],[19,8,19,10],[19,14,19,16],[19,20,19,22],[20,1,20,11],[20,13,20,23],[21,2,21,4],[21,8,21,10],[21,14,21,16],[21,20,21,22],[22,2,22,4],[22,8,22,10],[22,14,22,16],[22,20,22,22],[23,2,23,4],[23,8,23,10],[23,14,23,16],[23,20,23,22],[24,2,24,4],[24,8,24,10],[24,14,24,16],[24,20,24,22],[25,1,25,11],[25,13,25,23],[26,2,26,4],[26,8,26,10],[26,14,26,16],[26,20,26,22],[27,2,27,4],[27,8,27,10],[27,14,27,16],[27,20,27,22],[28,2,28,4],[28,8,28,10],[28,14,28,16],[28,20,28,22],[29,2,29,4],[29,8,29,10],[29,14,29,16],[29,20,29,22],[30,1,30,11],[30,13,30,23],[31,2,31,4],[31,8,31,10],[31,14,31,16],[31,20,31,22],[32,2,32,4],[32,8,32,10],[32,14,32,16],[32,20,32,22],[33,2,33,4],[33,8,33,10],[33,14,33,16],[33,20,33,22],[34,2,34,4],[34,8,34,10],[34,14,34,16],[34,20,34,22],[35,1,35,11],[36,2,36,4],[36,8,36,10],[37,2,37,4],[37,8,37,10],[38,2,38,4],[38,8,38,10],[39,2,39,4],[39,8,39,10],[43,1,43,13],[44,1,44,4]]}
[]
[]
[]
[]
[{"$nulls":30},3,1,1,0,null,null,3,1,1,0]
[null,"1ª RODADA",{"$nulls":10},"MESA",{"$nulls":17},"Vitórias","Empates","Empates","Derrotas",null,null,"Vitórias","Empates","Empates","Derrotas"]
[null,2,{"$f":"VLOOKUP(B7,$B$46:$C$53,2,0)","v":"WELLINGTON-ADDP"},null,null,4,"X",2,{"$f":"VLOOKUP(L7,$B$46:$C$53,2,0)","v":"B.MACHADO-BQ"},null,null,7,4,{"$nulls":17},{"$f":"IF(F7>H7,C7,IF(F7=H7,0,I7))","v":"WELLINGTON-ADDP"},{"$f":"(IF(F7<>\"-\",(IF(F7=H7,C7,0)),0))","v":0},{"$f":"(IF(F7<>\"-\",(IF(F7=H7,I7,0)),0))","v":0},{"$f":"IF(F7<H7,C7,IF(F7=H7,0,I7))","v":"B.MACHADO-BQ"},null,null,{"$f":"IF(R7>T7,O7,IF(R7=T7,0,U7))","v":0},{"$f":"(IF(R7<>\"-\",(IF(R7=T7,O7,0)),0))","v":0},{"$f":"(IF(R7<>\"-\",(IF(R7=T7,U7,0)),0))","v":0},{"$f":"IF(R7<T7,O7,IF(R7=T7,0,U7))","v":0}]
[null,3,{"$f":"VLOOKUP(B8,$B$46:$C$53,2,0)","v":"B. RAFAEL-SANTOS"},null,null,5,"X",3,{"$f":"VLOOKUP(L8,$B$46:$C$53,2,0)","v":"PAULINHO-BOT-DF"},null,null,6,5,{"$nulls":17},"B. RAFAEL-SANTOS",0,0,"PAULINHO-BOT-DF",null,null,0,0,0,0]
[null,4,{"$f":"VLOOKUP(B9,$B$46:$C$53,2,0)","v":"LIBÓRIO-FFC"},null,null,1,"X",0,{"$f":"VLOOKUP(L9,$B$46:$C$53,2,0)","v":"HAMILTON-BQ"},null,null,5,6,{"$nulls":17},"LIBÓRIO-FFC",0,0,"HAMILTON-BQ",null,null,0,0,0,0]
[null,1,{"$f":"VLOOKUP(B10,$B$46:$C$53,2,0)","v":"AUGUSTO-CRF"},null,null,1,"X",0,{"$f":"VLOOKUP(L10,$B$46:$C$53,2,0)","v":"VAGO-W.O"},null,null,8,{"$nulls":18},{"$f":"IF(F10>H10,C10,IF(F10=H10,0,I10))","v":"AUGUSTO-CRF"},{"$f":"(IF(F10<>\"-\",(IF(F10=H10,C10,0)),0))","v":0},{"$f":"(IF(F10<>\"-\",(IF(F10=H10,I10,0)),0))","v":0},{"$f":"IF(F10<H10,C10,IF(F10=H10,0,I10))","v":"VAGO-W.O"},null,null,{"$f":"IF(R10>T10,O10,IF(R10=T10,0,U10))","v":0},{"$f":"(IF(R10<>\"-\",(IF(R10=T10,O10,0)),0))","v":0},{"$f":"(IF(R10<>\"-\",(IF(R10=T10,U10,0)),0))","v":0},{"$f":"IF(R10<T10,O10,IF(R10=T10,0,U10))","v":0}]
[null,"2ª RODADA",{"$nulls":10},"MESA",{"$nulls":17},0,0,0,0,null,null,0,0,0,0]
[null,5,{"$f":"VLOOKUP(B12,$B$46:$C$53,2,0)","v":"HAMILTON-BQ"},null,null,0,"X",1,{"$f":"VLOOKUP(L12,$B$46:$C$53,2,0)","v":"B. RAFAEL-SANTOS"},null,null,3,4,{"$nulls":17},"B. RAFAEL-SANTOS",0,0,"HAMILTON-BQ",null,null,0,0,0,0]
[null,6,{"$f":"VLOOKUP(B13,$B$46:$C$53,2,0)","v":"PAULINHO-BOT-DF"},null,null,0,"X",1,{"$f":"VLOOKUP(L13,$B$46:$C$53,2,0)","v":"WELLINGTON-ADDP"},null,null,2,5,{"$nulls":17},"WELLINGTON-ADDP",0,0,"PAULINHO-BOT-DF",null,null,0,0,0,0]
[null,7,{"$f":"VLOOKUP(B14,$B$46:$C$53,2,0)","v":"B.MACHADO-BQ"},null,null,2,"X",2,{"$f":"VLOOKUP(L14,$B$46:$C$53,2,0)","v":"AUGUSTO-CRF"},null,null,1,6,{"$nulls":17},0,"B.MACHADO-BQ","AUGUSTO-CRF",0,null,null,0,0,0,0]
[null,8,{"$f":"VLOOKUP(B15,$B$46:$C$53,2,0)","v":"VAGO-W.O"},null,null,0,"X",1,{"$f":"VLOOKUP(L15,$B$46:$C$53,2,0)","v":"LIBÓRIO-FFC"},null,null,4,{"$nulls":18},"LIBÓRIO-FFC",0,0,"VAGO-W.O",null,null,0,0,0,0]
[null,"3ª RODADA",{"$nulls":10},"MESA",{"$nulls":17},0,0,0,0,null,null,0,0,0,0]
[null,1,{"$f":"VLOOKUP(B17,$B$46:$C$53,2,0)","v":"AUGUSTO-CRF"},null,null,1,"X",1,{"$f":"VLOOKUP(L17,$B$46:$C$53,2,0)","v":"PAULINHO-BOT-DF"},null,null,6,4,{"$nulls":17},0,"AUGUSTO-CRF","PAULINHO-BOT-DF",0,null,null,0,0,0,0]
[null,2,{"$f":"VLOOKUP(B18,$B$46:$C$53,2,0)","v":"WELLINGTON-ADDP"},null,null,1,"X",0,{"$f":"VLOOKUP(L18,$B$46:$C$53,2,0)","v":"HAMILTON-BQ"},null,null,5,5,{"$nulls":17},"WELLINGTON-ADDP",0,0,"HAMILTON-BQ",null,null,0,0,0,0]
[null,3,{"$f":"VLOOKUP(B19,$B$46:$C$53,2,0)","v":"B. RAFAEL-SANTOS"},null,null,2,"X",1,{"$f":"VLOOKUP(L19,$B$46:$C$53,2,0)","v":"LIBÓRIO-FFC"},null,null,4,6,{"$nulls":17},"B. RAFAEL-SANTOS",0,0,"LIBÓRIO-FFC",null,null,0,0,0,0]
[null,7,{"$f":"VLOOKUP(B20,$B$46:$C$53,2,0)","v":"B.MACHADO-BQ"},null,null,1,"X",0,{"$f":"VLOOKUP(L20,$B$46:$C$53,2,0)","v":"VAGO-W.O"},null,null,8,{"$nulls":18},"B.MACHADO-BQ",0,0,"VAGO-W.O",null,null,0,0,0,0]
[null,"4ª RODADA",{"$nulls":10},"MESA",{"$nulls":17},0,0,0,0,null,null,0,0,0,0]
[null,4,{"$f":"VLOOKUP(B22,$B$46:$C$53,2,0)","v":"LIBÓRIO-FFC"},null,null,2,"X",2,{"$f":"VLOOKUP(L22,$B$46:$C$53,2,0)","v":"WELLINGTON-ADDP"},null,null,2,4,{"$nulls":17},0,"LIBÓRIO-FFC","WELLINGTON-ADDP",0,null,null,0,0,0,0]
[null,5,{"$f":"VLOOKUP(B23,$B$46:$C$53,2,0)","v":"HAMILTON-BQ"},null,null,0,"X",1,{"$f":"VLOOKUP(L23,$B$46:$C$53,2,0)","v":"AUGUSTO-CRF"},null,null,1,5,{"$nulls":17},"AUGUSTO-CRF",0,0,"HAMILTON-BQ",null,null,0,0,0,0]
[null,6,{"$f":"VLOOKUP(B24,$B$46:$C$53,2,0)","v":"PAULINHO-BOT-DF"},null,null,3,"X",1,{"$f":"VLOOKUP(L24,$B$46:$C$53,2,0)","v":"B.MACHADO-BQ"},null,null,7,6,{"$nulls":17},"PAULINHO-BOT-DF",0,0,"B.MACHADO-BQ",null,null,0,0,0,0]
[null,3,{"$f":"VLOOKUP(B25,$B$46:$C$53,2,0)","v":"B. RAFAEL-SANTOS"},null,null,1,"X",0,{"$f":"VLOOKUP(L25,$B$46:$C$53,2,0)","v":"VAGO-W.O"},null,null,8,{"$nulls":18},{"$f":"IF(F25>H25,C25,IF(F25=H25,0,I25))","v":"B. RAFAEL-SANTOS"},{"$f":"(IF(F25<>\"-\",(IF(F25=H25,C25,0)),0))","v":0},{"$f":"(IF(F25<>\"-\",(IF(F25=H25,I25,0)),0))","v":0},{"$f":"IF(F25<H25,C25,IF(F25=H25,0,I25))","v":"VAGO-W.O"},null,null,{"$f":"IF(R25>T25,O25,IF(R25=T25,0,U25))","v":0},{"$f":"(IF(R25<>\"-\",(IF(R25=T25,O25,0)),0))","v":0},{"$f":"(IF(R25<>\"-\",(IF(R25=T25,U25,0)),0))","v":0},{"$f":"IF(R25<T25,O25,IF(R25=T25,0,U25))","v":0}]
[null,"5ª RODADA",{"$nulls":10},"MESA",{"$nulls":17},0,0,0,0,null,null,0,0,0,0]
[null,1,{"$f":"VLOOKUP(B27,$B$46:$C$53,2,0)","v":"AUGUSTO-CRF"},null,null,6,"X",4,{"$f":"VLOOKUP(L27,$B$46:$C$53,2,0)","v":"LIBÓRIO-FFC"},null,null,4,4,{"$nulls":17},"AUGUSTO-CRF",0,0,"LIBÓRIO-FFC",null,null,0,0,0,0]
[null,2,{"$f":"VLOOKUP(B28,$B$46:$C$53,2,0)","v":"WELLINGTON-ADDP"},null,null,4,"X",2,{"$f":"VLOOKUP(L28,$B$46:$C$53,2,0)","v":"B. RAFAEL-SANTOS"},null,null,3,5,{"$nulls":17},"WELLINGTON-ADDP",0,0,"B. RAFAEL-SANTOS",null,null,0,0,0,0]
[null,7,{"$f":"VLOOKUP(B29,$B$46:$C$53,2,0)","v":"B.MACHADO-BQ"},null,null,1,"X",0,{"$f":"VLOOKUP(L29,$B$46:$C$53,2,0)","v":"HAMILTON-BQ"},null,null,5,6,{"$nulls":17},"B.MACHADO-BQ",0,0,"HAMILTON-BQ",null,null,0,0,0,0]
[null,8,{"$f":"VLOOKUP(B30,$B$46:$C$53,2,0)","v":"VAGO-W.O"},null,null,0,"X",1,{"$f":"VLOOKUP(L30,$B$46:$C$53,2,0)","v":"PAULINHO-BOT-DF"},null,null,6,{"$nulls":18},"PAULINHO-BOT-DF",0,0,"VAGO-W.O",null,null,0,0,0,0]
[null,"6ª RODADA",{"$nulls":10},"MESA",{"$nulls":17},0,0,0,0,null,null,0,0,0,0]
[null,3,{"$f":"VLOOKUP(B32,$B$46:$C$53,2,0)","v":"B. RAFAEL-SANTOS"},null,null,2,"X",3,{"$f":"VLOOKUP(L32,$B$46:$C$53,2,0)","v":"AUGUSTO-CRF"},null,null,1,4,{"$nulls":17},"AUGUSTO-CRF",0,0,"B. RAFAEL-SANTOS",null,null,0,0,0,0]
[null,4,{"$f":"VLOOKUP(B33,$B$46:$C$53,2,0)","v":"LIBÓRIO-FFC"},null,null,0,"X",5,{"$f":"VLOOKUP(L33,$B$46:$C$53,2,0)","v":"B.MACHADO-BQ"},null,null,7,5,{"$nulls":17},"B.MACHADO-BQ",0,0,"LIBÓRIO-FFC",null,null,0,0,0,0]
[null,5,{"$f":"VLOOKUP(B34,$B$46:$C$53,2,0)","v":"HAMILTON-BQ"},null,null,0,"X",1,{"$f":"VLOOKUP(L34,$B$46:$C$53,2,0)","v":"PAULINHO-BOT-DF"},null,null,6,6,{"$nulls":17},"PAULINHO-BOT-DF",0,0,"HAMILTON-BQ",null,null,0,0,0,0]
[null,8,{"$f":"VLOOKUP(B35,$B$46:$C$53,2,0)","v":"VAGO-W.O"},null,null,0,"X",1,{"$f":"VLOOKUP(L35,$B$46:$C$53,2,0)","v":"WELLINGTON-ADDP"},null,null,2,{"$nulls":18},"WELLINGTON-ADDP",0,0,"VAGO-W.O",null,null,0,0,0,0]
[null,"7ª RODADA",{"$nulls":10},"MESA",{"$nulls":17},0,0,0,0,null,null,0,0,0,0]
[null,1,{"$f":"VLOOKUP(B37,$B$46:$C$53,2,0)","v":"AUGUSTO-CRF"},null,null,4,"X",2,{"$f":"VLOOKUP(L37,$B$46:$C$53,2,0)","v":"WELLINGTON-ADDP"},null,null,2,4,{"$nulls":17},"AUGUSTO-CRF",0,0,"WELLINGTON-ADDP",null,null,0,0,0,0]
[null,6,{"$f":"VLOOKUP(B38,$B$46:$C$53,2,0)","v":"PAULINHO-BOT-DF"},null,null,3,"X",2,{"$f":"VLOOKUP(L38,$B$46:$C$53,2,0)","v":"LIBÓRIO-FFC"},null,null,4,5,{"$nulls":17},"PAULINHO-BOT-DF",0,0,"LIBÓRIO-FFC",null,null,0,0,0,0]
[null,7,{"$f":"VLOOKUP(B39,$B$46:$C$53,2,0)","v":"B.MACHADO-BQ"},null,null,1,"X",2,{"$f":"VLOOKUP(L39,$B$46:$C$53,2,0)","v":"B. RAFAEL-SANTOS"},null,null,3,6,{"$nulls":17},"B. RAFAEL-SANTOS",0,0,"B.MACHADO-BQ",null,null,0,0,0,0]
[null,5,{"$f":"VLOOKUP(B40,$B$46:$C$53,2,0)","v":"HAMILTON-BQ"},null,null,1,"X",0,{"$f":"VLOOKUP(L40,$B$46:$C$53,2,0)","v":"VAGO-W.O"},null,null,8,{"$nulls":18},{"$f":"IF(F40>H40,C40,IF(F40=H40,0,I40))","v":"HAMILTON-BQ"},{"$f":"(IF(F40<>\"-\",(IF(F40=H40,C40,0)),0))","v":0},{"$f":"(IF(F40<>\"-\",(IF(F40=H40,I40,0)),0))","v":0},{"$f":"IF(F40<H40,C40,IF(F40=H40,0,I40))","v":"VAGO-W.O"},null,null,{"$f":"IF(R40>T40,O40,IF(R40=T40,0,U40))","v":0},{"$f":"(IF(R40<>\"-\",(IF(R40=T40,O40,0)),0))","v":0},{"$f":"(IF(R40<>\"-\",(IF(R40=T40,U40,0)),0))","v":0},{"$f":"IF(R40<T40,O40,IF(R40=T40,0,U40))","v":0}]
[{"$nulls":30},0,0,0,0,null,null,0,0,0,0]
[{"$nulls":30},0,0,0,0,null,null,0,0,0,0]
[{"$nulls":36},0,0,0,0]
[null,"PONTOS"]
[null,"Equipes ",{"$nulls":3},"PG","J","V","E","D","GP","GC","SG","APROV"]
["1º",1,"AUGUSTO-CRF",null,null,{"$f":"H46*3+I46*1","v":17},{"$f":"SUM(H46:J46)","v":7},{"$f":"COUNTIF($AE$7:$AE$39,C46)+COUNTIF($AK$7:$AK$39,C46)","v":5},{"$f":"COUNTIF($AF$7:$AG$39,C46)+COUNTIF($AL$7:$AM$37,C46)","v":2},{"$f":"COUNTIF($AH$7:$AH$39,C46)+COUNTIF($AN$7:$AN$37,C46)","v":0},{"$f":"SUMIF($C$7:$C$39,$C46,$F$7:$F$39)+SUMIF($I$7:$I$39,$C46,$H$7:$H$39)+SUMIF($O$7:$O$39,$C46,$R$7:$R$39)+SUMIF($U$7:$U$39,$C46,$T$7:$T$39)","v":18},{"$f":"SUMIF($C$7:$C$39,$C46,$H$7:$H$39)+SUMIF($I$7:$I$39,$C46,$F$7:$F$39)+SUMIF($O$7:$O$39,$C46,$T$7:$T$39)+SUMIF($U$7:$U$39,$C46,$R$7:$R$39)","v":11},{"$f":"K46-L46","v":7},{"$f":"F46/(G46*3)","v":{"v":0.8095238095238095,"d":"81%"}}]
["2º",2,"WELLINGTON-ADDP",null,null,16,7,5,1,1,15,10,5,{"v":0.7619047619047619,"d":"76%"}]
["3º",3,"B. RAFAEL-SANTOS",null,null,15,7,5,0,2,15,12,3,{"v":0.7142857142857143,"d":"71%"}]
["4º",6,"PAULINHO-BOT-DF",null,null,13,7,4,1,2,12,10,2,{"v":0.6190476190476191,"d":"62%"}]
["5º",7,"B.MACHADO-BQ",null,null,10,7,3,1,3,13,11,2,{"v":0.47619047619047616,"d":"48%"}]
["6º",4,"LIBÓRIO-FFC",null,null,7,7,2,1,4,11,18,-7,{"v":0.3333333333333333,"d":"33%"}]
["7º",5,"HAMILTON-BQ",null,null,0,6,0,0,6,0,6,-6,{"v":0,"d":"0%"}]
["8º",8,"VAGO-W.O",null,null,0,6,0,0,6,0,6,-6,{"v":0,"d":"0%"}]

{"sheet":"B","index":1,"n_rows":53,"n_cols":40,"rows_kept":53,"merged":[[1,1,1,23],[2,1,2,23],[3,1,3,23],[5,1,5,11],[6,2,6,4],[6,8,6,10],[6,14,6,16],[6,20,6,22],[7,2,7,4],[7,8,7,10],[7,14,7,16],[7,20,7,22],[8,2,8,4],[8,8,8,10],[8,14,8,16],[8,20,8,22],[9,2,9,4],[9,8,9,10],[9,14,9,16],[9,20,9,22],[10,1,10,11],[10,13,10,23],[11,2,11,4],[11,8,11,10],[11,14,11,16],[11,20,11,22],[12,2,12,4],[12,8,12,10],[12,14,12,16],[12,20,12,22],[13,2,13,4],[13,8,13,10],[13,14,13,16],[13,20,13,22],[14,2,14,4],[14,8,14,10],[14,14,14,16],[14,20,14,22],[15,1,15,11],[15,13,15,23],[16,2,16,4],[16,8,16,10],[16,14,16,16],[16,20,16,22],[17,2,17,4],[17,8,17,10],[17,14,17,16],[17,20,17,22],[18,2,18,4],[18,8,18,10],[18,14,18,16],[18,20,18,22],[19,2,19,4],[19,8,19,10],[19,14,19,16],[19,20,19,22],[20,1,20,11],[20,13,20,23],[21,2,21,4],[21,8,21,10],[21,14,21,16],[21,20,21,22],[22,2,22,4],[22,8,22,10],[22,14,22,16],[22,20,22,22],[23,2,23,4],[23,8,23,10],[23,14,23,16],[23,20,23,22],[24,2,24,4],[24,8,24,10],[24,14,24,16],[24,20,24,22],[25,1,25,11],[25,13,25,23],[26,2,26,4],[26,8,26,10],[26,14,26,16],[26,20,26,22],[27,2,27,4],[27,8,27,10],[27,14,27,16],[27,20,27,22],[28,2,28,4],[28,8,28,10],[28,14,28,16],[28,20,28,22],[29,2,29,4],[29,8,29,10],[29,14,29,16],[29,20,29,22],[30,1,30,11],[30,13,30,23],[31,2,31,4],[31,8,31,10],[31,14,31,16],[31,20,31,22],[32,2,32,4],[32,8,32,10],[32,14,32,16],[32,20,32,22],[33,2,33,4],[33,8,33,10],[33,14,33,16],[33,20,33,22],[34,2,34,4],[34,8,34,10],[34,14,34,16],[34,20,34,22],[35,1,35,11],[36,2,36,4],[36,8,36,10],[37,2,37,4],[37,8,37,10],[38,2,38,4],[38,8,38,10],[39,2,39,4],[39,8,39,10],[43,1,43,13],[44,1,44,4]]}
[]
[]
[]
[]
[{"$nulls":30},3,1,1,0,null,null,3,1,1,0]
[null,"1ª RODADA",{"$nulls":10},"MESA",{"$nulls":17},"Vitórias","Empates","Empates","Derrotas",null,null,"Vitórias","Empates","Empates","Derrotas"]
[null,1,{"$f":"VLOOKUP(B7,$B$46:$C$53,2,0)","v":"ROMAR-CRVG"},null,null,1,"X",0,{"$f":"VLOOKUP(L7,$B$46:$C$53,2,0)","v":"VAGO-W.O"},null,null,8,4,{"$nulls":17},{"$f":"IF(F7>H7,C7,IF(F7=H7,0,I7))","v":"ROMAR-CRVG"},{"$f":"(IF(F7<>\"-\",(IF(F7=H7,C7,0)),0))","v":0},{"$f":"(IF(F7<>\"-\",(IF(F7=H7,I7,0)),0))","v":0},{"$f":"IF(F7<H7,C7,IF(F7=H7,0,I7))","v":"VAGO-W.O"},null,null,{"$f":"IF(R7>T7,O7,IF(R7=T7,0,U7))","v":0},{"$f":"(IF(R7<>\"-\",(IF(R7=T7,O7,0)),0))","v":0},{"$f":"(IF(R7<>\"-\",(IF(R7=T7,U7,0)),0))","v":0},{"$f":"IF(R7<T7,O7,IF(R7=T7,0,U7))","v":0}]
[null,2,{"$f":"VLOOKUP(B8,$B$46:$C$53,2,0)","v":"LYAN-FFC"},null,null,2,"X",1,{"$f":"VLOOKUP(L8,$B$46:$C$53,2,0)","v":"P.CARUSO-AABB-DF"},null,null,7,5,{"$nulls":17},{"$f":"IF(F8>H8,C8,IF(F8=H8,0,I8))","v":"LYAN-FFC"},{"$f":"(IF(F8<>\"-\",(IF(F8=H8,C8,0)),0))","v":0},{"$f":"(IF(F8<>\"-\",(IF(F8=H8,I8,0)),0))","v":0},{"$f":"IF(F8<H8,C8,IF(F8=H8,0,I8))","v":"P.CARUSO-AABB-DF"},null,null,{"$f":"IF(R8>T8,O8,IF(R8=T8,0,U8))","v":0},{"$f":"(IF(R8<>\"-\",(IF(R8=T8,O8,0)),0))","v":0},{"$f":"(IF(R8<>\"-\",(IF(R8=T8,U8,0)),0))","v":0},{"$f":"IF(R8<T8,O8,IF(R8=T8,0,U8))","v":0}]
[null,3,{"$f":"VLOOKUP(B9,$B$46:$C$53,2,0)","v":"FELIPE-CRF"},null,null,2,"X",0,{"$f":"VLOOKUP(L9,$B$46:$C$53,2,0)","v":"MARCELO-BQ"},null,null,6,6,{"$nulls":17},"FELIPE-CRF",0,0,"MARCELO-BQ",null,null,0,0,0,0]
[null,4,{"$f":"VLOOKUP(B10,$B$46:$C$53,2,0)","v":"TAVARES-CRVG"},null,null,3,"X",1,{"$f":"VLOOKUP(L10,$B$46:$C$53,2,0)","v":"B. ASSUMPÇÃO-BQ"},null,null,5,{"$nulls":18},"TAVARES-CRVG",0,0,"B. ASSUMPÇÃO-BQ",null,null,0,0,0,0]
[null,"2ª RODADA",{"$nulls":10},"MESA",{"$nulls":17},0,0,0,0,null,null,0,0,0,0]
[null,5,{"$f":"VLOOKUP(B12,$B$46:$C$53,2,0)","v":"B. ASSUMPÇÃO-BQ"},null,null,2,"X",4,{"$f":"VLOOKUP(L12,$B$46:$C$53,2,0)","v":"FELIPE-CRF"},null,null,3,4,{"$nulls":17},"FELIPE-CRF",0,0,"B. ASSUMPÇÃO-BQ",null,null,0,0,0,0]
[null,6,{"$f":"VLOOKUP(B13,$B$46:$C$53,2,0)","v":"MARCELO-BQ"},null,null,3,"X",7,{"$f":"VLOOKUP(L13,$B$46:$C$53,2,0)","v":"LYAN-FFC"},null,null,2,5,{"$nulls":17},"LYAN-FFC",0,0,"MARCELO-BQ",null,null,0,0,0,0]
[null,7,{"$f":"VLOOKUP(B14,$B$46:$C$53,2,0)","v":"P.CARUSO-AABB-DF"},null,null,2,"X",4,{"$f":"VLOOKUP(L14,$B$46:$C$53,2,0)","v":"ROMAR-CRVG"},null,null,1,6,{"$nulls":17},"ROMAR-CRVG",0,0,"P.CARUSO-AABB-DF",null,null,0,0,0,0]
[null,8,{"$f":"VLOOKUP(B15,$B$46:$C$53,2,0)","v":"VAGO-W.O"},null,null,0,"X",1,{"$f":"VLOOKUP(L15,$B$46:$C$53,2,0)","v":"TAVARES-CRVG"},null,null,4,{"$nulls":18},"TAVARES-CRVG",0,0,"VAGO-W.O",null,null,0,0,0,0]
[null,"3ª RODADA",{"$nulls":10},"MESA",{"$nulls":17},0,0,0,0,null,null,0,0,0,0]
[null,1,{"$f":"VLOOKUP(B17,$B$46:$C$53,2,0)","v":"ROMAR-CRVG"},null,null,3,"X",0,{"$f":"VLOOKUP(L17,$B$46:$C$53,2,0)","v":"MARCELO-BQ"},null,null,6,4,{"$nulls":17},"ROMAR-CRVG",0,0,"MARCELO-BQ",null,null,0,0,0,0]
[null,2,{"$f":"VLOOKUP(B18,$B$46:$C$53,2,0)","v":"LYAN-FFC"},null,null,1,"X",2,{"$f":"VLOOKUP(L18,$B$46:$C$53,2,0)","v":"B. ASSUMPÇÃO-BQ"},null,null,5,5,{"$nulls":17},"B. ASSUMPÇÃO-BQ",0,0,"LYAN-FFC",null,null,0,0,0,0]
[null,3,{"$f":"VLOOKUP(B19,$B$46:$C$53,2,0)","v":"FELIPE-CRF"},null,null,4,"X",3,{"$f":"VLOOKUP(L19,$B$46:$C$53,2,0)","v":"TAVARES-CRVG"},null,null,4,6,{"$nulls":17},"FELIPE-CRF",0,0,"TAVARES-CRVG",null,null,0,0,0,0]
[null,7,{"$f":"VLOOKUP(B20,$B$46:$C$53,2,0)","v":"P.CARUSO-AABB-DF"},null,null,1,"X",0,{"$f":"VLOOKUP(L20,$B$46:$C$53,2,0)","v":"VAGO-W.O"},null,null,8,{"$nulls":18},"P.CARUSO-AABB-DF",0,0,"VAGO-W.O",null,null,0,0,0,0]
[null,"4ª RODADA",{"$nulls":10},"MESA",{"$nulls":17},0,0,0,0,null,null,0,0,0,0]
[null,3,{"$f":"VLOOKUP(B22,$B$46:$C$53,2,0)","v":"FELIPE-CRF"},null,null,1,"X",0,{"$f":"VLOOKUP(L22,$B$46:$C$53,2,0)","v":"VAGO-W.O"},null,null,8,4,{"$nulls":17},"FELIPE-CRF",0,0,"VAGO-W.O",null,null,0,0,0,0]
[null,4,{"$f":"VLOOKUP(B23,$B$46:$C$53,2,0)","v":"TAVARES-CRVG"},null,null,5,"X",4,{"$f":"VLOOKUP(L23,$B$46:$C$53,2,0)","v":"LYAN-FFC"},null,null,2,5,{"$nulls":17},"TAVARES-CRVG",0,0,"LYAN-FFC",null,null,0,0,0,0]
[null,5,{"$f":"VLOOKUP(B24,$B$46:$C$53,2,0)","v":"B. ASSUMPÇÃO-BQ"},null,null,0,"X",3,{"$f":"VLOOKUP(L24,$B$46:$C$53,2,0)","v":"ROMAR-CRVG"},null,null,1,6,{"$nulls":17},"ROMAR-CRVG",0,0,"B. ASSUMPÇÃO-BQ",null,null,0,0,0,0]
[null,6,{"$f":"VLOOKUP(B25,$B$46:$C$53,2,0)","v":"MARCELO-BQ"},null,null,2,"X",2,{"$f":"VLOOKUP(L25,$B$46:$C$53,2,0)","v":"P.CARUSO-AABB-DF"},null,null,7,{"$nulls":18},0,"MARCELO-BQ","P.CARUSO-AABB-DF",0,null,null,0,0,0,0]
[null,"5ª RODADA",{"$nulls":10},"MESA",{"$nulls":17},0,0,0,0,null,null,0,0,0,0]
[null,1,{"$f":"VLOOKUP(B27,$B$46:$C$53,2,0)","v":"ROMAR-CRVG"},null,null,4,"X",3,{"$f":"VLOOKUP(L27,$B$46:$C$53,2,0)","v":"TAVARES-CRVG"},null,null,4,4,{"$nulls":17},"ROMAR-CRVG",0,0,"TAVARES-CRVG",null,null,0,0,0,0]
[null,2,{"$f":"VLOOKUP(B28,$B$46:$C$53,2,0)","v":"LYAN-FFC"},null,null,5,"X",1,{"$f":"VLOOKUP(L28,$B$46:$C$53,2,0)","v":"FELIPE-CRF"},null,null,3,5,{"$nulls":17},"LYAN-FFC",0,0,"FELIPE-CRF",null,null,0,0,0,0]
[null,7,{"$f":"VLOOKUP(B29,$B$46:$C$53,2,0)","v":"P.CARUSO-AABB-DF"},null,null,2,"X",1,{"$f":"VLOOKUP(L29,$B$46:$C$53,2,0)","v":"B. ASSUMPÇÃO-BQ"},null,null,5,6,{"$nulls":17},"P.CARUSO-AABB-DF",0,0,"B. ASSUMPÇÃO-BQ",null,null,0,0,0,0]
[null,8,{"$f":"VLOOKUP(B30,$B$46:$C$53,2,0)","v":"VAGO-W.O"},null,null,0,"X",1,{"$f":"VLOOKUP(L30,$B$46:$C$53,2,0)","v":"MARCELO-BQ"},null,null,6,{"$nulls":18},"MARCELO-BQ",0,0,"VAGO-W.O",null,null,0,0,0,0]
[null,"6ª RODADA",{"$nulls":10},"MESA",{"$nulls":17},0,0,0,0,null,null,0,0,0,0]
[null,3,{"$f":"VLOOKUP(B32,$B$46:$C$53,2,0)","v":"FELIPE-CRF"},null,null,3,"X",1,{"$f":"VLOOKUP(L32,$B$46:$C$53,2,0)","v":"ROMAR-CRVG"},null,null,1,4,{"$nulls":17},"FELIPE-CRF",0,0,"ROMAR-CRVG",null,null,0,0,0,0]
[null,4,{"$f":"VLOOKUP(B33,$B$46:$C$53,2,0)","v":"TAVARES-CRVG"},null,null,3,"X",6,{"$f":"VLOOKUP(L33,$B$46:$C$53,2,0)","v":"P.CARUSO-AABB-DF"},null,null,7,5,{"$nulls":17},"P.CARUSO-AABB-DF",0,0,"TAVARES-CRVG",null,null,0,0,0,0]
[null,5,{"$f":"VLOOKUP(B34,$B$46:$C$53,2,0)","v":"B. ASSUMPÇÃO-BQ"},null,null,0,"X",1,{"$f":"VLOOKUP(L34,$B$46:$C$53,2,0)","v":"MARCELO-BQ"},null,null,6,6,{"$nulls":17},"MARCELO-BQ",0,0,"B. ASSUMPÇÃO-BQ",null,null,0,0,0,0]
[null,8,{"$f":"VLOOKUP(B35,$B$46:$C$53,2,0)","v":"VAGO-W.O"},null,null,0,"X",1,{"$f":"VLOOKUP(L35,$B$46:$C$53,2,0)","v":"LYAN-FFC"},null,null,2,{"$nulls":18},"LYAN-FFC",0,0,"VAGO-W.O",null,null,0,0,0,0]
[null,"7ª RODADA",{"$nulls":10},"MESA",{"$nulls":17},0,0,0,0,null,null,0,0,0,0]
[null,1,{"$f":"VLOOKUP(B37,$B$46:$C$53,2,0)","v":"ROMAR-CRVG"},null,null,5,"X",3,{"$f":"VLOOKUP(L37,$B$46:$C$53,2,0)","v":"LYAN-FFC"},null,null,2,4,{"$nulls":17},"ROMAR-CRVG",0,0,"LYAN-FFC",null,null,0,0,0,0]
[null,5,{"$f":"VLOOKUP(B38,$B$46:$C$53,2,0)","v":"B. ASSUMPÇÃO-BQ"},null,null,1,"X",0,{"$f":"VLOOKUP(L38,$B$46:$C$53,2,0)","v":"VAGO-W.O"},null,null,8,5,{"$nulls":17},"B. ASSUMPÇÃO-BQ",0,0,"VAGO-W.O",null,null,0,0,0,0]
[null,6,{"$f":"VLOOKUP(B39,$B$46:$C$53,2,0)","v":"MARCELO-BQ"},null,null,2,"X",3,{"$f":"VLOOKUP(L39,$B$46:$C$53,2,0)","v":"TAVARES-CRVG"},null,null,4,6,{"$nulls":17},"TAVARES-CRVG",0,0,"MARCELO-BQ",null,null,0,0,0,0]
[null,7,{"$f":"VLOOKUP(B40,$B$46:$C$53,2,0)","v":"P.CARUSO-AABB-DF"},null,null,2,"X",1,{"$f":"VLOOKUP(L40,$B$46:$C$53,2,0)","v":"FELIPE-CRF"},null,null,3,{"$nulls":18},"P.CARUSO-AABB-DF",0,0,"FELIPE-CRF",null,null,0,0,0,0]
[{"$nulls":30},0,0,0,0,null,null,0,0,0,0]
[{"$nulls":30},0,0,0,0,null,null,0,0,0,0]
[{"$nulls":36},0,0,0,0]
[null,"PONTOS"]
[null,"Equipes ",{"$nulls":3},"PG","J","V","E","D","GP","GC","SG","APROV"]
["1º",1,"ROMAR-CRVG",null,null,{"$f":"H46*3+I46*1","v":18},{"$f":"SUM(H46:J46)","v":7},{"$f":"COUNTIF($AE$7:$AE$40,C46)+COUNTIF($AK$7:$AK$40,C46)","v":6},{"$f":"COUNTIF($AF$7:$AG$40,C46)+COUNTIF($AL$7:$AM$37,C46)","v":0},{"$f":"COUNTIF($AH$7:$AH$40,C46)+COUNTIF($AN$7:$AN$37,C46)","v":1},{"$f":"SUMIF($C$7:$C$40,$C46,$F$7:$F$40)+SUMIF($I$7:$I$40,$C46,$H$7:$H$40)+SUMIF($O$7:$O$40,$C46,$R$7:$R$40)+SUMIF($U$7:$U$40,$C46,$T$7:$T$40)","v":21},{"$f":"SUMIF($C$7:$C$40,$C46,$H$7:$H$40)+SUMIF($I$7:$I$40,$C46,$F$7:$F$40)+SUMIF($O$7:$O$40,$C46,$T$7:$T$40)+SUMIF($U$7:$U$40,$C46,$R$7:$R$40)","v":11},{"$f":"K46-L46","v":10},{"$f":"F46/(G46*3)","v":{"v":0.8571428571428571,"d":"86%"}}]
["2º",3,"FELIPE-CRF",null,null,15,7,5,0,2,16,13,3,{"v":0.7142857142857143,"d":"71%"}]
["3º",7,"P.CARUSO-AABB-DF",null,null,13,7,4,1,2,16,13,3,{"v":0.6190476190476191,"d":"62%"}]
["4º",2,"LYAN-FFC",null,null,12,7,4,0,3,23,17,6,{"v":0.5714285714285714,"d":"57%"}]
["5º",4,"TAVARES-CRVG",null,null,12,7,4,0,3,21,21,0,{"v":0.5714285714285714,"d":"57%"}]
["6º",6,"MARCELO-BQ",null,null,7,7,2,1,4,9,17,-8,{"v":0.3333333333333333,"d":"33%"}]
["7º",5,"B. ASSUMPÇÃO-BQ",null,null,6,7,2,0,5,7,14,-7,{"v":0.2857142857142857,"d":"29%"}]
["8º",8,"VAGO-W.O",null,null,0,7,0,0,7,0,7,-7,{"v":0,"d":"0%"}]

{"sheet":"C","index":2,"n_rows":53,"n_cols":40,"rows_kept":53,"merged":[[1,1,1,23],[2,1,2,23],[3,1,3,23],[5,1,5,11],[6,2,6,4],[6,8,6,10],[6,14,6,16],[6,20,6,22],[7,2,7,4],[7,8,7,10],[7,14,7,16],[7,20,7,22],[8,2,8,4],[8,8,8,10],[8,14,8,16],[8,20,8,22],[9,2,9,4],[9,8,9,10],[9,14,9,16],[9,20,9,22],[10,1,10,11],[10,13,10,23],[11,2,11,4],[11,8,11,10],[11,14,11,16],[11,20,11,22],[12,2,12,4],[12,8,12,10],[12,14,12,16],[12,20,12,22],[13,2,13,4],[13,8,13,10],[13,14,13,16],[13,20,13,22],[14,2,14,4],[14,8,14,10],[14,14,14,16],[14,20,14,22],[15,1,15,11],[15,13,15,23],[16,2,16,4],[16,8,16,10],[16,14,16,16],[16,20,16,22],[17,2,17,4],[17,8,17,10],[17,14,17,16],[17,20,17,22],[18,2,18,4],[18,8,18,10],[18,14,18,16],[18,20,18,22],[19,2,19,4],[19,8,19,10],[19,14,19,16],[19,20,19,22],[20,1,20,11],[20,13,20,23],[21,2,21,4],[21,8,21,10],[21,14,21,16],[21,20,21,22],[22,2,22,4],[22,8,22,10],[22,14,22,16],[22,20,22,22],[23,2,23,4],[23,8,23,10],[23,14,23,16],[23,20,23,22],[24,2,24,4],[24,8,24,10],[24,14,24,16],[24,20,24,22],[25,1,25,11],[25,13,25,23],[26,2,26,4],[26,8,26,10],[26,14,26,16],[26,20,26,22],[27,2,27,4],[27,8,27,10],[27,14,27,16],[27,20,27,22],[28,2,28,4],[28,8,28,10],[28,14,28,16],[28,20,28,22],[29,2,29,4],[29,8,29,10],[29,14,29,16],[29,20,29,22],[30,1,30,11],[30,13,30,23],[31,2,31,4],[31,8,31,10],[31,14,31,16],[31,20,31,22],[32,2,32,4],[32,8,32,10],[32,14,32,16],[32,20,32,22],[33,2,33,4],[33,8,33,10],[33,14,33,16],[33,20,33,22],[34,2,34,4],[34,8,34,10],[34,14,34,16],[34,20,34,22],[35,1,35,11],[36,2,36,4],[36,8,36,10],[37,2,37,4],[37,8,37,10],[38,2,38,4],[38,8,38,10],[39,2,39,4],[39,8,39,10],[43,1,43,13],[44,1,44,4]]}
[]
[]
[]
[]
[{"$nulls":30},3,1,1,0,null,null,3,1,1,0]
[null,"1ª RODADA",{"$nulls":10},"MESA",{"$nulls":17},"Vitórias","Empates","Empates","Derrotas",null,null,"Vitórias","Empates","Empates","Derrotas"]
[null,1,{"$f":"VLOOKUP(B7,$B$46:$C$53,2,0)","v":"BRAYNER-CRVG"},null,null,1,"X",0,{"$f":"VLOOKUP(L7,$B$46:$C$53,2,0)","v":"VAGO-W.O"},null,null,8,7,{"$nulls":17},{"$f":"IF(F7>H7,C7,IF(F7=H7,0,I7))","v":"BRAYNER-CRVG"},{"$f":"(IF(F7<>\"-\",(IF(F7=H7,C7,0)),0))","v":0},{"$f":"(IF(F7<>\"-\",(IF(F7=H7,I7,0)),0))","v":0},{"$f":"IF(F7<H7,C7,IF(F7=H7,0,I7))","v":"VAGO-W.O"},null,null,{"$f":"IF(R7>T7,O7,IF(R7=T7,0,U7))","v":0},{"$f":"(IF(R7<>\"-\",(IF(R7=T7,O7,0)),0))","v":0},{"$f":"(IF(R7<>\"-\",(IF(R7=T7,U7,0)),0))","v":0},{"$f":"IF(R7<T7,O7,IF(R7=T7,0,U7))","v":0}]
[null,2,{"$f":"VLOOKUP(B8,$B$46:$C$53,2,0)","v":"ALMO-CC"},null,null,4,"X",3,{"$f":"VLOOKUP(L8,$B$46:$C$53,2,0)","v":"CARLOS-APCEF-DF"},null,null,7,8,{"$nulls":17},"ALMO-CC",0,0,"CARLOS-APCEF-DF",null,null,0,0,0,0]
[null,3,{"$f":"VLOOKUP(B9,$B$46:$C$53,2,0)","v":"GILBERTO-ASBAC"},null,null,2,"X",3,{"$f":"VLOOKUP(L9,$B$46:$C$53,2,0)","v":"GIUSEPE-BOT-DF"},null,null,6,9,{"$nulls":17},"GIUSEPE-BOT-DF",0,0,"GILBERTO-ASBAC",null,null,0,0,0,0]
[null,4,{"$f":"VLOOKUP(B10,$B$46:$C$53,2,0)","v":"REBEL-ADDP"},null,null,2,"X",1,{"$f":"VLOOKUP(L10,$B$46:$C$53,2,0)","v":"NILSON-CC"},null,null,5,{"$nulls":18},"REBEL-ADDP",0,0,"NILSON-CC",null,null,0,0,0,0]
[null,"2ª RODADA",{"$nulls":10},"MESA",{"$nulls":17},0,0,0,0,null,null,0,0,0,0]
[null,5,{"$f":"VLOOKUP(B12,$B$46:$C$53,2,0)","v":"NILSON-CC"},null,null,1,"X",4,{"$f":"VLOOKUP(L12,$B$46:$C$53,2,0)","v":"GILBERTO-ASBAC"},null,null,3,7,{"$nulls":17},"GILBERTO-ASBAC",0,0,"NILSON-CC",null,null,0,0,0,0]
[null,6,{"$f":"VLOOKUP(B13,$B$46:$C$53,2,0)","v":"GIUSEPE-BOT-DF"},null,null,1,"X",1,{"$f":"VLOOKUP(L13,$B$46:$C$53,2,0)","v":"ALMO-CC"},null,null,2,8,{"$nulls":17},0,"GIUSEPE-BOT-DF","ALMO-CC",0,null,null,0,0,0,0]
[null,7,{"$f":"VLOOKUP(B14,$B$46:$C$53,2,0)","v":"CARLOS-APCEF-DF"},null,null,2,"X",6,{"$f":"VLOOKUP(L14,$B$46:$C$53,2,0)","v":"BRAYNER-CRVG"},null,null,1,9,{"$nulls":17},"BRAYNER-CRVG",0,0,"CARLOS-APCEF-DF",null,null,0,0,0,0]
[null,8,{"$f":"VLOOKUP(B15,$B$46:$C$53,2,0)","v":"VAGO-W.O"},null,null,0,"X",1,{"$f":"VLOOKUP(L15,$B$46:$C$53,2,0)","v":"REBEL-ADDP"},null,null,4,{"$nulls":18},"REBEL-ADDP",0,0,"VAGO-W.O",null,null,0,0,0,0]
[null,"3ª RODADA",{"$nulls":10},"MESA",{"$nulls":17},0,0,0,0,null,null,0,0,0,0]
[null,1,{"$f":"VLOOKUP(B17,$B$46:$C$53,2,0)","v":"BRAYNER-CRVG"},null,null,2,"X",1,{"$f":"VLOOKUP(L17,$B$46:$C$53,2,0)","v":"GIUSEPE-BOT-DF"},null,null,6,7,{"$nulls":17},"BRAYNER-CRVG",0,0,"GIUSEPE-BOT-DF",null,null,0,0,0,0]
[null,2,{"$f":"VLOOKUP(B18,$B$46:$C$53,2,0)","v":"ALMO-CC"},null,null,2,"X",1,{"$f":"VLOOKUP(L18,$B$46:$C$53,2,0)","v":"NILSON-CC"},null,null,5,8,{"$nulls":17},"ALMO-CC",0,0,"NILSON-CC",null,null,0,0,0,0]
[null,3,{"$f":"VLOOKUP(B19,$B$46:$C$53,2,0)","v":"GILBERTO-ASBAC"},null,null,6,"X",3,{"$f":"VLOOKUP(L19,$B$46:$C$53,2,0)","v":"REBEL-ADDP"},null,null,4,9,{"$nulls":17},"GILBERTO-ASBAC",0,0,"REBEL-ADDP",null,null,0,0,0,0]
[null,7,{"$f":"VLOOKUP(B20,$B$46:$C$53,2,0)","v":"CARLOS-APCEF-DF"},null,null,1,"X",0,{"$f":"VLOOKUP(L20,$B$46:$C$53,2,0)","v":"VAGO-W.O"},null,null,8,{"$nulls":18},"CARLOS-APCEF-DF",0,0,"VAGO-W.O",null,null,0,0,0,0]
[null,"4ª RODADA",{"$nulls":10},"MESA",{"$nulls":17},0,0,0,0,null,null,0,0,0,0]
[null,3,{"$f":"VLOOKUP(B22,$B$46:$C$53,2,0)","v":"GILBERTO-ASBAC"},null,null,1,"X",0,{"$f":"VLOOKUP(L22,$B$46:$C$53,2,0)","v":"VAGO-W.O"},null,null,8,7,{"$nulls":17},"GILBERTO-ASBAC",0,0,"VAGO-W.O",null,null,0,0,0,0]
[null,4,{"$f":"VLOOKUP(B23,$B$46:$C$53,2,0)","v":"REBEL-ADDP"},null,null,2,"X",3,{"$f":"VLOOKUP(L23,$B$46:$C$53,2,0)","v":"ALMO-CC"},null,null,2,8,{"$nulls":17},"ALMO-CC",0,0,"REBEL-ADDP",null,null,0,0,0,0]
[null,5,{"$f":"VLOOKUP(B24,$B$46:$C$53,2,0)","v":"NILSON-CC"},null,null,1,"X",2,{"$f":"VLOOKUP(L24,$B$46:$C$53,2,0)","v":"BRAYNER-CRVG"},null,null,1,9,{"$nulls":17},"BRAYNER-CRVG",0,0,"NILSON-CC",null,null,0,0,0,0]
[null,6,{"$f":"VLOOKUP(B25,$B$46:$C$53,2,0)","v":"GIUSEPE-BOT-DF"},null,null,4,"X",3,{"$f":"VLOOKUP(L25,$B$46:$C$53,2,0)","v":"CARLOS-APCEF-DF"},null,null,7,{"$nulls":18},"GIUSEPE-BOT-DF",0,0,"CARLOS-APCEF-DF",null,null,0,0,0,0]
[null,"5ª RODADA",{"$nulls":10},"MESA",{"$nulls":17},0,0,0,0,null,null,0,0,0,0]
[null,1,{"$f":"VLOOKUP(B27,$B$46:$C$53,2,0)","v":"BRAYNER-CRVG"},null,null,5,"X",1,{"$f":"VLOOKUP(L27,$B$46:$C$53,2,0)","v":"REBEL-ADDP"},null,null,4,7,{"$nulls":17},"BRAYNER-CRVG",0,0,"REBEL-ADDP",null,null,0,0,0,0]
[null,2,{"$f":"VLOOKUP(B28,$B$46:$C$53,2,0)","v":"ALMO-CC"},null,null,5,"X",2,{"$f":"VLOOKUP(L28,$B$46:$C$53,2,0)","v":"GILBERTO-ASBAC"},null,null,3,8,{"$nulls":17},"ALMO-CC",0,0,"GILBERTO-ASBAC",null,null,0,0,0,0]
[null,7,{"$f":"VLOOKUP(B29,$B$46:$C$53,2,0)","v":"CARLOS-APCEF-DF"},null,null,1,"X",4,{"$f":"VLOOKUP(L29,$B$46:$C$53,2,0)","v":"NILSON-CC"},null,null,5,9,{"$nulls":17},"NILSON-CC",0,0,"CARLOS-APCEF-DF",null,null,0,0,0,0]
[null,8,{"$f":"VLOOKUP(B30,$B$46:$C$53,2,0)","v":"VAGO-W.O"},null,null,0,"X",1,{"$f":"VLOOKUP(L30,$B$46:$C$53,2,0)","v":"GIUSEPE-BOT-DF"},null,null,6,{"$nulls":18},"GIUSEPE-BOT-DF",0,0,"VAGO-W.O",null,null,0,0,0,0]
[null,"6ª RODADA",{"$nulls":10},"MESA",{"$nulls":17},0,0,0,0,null,null,0,0,0,0]
[null,3,{"$f":"VLOOKUP(B32,$B$46:$C$53,2,0)","v":"GILBERTO-ASBAC"},null,null,2,"X",5,{"$f":"VLOOKUP(L32,$B$46:$C$53,2,0)","v":"BRAYNER-CRVG"},null,null,1,7,{"$nulls":17},"BRAYNER-CRVG",0,0,"GILBERTO-ASBAC",null,null,0,0,0,0]
[null,4,{"$f":"VLOOKUP(B33,$B$46:$C$53,2,0)","v":"REBEL-ADDP"},null,null,2,"X",1,{"$f":"VLOOKUP(L33,$B$46:$C$53,2,0)","v":"CARLOS-APCEF-DF"},null,null,7,8,{"$nulls":17},"REBEL-ADDP",0,0,"CARLOS-APCEF-DF",null,null,0,0,0,0]
[null,5,{"$f":"VLOOKUP(B34,$B$46:$C$53,2,0)","v":"NILSON-CC"},null,null,1,"X",2,{"$f":"VLOOKUP(L34,$B$46:$C$53,2,0)","v":"GIUSEPE-BOT-DF"},null,null,6,9,{"$nulls":17},"GIUSEPE-BOT-DF",0,0,"NILSON-CC",null,null,0,0,0,0]
[null,8,{"$f":"VLOOKUP(B35,$B$46:$C$53,2,0)","v":"VAGO-W.O"},null,null,0,"X",1,{"$f":"VLOOKUP(L35,$B$46:$C$53,2,0)","v":"ALMO-CC"},null,null,2,{"$nulls":18},"ALMO-CC",0,0,"VAGO-W.O",null,null,0,0,0,0]
[null,"7ª RODADA",{"$nulls":10},"MESA",{"$nulls":17},0,0,0,0,null,null,0,0,0,0]
[null,1,{"$f":"VLOOKUP(B37,$B$46:$C$53,2,0)","v":"BRAYNER-CRVG"},null,null,5,"X",5,{"$f":"VLOOKUP(L37,$B$46:$C$53,2,0)","v":"ALMO-CC"},null,null,2,7,{"$nulls":17},0,"BRAYNER-CRVG","ALMO-CC",0,null,null,0,0,0,0]
[null,5,{"$f":"VLOOKUP(B38,$B$46:$C$53,2,0)","v":"NILSON-CC"},null,null,1,"X",0,{"$f":"VLOOKUP(L38,$B$46:$C$53,2,0)","v":"VAGO-W.O"},null,null,8,8,{"$nulls":17},"NILSON-CC",0,0,"VAGO-W.O",null,null,0,0,0,0]
[null,6,{"$f":"VLOOKUP(B39,$B$46:$C$53,2,0)","v":"GIUSEPE-BOT-DF"},null,null,4,"X",1,{"$f":"VLOOKUP(L39,$B$46:$C$53,2,0)","v":"REBEL-ADDP"},null,null,4,9,{"$nulls":17},"GIUSEPE-BOT-DF",0,0,"REBEL-ADDP",null,null,0,0,0,0]
[null,7,{"$f":"VLOOKUP(B40,$B$46:$C$53,2,0)","v":"CARLOS-APCEF-DF"},null,null,3,"X",2,{"$f":"VLOOKUP(L40,$B$46:$C$53,2,0)","v":"GILBERTO-ASBAC"},null,null,3,{"$nulls":18},"CARLOS-APCEF-DF",0,0,"GILBERTO-ASBAC",null,null,0,0,0,0]
[{"$nulls":30},0,0,0,0,null,null,0,0,0,0]
[{"$nulls":30},0,0,0,0,null,null,0,0,0,0]
[{"$nulls":36},0,0,0,0]
[null,"PONTOS"]
[null,"Equipes ",{"$nulls":3},"PG","J","V","E","D","GP","GC","SG","APROV"]
["1º",1,"BRAYNER-CRVG",null,null,{"$f":"H46*3+I46*1","v":19},{"$f":"SUM(H46:J46)","v":7},{"$f":"COUNTIF($AE$7:$AE$40,C46)+COUNTIF($AK$7:$AK$40,C46)","v":6},{"$f":"COUNTIF($AF$7:$AG$40,C46)+COUNTIF($AL$7:$AM$37,C46)","v":1},{"$f":"COUNTIF($AH$7:$AH$40,C46)+COUNTIF($AN$7:$AN$37,C46)","v":0},{"$f":"SUMIF($C$7:$C$40,$C46,$F$7:$F$40)+SUMIF($I$7:$I$40,$C46,$H$7:$H$40)+SUMIF($O$7:$O$40,$C46,$R$7:$R$40)+SUMIF($U$7:$U$40,$C46,$T$7:$T$40)","v":26},{"$f":"SUMIF($C$7:$C$40,$C46,$H$7:$H$40)+SUMIF($I$7:$I$40,$C46,$F$7:$F$40)+SUMIF($O$7:$O$40,$C46,$T$7:$T$40)+SUMIF($U$7:$U$40,$C46,$R$7:$R$40)","v":12},{"$f":"K46-L46","v":14},{"$f":"F46/(G46*3)","v":{"v":0.9047619047619048,"d":"90%"}}]
["2º",2,"ALMO-CC",null,null,17,7,5,2,0,21,14,7,{"v":0.8095238095238095,"d":"81%"}]
["3º",6,"GIUSEPE-BOT-DF",null,null,16,7,5,1,1,16,10,6,{"v":0.7619047619047619,"d":"76%"}]
["4º",3,"GILBERTO-ASBAC",null,null,9,7,3,0,4,19,20,-1,{"v":0.42857142857142855,"d":"43%"}]
["5º",4,"REBEL-ADDP",null,null,9,7,3,0,4,12,20,-8,{"v":0.42857142857142855,"d":"43%"}]
["6º",5,"NILSON-CC",null,null,6,7,2,0,5,10,13,-3,{"v":0.2857142857142857,"d":"29%"}]
["7º",7,"CARLOS-APCEF-DF",null,null,6,7,2,0,5,14,22,-8,{"v":0.2857142857142857,"d":"29%"}]
["8º",8,"VAGO-W.O",null,null,0,7,0,0,7,0,7,-7,{"v":0,"d":"0%"}]

{"sheet":"D","index":3,"n_rows":53,"n_cols":40,"rows_kept":53,"merged":[[1,1,1,23],[2,1,2,23],[3,1,3,23],[5,1,5,11],[6,2,6,4],[6,8,6,10],[6,14,6,16],[6,20,6,22],[7,2,7,4],[7,8,7,10],[7,14,7,16],[7,20,7,22],[8,2,8,4],[8,8,8,10],[8,14,8,16],[8,20,8,22],[9,2,9,4],[9,8,9,10],[9,14,9,16],[9,20,9,22],[10,1,10,11],[10,13,10,23],[11,2,11,4],[11,8,11,10],[11,14,11,16],[11,20,11,22],[12,2,12,4],[12,8,12,10],[12,14,12,16],[12,20,12,22],[13,2,13,4],[13,8,13,10],[13,14,13,16],[13,20,13,22],[14,2,14,4],[14,8,14,10],[14,14,14,16],[14,20,14,22],[15,1,15,11],[15,13,15,23],[16,2,16,4],[16,8,16,10],[16,14,16,16],[16,20,16,22],[17,2,17,4],[17,8,17,10],[17,14,17,16],[17,20,17,22],[18,2,18,4],[18,8,18,10],[18,14,18,16],[18,20,18,22],[19,2,19,4],[19,8,19,10],[19,14,19,16],[19,20,19,22],[20,1,20,11],[20,13,20,23],[21,2,21,4],[21,8,21,10],[21,14,21,16],[21,20,21,22],[22,2,22,4],[22,8,22,10],[22,14,22,16],[22,20,22,22],[23,2,23,4],[23,8,23,10],[23,14,23,16],[23,20,23,22],[24,2,24,4],[24,8,24,10],[24,14,24,16],[24,20,24,22],[25,1,25,11],[25,13,25,23],[26,2,26,4],[26,8,26,10],[26,14,26,16],[26,20,26,22],[27,2,27,4],[27,8,27,10],[27,14,27,16],[27,20,27,22],[28,2,28,4],[28,8,28,10],[28,14,28,16],[28,20,28,22],[29,2,29,4],[29,8,29,10],[29,14,29,16],[29,20,29,22],[30,1,30,11],[30,13,30,23],[31,2,31,4],[31,8,31,10],[31,14,31,16],[31,20,31,22],[32,2,32,4],[32,8,32,10],[32,14,32,16],[32,20,32,22],[33,2,33,4],[33,8,33,10],[33,14,33,16],[33,20,33,22],[34,2,34,4],[34,8,34,10],[34,14,34,16],[34,20,34,22],[35,1,35,11],[36,2,36,4],[36,8,36,10],[37,2,37,4],[37,8,37,10],[38,2,38,4],[38,8,38,10],[39,2,39,4],[39,8,39,10],[43,1,43,13],[44,1,44,4]]}
[]
[]
[]
[]
[{"$nulls":30},3,1,1,0,null,null,3,1,1,0]
[null,"1ª RODADA",{"$nulls":10},"MESA",{"$nulls":17},"Vitórias","Empates","Empates","Derrotas",null,null,"Vitórias","Empates","Empates","Derrotas"]
[null,1,{"$f":"VLOOKUP(B7,$B$46:$C$53,2,0)","v":"RICARDO-CRF"},null,null,1,"X",0,{"$f":"VLOOKUP(L7,$B$46:$C$53,2,0)","v":"VAGO-W.O"},null,null,8,10,{"$nulls":17},{"$f":"IF(F7>H7,C7,IF(F7=H7,0,I7))","v":"RICARDO-CRF"},{"$f":"(IF(F7<>\"-\",(IF(F7=H7,C7,0)),0))","v":0},{"$f":"(IF(F7<>\"-\",(IF(F7=H7,I7,0)),0))","v":0},{"$f":"IF(F7<H7,C7,IF(F7=H7,0,I7))","v":"VAGO-W.O"},null,null,{"$f":"IF(R7>T7,O7,IF(R7=T7,0,U7))","v":0},{"$f":"(IF(R7<>\"-\",(IF(R7=T7,O7,0)),0))","v":0},{"$f":"(IF(R7<>\"-\",(IF(R7=T7,U7,0)),0))","v":0},{"$f":"IF(R7<T7,O7,IF(R7=T7,0,U7))","v":0}]
[null,2,{"$f":"VLOOKUP(B8,$B$46:$C$53,2,0)","v":"LOPES-RIVER"},null,null,2,"X",2,{"$f":"VLOOKUP(L8,$B$46:$C$53,2,0)","v":"EDWARD-BQ"},null,null,7,11,{"$nulls":17},0,"LOPES-RIVER","EDWARD-BQ",0,null,null,0,0,0,0]
[null,3,{"$f":"VLOOKUP(B9,$B$46:$C$53,2,0)","v":"DANIEL-CRVG"},null,null,0,"X",1,{"$f":"VLOOKUP(L9,$B$46:$C$53,2,0)","v":"ROGÉRIO-APCEF"},null,null,6,12,{"$nulls":17},"ROGÉRIO-APCEF",0,0,"DANIEL-CRVG",null,null,0,0,0,0]
[null,4,{"$f":"VLOOKUP(B10,$B$46:$C$53,2,0)","v":"LUCIANO-CRF"},null,null,2,"X",1,{"$f":"VLOOKUP(L10,$B$46:$C$53,2,0)","v":"KLAUS-APCEF"},null,null,5,{"$nulls":18},"LUCIANO-CRF",0,0,"KLAUS-APCEF",null,null,0,0,0,0]
[null,"2ª RODADA",{"$nulls":10},"MESA",{"$nulls":17},0,0,0,0,null,null,0,0,0,0]
[null,5,{"$f":"VLOOKUP(B12,$B$46:$C$53,2,0)","v":"KLAUS-APCEF"},null,null,1,"X",0,{"$f":"VLOOKUP(L12,$B$46:$C$53,2,0)","v":"DANIEL-CRVG"},null,null,3,10,{"$nulls":17},"KLAUS-APCEF",0,0,"DANIEL-CRVG",null,null,0,0,0,0]
[null,6,{"$f":"VLOOKUP(B13,$B$46:$C$53,2,0)","v":"ROGÉRIO-APCEF"},null,null,0,"X",2,{"$f":"VLOOKUP(L13,$B$46:$C$53,2,0)","v":"LOPES-RIVER"},null,null,2,11,{"$nulls":17},"LOPES-RIVER",0,0,"ROGÉRIO-APCEF",null,null,0,0,0,0]
[null,7,{"$f":"VLOOKUP(B14,$B$46:$C$53,2,0)","v":"EDWARD-BQ"},null,null,2,"X",1,{"$f":"VLOOKUP(L14,$B$46:$C$53,2,0)","v":"RICARDO-CRF"},null,null,1,12,{"$nulls":17},"EDWARD-BQ",0,0,"RICARDO-CRF",null,null,0,0,0,0]
[null,8,{"$f":"VLOOKUP(B15,$B$46:$C$53,2,0)","v":"VAGO-W.O"},null,null,0,"X",1,{"$f":"VLOOKUP(L15,$B$46:$C$53,2,0)","v":"LUCIANO-CRF"},null,null,4,{"$nulls":18},"LUCIANO-CRF",0,0,"VAGO-W.O",null,null,0,0,0,0]
[null,"3ª RODADA",{"$nulls":10},"MESA",{"$nulls":17},0,0,0,0,null,null,0,0,0,0]
[null,1,{"$f":"VLOOKUP(B17,$B$46:$C$53,2,0)","v":"RICARDO-CRF"},null,null,4,"X",3,{"$f":"VLOOKUP(L17,$B$46:$C$53,2,0)","v":"ROGÉRIO-APCEF"},null,null,6,10,{"$nulls":17},"RICARDO-CRF",0,0,"ROGÉRIO-APCEF",null,null,0,0,0,0]
[null,2,{"$f":"VLOOKUP(B18,$B$46:$C$53,2,0)","v":"LOPES-RIVER"},null,null,6,"X",2,{"$f":"VLOOKUP(L18,$B$46:$C$53,2,0)","v":"KLAUS-APCEF"},null,null,5,11,{"$nulls":17},"LOPES-RIVER",0,0,"KLAUS-APCEF",null,null,0,0,0,0]
[null,3,{"$f":"VLOOKUP(B19,$B$46:$C$53,2,0)","v":"DANIEL-CRVG"},null,null,0,"X",1,{"$f":"VLOOKUP(L19,$B$46:$C$53,2,0)","v":"LUCIANO-CRF"},null,null,4,12,{"$nulls":17},"LUCIANO-CRF",0,0,"DANIEL-CRVG",null,null,0,0,0,0]
[null,7,{"$f":"VLOOKUP(B20,$B$46:$C$53,2,0)","v":"EDWARD-BQ"},null,null,1,"X",0,{"$f":"VLOOKUP(L20,$B$46:$C$53,2,0)","v":"VAGO-W.O"},null,null,8,{"$nulls":18},"EDWARD-BQ",0,0,"VAGO-W.O",null,null,0,0,0,0]
[null,"4ª RODADA",{"$nulls":10},"MESA",{"$nulls":17},0,0,0,0,null,null,0,0,0,0]
[null,3,{"$f":"VLOOKUP(B22,$B$46:$C$53,2,0)","v":"DANIEL-CRVG"},null,null,0,"X",0,{"$f":"VLOOKUP(L22,$B$46:$C$53,2,0)","v":"VAGO-W.O"},null,null,8,10,{"$nulls":17},0,"DANIEL-CRVG","VAGO-W.O",0,null,null,0,0,0,0]
[null,4,{"$f":"VLOOKUP(B23,$B$46:$C$53,2,0)","v":"LUCIANO-CRF"},null,null,3,"X",3,{"$f":"VLOOKUP(L23,$B$46:$C$53,2,0)","v":"LOPES-RIVER"},null,null,2,11,{"$nulls":17},0,"LUCIANO-CRF","LOPES-RIVER",0,null,null,0,0,0,0]
[null,5,{"$f":"VLOOKUP(B24,$B$46:$C$53,2,0)","v":"KLAUS-APCEF"},null,null,3,"X",7,{"$f":"VLOOKUP(L24,$B$46:$C$53,2,0)","v":"RICARDO-CRF"},null,null,1,12,{"$nulls":17},"RICARDO-CRF",0,0,"KLAUS-APCEF",null,null,0,0,0,0]
[null,6,{"$f":"VLOOKUP(B25,$B$46:$C$53,2,0)","v":"ROGÉRIO-APCEF"},null,null,2,"X",2,{"$f":"VLOOKUP(L25,$B$46:$C$53,2,0)","v":"EDWARD-BQ"},null,null,7,{"$nulls":18},0,"ROGÉRIO-APCEF","EDWARD-BQ",0,null,null,0,0,0,0]
[null,"5ª RODADA",{"$nulls":10},"MESA",{"$nulls":17},0,0,0,0,null,null,0,0,0,0]
[null,1,{"$f":"VLOOKUP(B27,$B$46:$C$53,2,0)","v":"RICARDO-CRF"},null,null,4,"X",1,{"$f":"VLOOKUP(L27,$B$46:$C$53,2,0)","v":"LUCIANO-CRF"},null,null,4,10,{"$nulls":17},"RICARDO-CRF",0,0,"LUCIANO-CRF",null,null,0,0,0,0]
[null,2,{"$f":"VLOOKUP(B28,$B$46:$C$53,2,0)","v":"LOPES-RIVER"},null,null,1,"X",0,{"$f":"VLOOKUP(L28,$B$46:$C$53,2,0)","v":"DANIEL-CRVG"},null,null,3,11,{"$nulls":17},"LOPES-RIVER",0,0,"DANIEL-CRVG",null,null,0,0,0,0]
[null,7,{"$f":"VLOOKUP(B29,$B$46:$C$53,2,0)","v":"EDWARD-BQ"},null,null,2,"X",1,{"$f":"VLOOKUP(L29,$B$46:$C$53,2,0)","v":"KLAUS-APCEF"},null,null,5,12,{"$nulls":17},"EDWARD-BQ",0,0,"KLAUS-APCEF",null,null,0,0,0,0]
[null,8,{"$f":"VLOOKUP(B30,$B$46:$C$53,2,0)","v":"VAGO-W.O"},null,null,0,"X",1,{"$f":"VLOOKUP(L30,$B$46:$C$53,2,0)","v":"ROGÉRIO-APCEF"},null,null,6,{"$nulls":18},"ROGÉRIO-APCEF",0,0,"VAGO-W.O",null,null,0,0,0,0]
[null,"6ª RODADA",{"$nulls":10},"MESA",{"$nulls":17},0,0,0,0,null,null,0,0,0,0]
[null,3,{"$f":"VLOOKUP(B32,$B$46:$C$53,2,0)","v":"DANIEL-CRVG"},null,null,0,"X",1,{"$f":"VLOOKUP(L32,$B$46:$C$53,2,0)","v":"RICARDO-CRF"},null,null,1,10,{"$nulls":17},"RICARDO-CRF",0,0,"DANIEL-CRVG",null,null,0,0,0,0]
[null,4,{"$f":"VLOOKUP(B33,$B$46:$C$53,2,0)","v":"LUCIANO-CRF"},null,null,3,"X",1,{"$f":"VLOOKUP(L33,$B$46:$C$53,2,0)","v":"EDWARD-BQ"},null,null,7,11,{"$nulls":17},"LUCIANO-CRF",0,0,"EDWARD-BQ",null,null,0,0,0,0]
[null,5,{"$f":"VLOOKUP(B34,$B$46:$C$53,2,0)","v":"KLAUS-APCEF"},null,null,1,"X",3,{"$f":"VLOOKUP(L34,$B$46:$C$53,2,0)","v":"ROGÉRIO-APCEF"},null,null,6,12,{"$nulls":17},"ROGÉRIO-APCEF",0,0,"KLAUS-APCEF",null,null,0,0,0,0]
[null,8,{"$f":"VLOOKUP(B35,$B$46:$C$53,2,0)","v":"VAGO-W.O"},null,null,0,"X",1,{"$f":"VLOOKUP(L35,$B$46:$C$53,2,0)","v":"LOPES-RIVER"},null,null,2,{"$nulls":18},"LOPES-RIVER",0,0,"VAGO-W.O",null,null,0,0,0,0]
[null,"7ª RODADA",{"$nulls":10},"MESA",{"$nulls":17},0,0,0,0,null,null,0,0,0,0]
[null,1,{"$f":"VLOOKUP(B37,$B$46:$C$53,2,0)","v":"RICARDO-CRF"},null,null,4,"X",3,{"$f":"VLOOKUP(L37,$B$46:$C$53,2,0)","v":"LOPES-RIVER"},null,null,2,10,{"$nulls":17},"RICARDO-CRF",0,0,"LOPES-RIVER",null,null,0,0,0,0]
[null,5,{"$f":"VLOOKUP(B38,$B$46:$C$53,2,0)","v":"KLAUS-APCEF"},null,null,1,"X",0,{"$f":"VLOOKUP(L38,$B$46:$C$53,2,0)","v":"VAGO-W.O"},null,null,8,11,{"$nulls":17},"KLAUS-APCEF",0,0,"VAGO-W.O",null,null,0,0,0,0]
[null,6,{"$f":"VLOOKUP(B39,$B$46:$C$53,2,0)","v":"ROGÉRIO-APCEF"},null,null,0,"X",1,{"$f":"VLOOKUP(L39,$B$46:$C$53,2,0)","v":"LUCIANO-CRF"},null,null,4,12,{"$nulls":17},"LUCIANO-CRF",0,0,"ROGÉRIO-APCEF",null,null,0,0,0,0]
[null,7,{"$f":"VLOOKUP(B40,$B$46:$C$53,2,0)","v":"EDWARD-BQ"},null,null,1,"X",0,{"$f":"VLOOKUP(L40,$B$46:$C$53,2,0)","v":"DANIEL-CRVG"},null,null,3,{"$nulls":18},"EDWARD-BQ",0,0,"DANIEL-CRVG",null,null,0,0,0,0]
[{"$nulls":30},0,0,0,0,null,null,0,0,0,0]
[{"$nulls":30},0,0,0,0,null,null,0,0,0,0]
[{"$nulls":36},0,0,0,0]
[null,"PONTOS"]
[null,"Equipes ",{"$nulls":3},"PG","J","V","E","D","GP","GC","SG","APROV"]
["1º",1,"RICARDO-CRF",null,null,{"$f":"H46*3+I46*1","v":18},{"$f":"SUM(H46:J46)","v":7},{"$f":"COUNTIF($AE$7:$AE$40,C46)+COUNTIF($AK$7:$AK$40,C46)","v":6},{"$f":"COUNTIF($AF$7:$AG$40,C46)+COUNTIF($AL$7:$AM$37,C46)","v":0},{"$f":"COUNTIF($AH$7:$AH$40,C46)+COUNTIF($AN$7:$AN$37,C46)","v":1},{"$f":"SUMIF($C$7:$C$40,$C46,$F$7:$F$40)+SUMIF($I$7:$I$40,$C46,$H$7:$H$40)+SUMIF($O$7:$O$40,$C46,$R$7:$R$40)+SUMIF($U$7:$U$40,$C46,$T$7:$T$40)","v":22},{"$f":"SUMIF($C$7:$C$40,$C46,$H$7:$H$40)+SUMIF($I$7:$I$40,$C46,$F$7:$F$40)+SUMIF($O$7:$O$40,$C46,$T$7:$T$40)+SUMIF($U$7:$U$40,$C46,$R$7:$R$40)","v":12},{"$f":"K46-L46","v":10},{"$f":"F46/(G46*3)","v":{"v":0.8571428571428571,"d":"86%"}}]
["2º",4,"LUCIANO-CRF",null,null,16,7,5,1,1,12,9,3,{"v":0.7619047619047619,"d":"76%"}]
["3º",2,"LOPES-RIVER",null,null,14,7,4,2,1,18,11,7,{"v":0.6666666666666666,"d":"67%"}]
["4º",7,"EDWARD-BQ",null,null,14,7,4,2,1,11,9,2,{"v":0.6666666666666666,"d":"67%"}]
["5º",6,"ROGÉRIO-APCEF",null,null,10,7,3,1,3,10,10,0,{"v":0.47619047619047616,"d":"48%"}]
["6º",5,"KLAUS-APCEF",null,null,6,7,2,0,5,10,20,-10,{"v":0.2857142857142857,"d":"29%"}]
["7º",3,"DANIEL-CRVG",null,null,1,7,0,1,6,0,6,-6,{"v":0.047619047619047616,"d":"5%"}]
["8º",8,"VAGO-W.O",null,null,1,7,0,1,6,0,6,-6,{"v":0.047619047619047616,"d":"5%"}]

{"sheet":"E","index":4,"n_rows":53,"n_cols":40,"rows_kept":53,"merged":[[1,1,1,23],[2,1,2,23],[3,1,3,23],[5,1,5,11],[6,2,6,4],[6,8,6,10],[6,14,6,16],[6,20,6,22],[7,2,7,4],[7,8,7,10],[7,14,7,16],[7,20,7,22],[8,2,8,4],[8,8,8,10],[8,14,8,16],[8,20,8,22],[9,2,9,4],[9,8,9,10],[9,14,9,16],[9,20,9,22],[10,1,10,11],[10,13,10,23],[11,2,11,4],[11,8,11,10],[11,14,11,16],[11,20,11,22],[12,2,12,4],[12,8,12,10],[12,14,12,16],[12,20,12,22],[13,2,13,4],[13,8,13,10],[13,14,13,16],[13,20,13,22],[14,2,14,4],[14,8,14,10],[14,14,14,16],[14,20,14,22],[15,1,15,11],[15,13,15,23],[16,2,16,4],[16,8,16,10],[16,14,16,16],[16,20,16,22],[17,2,17,4],[17,8,17,10],[17,14,17,16],[17,20,17,22],[18,2,18,4],[18,8,18,10],[18,14,18,16],[18,20,18,22],[19,2,19,4],[19,8,19,10],[19,14,19,16],[19,20,19,22],[20,1,20,11],[20,13,20,23],[21,2,21,4],[21,8,21,10],[21,14,21,16],[21,20,21,22],[22,2,22,4],[22,8,22,10],[22,14,22,16],[22,20,22,22],[23,2,23,4],[23,8,23,10],[23,14,23,16],[23,20,23,22],[24,2,24,4],[24,8,24,10],[24,14,24,16],[24,20,24,22],[25,1,25,11],[25,13,25,23],[26,2,26,4],[26,8,26,10],[26,14,26,16],[26,20,26,22],[27,2,27,4],[27,8,27,10],[27,14,27,16],[27,20,27,22],[28,2,28,4],[28,8,28,10],[28,14,28,16],[28,20,28,22],[29,2,29,4],[29,8,29,10],[29,14,29,16],[29,20,29,22],[30,1,30,11],[30,13,30,23],[31,2,31,4],[31,8,31,10],[31,14,31,16],[31,20,31,22],[32,2,32,4],[32,8,32,10],[32,14,32,16],[32,20,32,22],[33,2,33,4],[33,8,33,10],[33,14,33,16],[33,20,33,22],[34,2,34,4],[34,8,34,10],[34,14,34,16],[34,20,34,22],[35,1,35,11],[36,2,36,4],[36,8,36,10],[37,2,37,4],[37,8,37,10],[38,2,38,4],[38,8,38,10],[39,2,39,4],[39,8,39,10],[43,1,43,13],[44,1,44,4]]}
[]
[]
[]
[]
[{"$nulls":30},3,1,1,0,null,null,3,1,1,0]
[null,"1ª RODADA",{"$nulls":10},"MESA",{"$nulls":17},"Vitórias","Empates","Empates","Derrotas",null,null,"Vitórias","Empates","Empates","Derrotas"]
[null,1,{"$f":"VLOOKUP(B7,$B$46:$C$53,2,0)","v":"RONALD-CRF"},null,null,1,"X",0,{"$f":"VLOOKUP(L7,$B$46:$C$53,2,0)","v":"VAGO-W.O"},null,null,8,13,{"$nulls":17},{"$f":"IF(F7>H7,C7,IF(F7=H7,0,I7))","v":"RONALD-CRF"},{"$f":"(IF(F7<>\"-\",(IF(F7=H7,C7,0)),0))","v":0},{"$f":"(IF(F7<>\"-\",(IF(F7=H7,I7,0)),0))","v":0},{"$f":"IF(F7<H7,C7,IF(F7=H7,0,I7))","v":"VAGO-W.O"},null,null,{"$f":"IF(R7>T7,O7,IF(R7=T7,0,U7))","v":0},{"$f":"(IF(R7<>\"-\",(IF(R7=T7,O7,0)),0))","v":0},{"$f":"(IF(R7<>\"-\",(IF(R7=T7,U7,0)),0))","v":0},{"$f":"IF(R7<T7,O7,IF(R7=T7,0,U7))","v":0}]
[null,2,{"$f":"VLOOKUP(B8,$B$46:$C$53,2,0)","v":"MATOSO-CRVG"},null,null,1,"X",1,{"$f":"VLOOKUP(L8,$B$46:$C$53,2,0)","v":"ARMANDO-PE"},null,null,7,14,{"$nulls":17},{"$f":"IF(F8>H8,C8,IF(F8=H8,0,I8))","v":0},{"$f":"(IF(F8<>\"-\",(IF(F8=H8,C8,0)),0))","v":"MATOSO-CRVG"},{"$f":"(IF(F8<>\"-\",(IF(F8=H8,I8,0)),0))","v":"ARMANDO-PE"},{"$f":"IF(F8<H8,C8,IF(F8=H8,0,I8))","v":0},null,null,{"$f":"IF(R8>T8,O8,IF(R8=T8,0,U8))","v":0},{"$f":"(IF(R8<>\"-\",(IF(R8=T8,O8,0)),0))","v":0},{"$f":"(IF(R8<>\"-\",(IF(R8=T8,U8,0)),0))","v":0},{"$f":"IF(R8<T8,O8,IF(R8=T8,0,U8))","v":0}]
[null,3,{"$f":"VLOOKUP(B9,$B$46:$C$53,2,0)","v":"L.HENRIQUE-TUPI"},null,null,3,"X",2,{"$f":"VLOOKUP(L9,$B$46:$C$53,2,0)","v":"MARCUS-BQ"},null,null,6,15,{"$nulls":17},"L.HENRIQUE-TUPI",0,0,"MARCUS-BQ",null,null,0,0,0,0]
[null,4,{"$f":"VLOOKUP(B10,$B$46:$C$53,2,0)","v":"MENDEZ-CRVG"},null,null,3,"X",2,{"$f":"VLOOKUP(L10,$B$46:$C$53,2,0)","v":"ANDRÉ-BQ"},null,null,5,{"$nulls":18},"MENDEZ-CRVG",0,0,"ANDRÉ-BQ",null,null,0,0,0,0]
[null,"2ª RODADA",{"$nulls":10},"MESA",{"$nulls":17},0,0,0,0,null,null,0,0,0,0]
[null,5,{"$f":"VLOOKUP(B12,$B$46:$C$53,2,0)","v":"ANDRÉ-BQ"},null,null,1,"X",2,{"$f":"VLOOKUP(L12,$B$46:$C$53,2,0)","v":"L.HENRIQUE-TUPI"},null,null,3,13,{"$nulls":17},"L.HENRIQUE-TUPI",0,0,"ANDRÉ-BQ",null,null,0,0,0,0]
[null,6,{"$f":"VLOOKUP(B13,$B$46:$C$53,2,0)","v":"MARCUS-BQ"},null,null,2,"X",3,{"$f":"VLOOKUP(L13,$B$46:$C$53,2,0)","v":"MATOSO-CRVG"},null,null,2,14,{"$nulls":17},"MATOSO-CRVG",0,0,"MARCUS-BQ",null,null,0,0,0,0]
[null,7,{"$f":"VLOOKUP(B14,$B$46:$C$53,2,0)","v":"ARMANDO-PE"},null,null,0,"X",2,{"$f":"VLOOKUP(L14,$B$46:$C$53,2,0)","v":"RONALD-CRF"},null,null,1,15,{"$nulls":17},"RONALD-CRF",0,0,"ARMANDO-PE",null,null,0,0,0,0]
[null,8,{"$f":"VLOOKUP(B15,$B$46:$C$53,2,0)","v":"VAGO-W.O"},null,null,0,"X",1,{"$f":"VLOOKUP(L15,$B$46:$C$53,2,0)","v":"MENDEZ-CRVG"},null,null,4,{"$nulls":18},"MENDEZ-CRVG",0,0,"VAGO-W.O",null,null,0,0,0,0]
[null,"3ª RODADA",{"$nulls":10},"MESA",{"$nulls":17},0,0,0,0,null,null,0,0,0,0]
[null,1,{"$f":"VLOOKUP(B17,$B$46:$C$53,2,0)","v":"RONALD-CRF"},null,null,3,"X",3,{"$f":"VLOOKUP(L17,$B$46:$C$53,2,0)","v":"MARCUS-BQ"},null,null,6,13,{"$nulls":17},0,"RONALD-CRF","MARCUS-BQ",0,null,null,0,0,0,0]
[null,2,{"$f":"VLOOKUP(B18,$B$46:$C$53,2,0)","v":"MATOSO-CRVG"},null,null,0,"X",0,{"$f":"VLOOKUP(L18,$B$46:$C$53,2,0)","v":"ANDRÉ-BQ"},null,null,5,14,{"$nulls":17},0,"MATOSO-CRVG","ANDRÉ-BQ",0,null,null,0,0,0,0]
[null,3,{"$f":"VLOOKUP(B19,$B$46:$C$53,2,0)","v":"L.HENRIQUE-TUPI"},null,null,3,"X",3,{"$f":"VLOOKUP(L19,$B$46:$C$53,2,0)","v":"MENDEZ-CRVG"},null,null,4,15,{"$nulls":17},0,"L.HENRIQUE-TUPI","MENDEZ-CRVG",0,null,null,0,0,0,0]
[null,7,{"$f":"VLOOKUP(B20,$B$46:$C$53,2,0)","v":"ARMANDO-PE"},null,null,1,"X",0,{"$f":"VLOOKUP(L20,$B$46:$C$53,2,0)","v":"VAGO-W.O"},null,null,8,{"$nulls":18},"ARMANDO-PE",0,0,"VAGO-W.O",null,null,0,0,0,0]
[null,"4ª RODADA",{"$nulls":10},"MESA",{"$nulls":17},0,0,0,0,null,null,0,0,0,0]
[null,3,{"$f":"VLOOKUP(B22,$B$46:$C$53,2,0)","v":"L.HENRIQUE-TUPI"},null,null,1,"X",0,{"$f":"VLOOKUP(L22,$B$46:$C$53,2,0)","v":"VAGO-W.O"},null,null,8,13,{"$nulls":17},"L.HENRIQUE-TUPI",0,0,"VAGO-W.O",null,null,0,0,0,0]
[null,4,{"$f":"VLOOKUP(B23,$B$46:$C$53,2,0)","v":"MENDEZ-CRVG"},null,null,2,"X",2,{"$f":"VLOOKUP(L23,$B$46:$C$53,2,0)","v":"MATOSO-CRVG"},null,null,2,14,{"$nulls":17},0,"MENDEZ-CRVG","MATOSO-CRVG",0,null,null,0,0,0,0]
[null,5,{"$f":"VLOOKUP(B24,$B$46:$C$53,2,0)","v":"ANDRÉ-BQ"},null,null,1,"X",5,{"$f":"VLOOKUP(L24,$B$46:$C$53,2,0)","v":"RONALD-CRF"},null,null,1,15,{"$nulls":17},"RONALD-CRF",0,0,"ANDRÉ-BQ",null,null,0,0,0,0]
[null,6,{"$f":"VLOOKUP(B25,$B$46:$C$53,2,0)","v":"MARCUS-BQ"},null,null,2,"X",1,{"$f":"VLOOKUP(L25,$B$46:$C$53,2,0)","v":"ARMANDO-PE"},null,null,7,{"$nulls":18},"MARCUS-BQ",0,0,"ARMANDO-PE",null,null,0,0,0,0]
[null,"5ª RODADA",{"$nulls":10},"MESA",{"$nulls":17},0,0,0,0,null,null,0,0,0,0]
[null,1,{"$f":"VLOOKUP(B27,$B$46:$C$53,2,0)","v":"RONALD-CRF"},null,null,5,"X",2,{"$f":"VLOOKUP(L27,$B$46:$C$53,2,0)","v":"MENDEZ-CRVG"},null,null,4,13,{"$nulls":17},"RONALD-CRF",0,0,"MENDEZ-CRVG",null,null,0,0,0,0]
[null,2,{"$f":"VLOOKUP(B28,$B$46:$C$53,2,0)","v":"MATOSO-CRVG"},null,null,0,"X",2,{"$f":"VLOOKUP(L28,$B$46:$C$53,2,0)","v":"L.HENRIQUE-TUPI"},null,null,3,14,{"$nulls":17},"L.HENRIQUE-TUPI",0,0,"MATOSO-CRVG",null,null,0,0,0,0]
[null,7,{"$f":"VLOOKUP(B29,$B$46:$C$53,2,0)","v":"ARMANDO-PE"},null,null,0,"X",0,{"$f":"VLOOKUP(L29,$B$46:$C$53,2,0)","v":"ANDRÉ-BQ"},null,null,5,15,{"$nulls":17},0,"ARMANDO-PE","ANDRÉ-BQ",0,null,null,0,0,0,0]
[null,8,{"$f":"VLOOKUP(B30,$B$46:$C$53,2,0)","v":"VAGO-W.O"},null,null,0,"X",1,{"$f":"VLOOKUP(L30,$B$46:$C$53,2,0)","v":"MARCUS-BQ"},null,null,6,{"$nulls":18},"MARCUS-BQ",0,0,"VAGO-W.O",null,null,0,0,0,0]
[null,"6ª RODADA",{"$nulls":10},"MESA",{"$nulls":17},0,0,0,0,null,null,0,0,0,0]
[null,3,{"$f":"VLOOKUP(B32,$B$46:$C$53,2,0)","v":"L.HENRIQUE-TUPI"},null,null,5,"X",6,{"$f":"VLOOKUP(L32,$B$46:$C$53,2,0)","v":"RONALD-CRF"},null,null,1,13,{"$nulls":17},"RONALD-CRF",0,0,"L.HENRIQUE-TUPI",null,null,0,0,0,0]
[null,4,{"$f":"VLOOKUP(B33,$B$46:$C$53,2,0)","v":"MENDEZ-CRVG"},null,null,1,"X",0,{"$f":"VLOOKUP(L33,$B$46:$C$53,2,0)","v":"ARMANDO-PE"},null,null,7,14,{"$nulls":17},"MENDEZ-CRVG",0,0,"ARMANDO-PE",null,null,0,0,0,0]
[null,5,{"$f":"VLOOKUP(B34,$B$46:$C$53,2,0)","v":"ANDRÉ-BQ"},null,null,0,"X",2,{"$f":"VLOOKUP(L34,$B$46:$C$53,2,0)","v":"MARCUS-BQ"},null,null,6,15,{"$nulls":17},"MARCUS-BQ",0,0,"ANDRÉ-BQ",null,null,0,0,0,0]
[null,8,{"$f":"VLOOKUP(B35,$B$46:$C$53,2,0)","v":"VAGO-W.O"},null,null,0,"X",1,{"$f":"VLOOKUP(L35,$B$46:$C$53,2,0)","v":"MATOSO-CRVG"},null,null,2,{"$nulls":18},"MATOSO-CRVG",0,0,"VAGO-W.O",null,null,0,0,0,0]
[null,"7ª RODADA",{"$nulls":10},"MESA",{"$nulls":17},0,0,0,0,null,null,0,0,0,0]
[null,1,{"$f":"VLOOKUP(B37,$B$46:$C$53,2,0)","v":"RONALD-CRF"},null,null,5,"X",3,{"$f":"VLOOKUP(L37,$B$46:$C$53,2,0)","v":"MATOSO-CRVG"},null,null,2,13,{"$nulls":17},"RONALD-CRF",0,0,"MATOSO-CRVG",null,null,0,0,0,0]
[null,5,{"$f":"VLOOKUP(B38,$B$46:$C$53,2,0)","v":"ANDRÉ-BQ"},null,null,1,"X",0,{"$f":"VLOOKUP(L38,$B$46:$C$53,2,0)","v":"VAGO-W.O"},null,null,8,14,{"$nulls":17},"ANDRÉ-BQ",0,0,"VAGO-W.O",null,null,0,0,0,0]
[null,6,{"$f":"VLOOKUP(B39,$B$46:$C$53,2,0)","v":"MARCUS-BQ"},null,null,2,"X",1,{"$f":"VLOOKUP(L39,$B$46:$C$53,2,0)","v":"MENDEZ-CRVG"},null,null,4,15,{"$nulls":17},"MARCUS-BQ",0,0,"MENDEZ-CRVG",null,null,0,0,0,0]
[null,7,{"$f":"VLOOKUP(B40,$B$46:$C$53,2,0)","v":"ARMANDO-PE"},null,null,2,"X",2,{"$f":"VLOOKUP(L40,$B$46:$C$53,2,0)","v":"L.HENRIQUE-TUPI"},null,null,3,{"$nulls":18},0,"ARMANDO-PE","L.HENRIQUE-TUPI",0,null,null,0,0,0,0]
[{"$nulls":30},0,0,0,0,null,null,0,0,0,0]
[{"$nulls":30},0,0,0,0,null,null,0,0,0,0]
[{"$nulls":36},0,0,0,0]
[null,"PONTOS"]
[null,"Equipes ",{"$nulls":3},"PG","J","V","E","D","GP","GC","SG","APROV"]
["1º",1,"RONALD-CRF",null,null,{"$f":"H46*3+I46*1","v":19},{"$f":"SUM(H46:J46)","v":7},{"$f":"COUNTIF($AE$7:$AE$40,C46)+COUNTIF($AK$7:$AK$40,C46)","v":6},{"$f":"COUNTIF($AF$7:$AG$40,C46)+COUNTIF($AL$7:$AM$37,C46)","v":1},{"$f":"COUNTIF($AH$7:$AH$40,C46)+COUNTIF($AN$7:$AN$37,C46)","v":0},{"$f":"SUMIF($C$7:$C$40,$C46,$F$7:$F$40)+SUMIF($I$7:$I$40,$C46,$H$7:$H$40)+SUMIF($O$7:$O$40,$C46,$R$7:$R$40)+SUMIF($U$7:$U$40,$C46,$T$7:$T$40)","v":27},{"$f":"SUMIF($C$7:$C$40,$C46,$H$7:$H$40)+SUMIF($I$7:$I$40,$C46,$F$7:$F$40)+SUMIF($O$7:$O$40,$C46,$T$7:$T$40)+SUMIF($U$7:$U$40,$C46,$R$7:$R$40)","v":14},{"$f":"K46-L46","v":13},{"$f":"F46/(G46*3)","v":{"v":0.9047619047619048,"d":"90%"}}]
["2º",3,"L.HENRIQUE-TUPI",null,null,14,7,4,2,1,18,14,4,{"v":0.6666666666666666,"d":"67%"}]
["3º",6,"MARCUS-BQ",null,null,13,7,4,1,2,14,11,3,{"v":0.6190476190476191,"d":"62%"}]
["4º",4,"MENDEZ-CRVG",null,null,11,7,3,2,2,13,14,-1,{"v":0.5238095238095238,"d":"52%"}]
["5º",2,"MATOSO-CRVG",null,null,9,7,2,3,2,10,12,-2,{"v":0.42857142857142855,"d":"43%"}]
["6º",7,"ARMANDO-PE",null,null,6,7,1,3,3,5,8,-3,{"v":0.2857142857142857,"d":"29%"}]
["7º",5,"ANDRÉ-BQ",null,null,5,7,1,2,4,5,12,-7,{"v":0.23809523809523808,"d":"24%"}]
["8º",8,"VAGO-W.O",null,null,0,7,0,0,7,0,7,-7,{"v":0,"d":"0%"}]

{"sheet":"F","index":5,"n_rows":53,"n_cols":40,"rows_kept":53,"merged":[[1,1,1,23],[2,1,2,23],[3,1,3,23],[5,1,5,11],[6,2,6,4],[6,8,6,10],[6,14,6,16],[6,20,6,22],[7,2,7,4],[7,8,7,10],[7,14,7,16],[7,20,7,22],[8,2,8,4],[8,8,8,10],[8,14,8,16],[8,20,8,22],[9,2,9,4],[9,8,9,10],[9,14,9,16],[9,20,9,22],[10,1,10,11],[10,13,10,23],[11,2,11,4],[11,8,11,10],[11,14,11,16],[11,20,11,22],[12,2,12,4],[12,8,12,10],[12,14,12,16],[12,20,12,22],[13,2,13,4],[13,8,13,10],[13,14,13,16],[13,20,13,22],[14,2,14,4],[14,8,14,10],[14,14,14,16],[14,20,14,22],[15,1,15,11],[15,13,15,23],[16,2,16,4],[16,8,16,10],[16,14,16,16],[16,20,16,22],[17,2,17,4],[17,8,17,10],[17,14,17,16],[17,20,17,22],[18,2,18,4],[18,8,18,10],[18,14,18,16],[18,20,18,22],[19,2,19,4],[19,8,19,10],[19,14,19,16],[19,20,19,22],[20,1,20,11],[20,13,20,23],[21,2,21,4],[21,8,21,10],[21,14,21,16],[21,20,21,22],[22,2,22,4],[22,8,22,10],[22,14,22,16],[22,20,22,22],[23,2,23,4],[23,8,23,10],[23,14,23,16],[23,20,23,22],[24,2,24,4],[24,8,24,10],[24,14,24,16],[24,20,24,22],[25,1,25,11],[25,13,25,23],[26,2,26,4],[26,8,26,10],[26,14,26,16],[26,20,26,22],[27,2,27,4],[27,8,27,10],[27,14,27,16],[27,20,27,22],[28,2,28,4],[28,8,28,10],[28,14,28,16],[28,20,28,22],[29,2,29,4],[29,8,29,10],[29,14,29,16],[29,20,29,22],[30,1,30,11],[30,13,30,23],[31,2,31,4],[31,8,31,10],[31,14,31,16],[31,20,31,22],[32,2,32,4],[32,8,32,10],[32,14,32,16],[32,20,32,22],[33,2,33,4],[33,8,33,10],[33,14,33,16],[33,20,33,22],[34,2,34,4],[34,8,34,10],[34,14,34,16],[34,20,34,22],[35,1,35,11],[36,2,36,4],[36,8,36,10],[37,2,37,4],[37,8,37,10],[38,2,38,4],[38,8,38,10],[39,2,39,4],[39,8,39,10],[43,1,43,13],[44,1,44,4]]}
[]
[]
[]
[]
[{"$nulls":30},3,1,1,0,null,null,3,1,1,0]
[null,"1ª RODADA",{"$nulls":10},"MESA",{"$nulls":17},"Vitórias","Empates","Empates","Derrotas",null,null,"Vitórias","Empates","Empates","Derrotas"]
[null,1,{"$f":"VLOOKUP(B7,$B$46:$C$53,2,0)","v":"GATTO-CRVG"},null,null,1,"X",0,{"$f":"VLOOKUP(L7,$B$46:$C$53,2,0)","v":"VAGO-W.O"},null,null,8,16,{"$nulls":17},{"$f":"IF(F7>H7,C7,IF(F7=H7,0,I7))","v":"GATTO-CRVG"},{"$f":"(IF(F7<>\"-\",(IF(F7=H7,C7,0)),0))","v":0},{"$f":"(IF(F7<>\"-\",(IF(F7=H7,I7,0)),0))","v":0},{"$f":"IF(F7<H7,C7,IF(F7=H7,0,I7))","v":"VAGO-W.O"},null,null,{"$f":"IF(R7>T7,O7,IF(R7=T7,0,U7))","v":0},{"$f":"(IF(R7<>\"-\",(IF(R7=T7,O7,0)),0))","v":0},{"$f":"(IF(R7<>\"-\",(IF(R7=T7,U7,0)),0))","v":0},{"$f":"IF(R7<T7,O7,IF(R7=T7,0,U7))","v":0}]
[null,2,{"$f":"VLOOKUP(B8,$B$46:$C$53,2,0)","v":"VERAS-CRF"},null,null,4,"X",3,{"$f":"VLOOKUP(L8,$B$46:$C$53,2,0)","v":"BELMIRO-RIVER"},null,null,7,17,{"$nulls":17},{"$f":"IF(F8>H8,C8,IF(F8=H8,0,I8))","v":"VERAS-CRF"},{"$f":"(IF(F8<>\"-\",(IF(F8=H8,C8,0)),0))","v":0},{"$f":"(IF(F8<>\"-\",(IF(F8=H8,I8,0)),0))","v":0},{"$f":"IF(F8<H8,C8,IF(F8=H8,0,I8))","v":"BELMIRO-RIVER"},null,null,{"$f":"IF(R8>T8,O8,IF(R8=T8,0,U8))","v":0},{"$f":"(IF(R8<>\"-\",(IF(R8=T8,O8,0)),0))","v":0},{"$f":"(IF(R8<>\"-\",(IF(R8=T8,U8,0)),0))","v":0},{"$f":"IF(R8<T8,O8,IF(R8=T8,0,U8))","v":0}]
[null,3,{"$f":"VLOOKUP(B9,$B$46:$C$53,2,0)","v":"AIRES-ASBAC"},null,null,1,"X",1,{"$f":"VLOOKUP(L9,$B$46:$C$53,2,0)","v":"FERNANDO-BOT-DF"},null,null,6,18,{"$nulls":17},0,"AIRES-ASBAC","FERNANDO-BOT-DF",0,null,null,0,0,0,0]
[null,4,{"$f":"VLOOKUP(B10,$B$46:$C$53,2,0)","v":"ZÉ LUIZ-CRF"},null,null,1,"X",1,{"$f":"VLOOKUP(L10,$B$46:$C$53,2,0)","v":"KADHU-CRVG"},null,null,5,{"$nulls":18},0,"ZÉ LUIZ-CRF","KADHU-CRVG",0,null,null,0,0,0,0]
[null,"2ª RODADA",{"$nulls":10},"MESA",{"$nulls":17},0,0,0,0,null,null,0,0,0,0]
[null,5,{"$f":"VLOOKUP(B12,$B$46:$C$53,2,0)","v":"KADHU-CRVG"},null,null,2,"X",4,{"$f":"VLOOKUP(L12,$B$46:$C$53,2,0)","v":"AIRES-ASBAC"},null,null,3,16,{"$nulls":17},"AIRES-ASBAC",0,0,"KADHU-CRVG",null,null,0,0,0,0]
[null,6,{"$f":"VLOOKUP(B13,$B$46:$C$53,2,0)","v":"FERNANDO-BOT-DF"},null,null,3,"X",1,{"$f":"VLOOKUP(L13,$B$46:$C$53,2,0)","v":"VERAS-CRF"},null,null,2,17,{"$nulls":17},"FERNANDO-BOT-DF",0,0,"VERAS-CRF",null,null,0,0,0,0]
[null,7,{"$f":"VLOOKUP(B14,$B$46:$C$53,2,0)","v":"BELMIRO-RIVER"},null,null,0,"X",4,{"$f":"VLOOKUP(L14,$B$46:$C$53,2,0)","v":"GATTO-CRVG"},null,null,1,18,{"$nulls":17},"GATTO-CRVG",0,0,"BELMIRO-RIVER",null,null,0,0,0,0]
[null,8,{"$f":"VLOOKUP(B15,$B$46:$C$53,2,0)","v":"VAGO-W.O"},null,null,0,"X",1,{"$f":"VLOOKUP(L15,$B$46:$C$53,2,0)","v":"ZÉ LUIZ-CRF"},null,null,4,{"$nulls":18},"ZÉ LUIZ-CRF",0,0,"VAGO-W.O",null,null,0,0,0,0]
[null,"3ª RODADA",{"$nulls":10},"MESA",{"$nulls":17},0,0,0,0,null,null,0,0,0,0]
[null,1,{"$f":"VLOOKUP(B17,$B$46:$C$53,2,0)","v":"GATTO-CRVG"},null,null,2,"X",4,{"$f":"VLOOKUP(L17,$B$46:$C$53,2,0)","v":"FERNANDO-BOT-DF"},null,null,6,16,{"$nulls":17},"FERNANDO-BOT-DF",0,0,"GATTO-CRVG",null,null,0,0,0,0]
[null,2,{"$f":"VLOOKUP(B18,$B$46:$C$53,2,0)","v":"VERAS-CRF"},null,null,4,"X",1,{"$f":"VLOOKUP(L18,$B$46:$C$53,2,0)","v":"KADHU-CRVG"},null,null,5,17,{"$nulls":17},"VERAS-CRF",0,0,"KADHU-CRVG",null,null,0,0,0,0]
[null,3,{"$f":"VLOOKUP(B19,$B$46:$C$53,2,0)","v":"AIRES-ASBAC"},null,null,3,"X",0,{"$f":"VLOOKUP(L19,$B$46:$C$53,2,0)","v":"ZÉ LUIZ-CRF"},null,null,4,18,{"$nulls":17},"AIRES-ASBAC",0,0,"ZÉ LUIZ-CRF",null,null,0,0,0,0]
[null,7,{"$f":"VLOOKUP(B20,$B$46:$C$53,2,0)","v":"BELMIRO-RIVER"},null,null,1,"X",0,{"$f":"VLOOKUP(L20,$B$46:$C$53,2,0)","v":"VAGO-W.O"},null,null,8,{"$nulls":18},"BELMIRO-RIVER",0,0,"VAGO-W.O",null,null,0,0,0,0]
[null,"4ª RODADA",{"$nulls":10},"MESA",{"$nulls":17},0,0,0,0,null,null,0,0,0,0]
[null,3,{"$f":"VLOOKUP(B22,$B$46:$C$53,2,0)","v":"AIRES-ASBAC"},null,null,1,"X",0,{"$f":"VLOOKUP(L22,$B$46:$C$53,2,0)","v":"VAGO-W.O"},null,null,8,16,{"$nulls":17},"AIRES-ASBAC",0,0,"VAGO-W.O",null,null,0,0,0,0]
[null,4,{"$f":"VLOOKUP(B23,$B$46:$C$53,2,0)","v":"ZÉ LUIZ-CRF"},null,null,1,"X",3,{"$f":"VLOOKUP(L23,$B$46:$C$53,2,0)","v":"VERAS-CRF"},null,null,2,17,{"$nulls":17},"VERAS-CRF",0,0,"ZÉ LUIZ-CRF",null,null,0,0,0,0]
[null,5,{"$f":"VLOOKUP(B24,$B$46:$C$53,2,0)","v":"KADHU-CRVG"},null,null,4,"X",6,{"$f":"VLOOKUP(L24,$B$46:$C$53,2,0)","v":"GATTO-CRVG"},null,null,1,18,{"$nulls":17},"GATTO-CRVG",0,0,"KADHU-CRVG",null,null,0,0,0,0]
[null,6,{"$f":"VLOOKUP(B25,$B$46:$C$53,2,0)","v":"FERNANDO-BOT-DF"},null,null,3,"X",1,{"$f":"VLOOKUP(L25,$B$46:$C$53,2,0)","v":"BELMIRO-RIVER"},null,null,7,{"$nulls":18},"FERNANDO-BOT-DF",0,0,"BELMIRO-RIVER",null,null,0,0,0,0]
[null,"5ª RODADA",{"$nulls":10},"MESA",{"$nulls":17},0,0,0,0,null,null,0,0,0,0]
[null,1,{"$f":"VLOOKUP(B27,$B$46:$C$53,2,0)","v":"GATTO-CRVG"},null,null,2,"X",4,{"$f":"VLOOKUP(L27,$B$46:$C$53,2,0)","v":"ZÉ LUIZ-CRF"},null,null,4,16,{"$nulls":17},"ZÉ LUIZ-CRF",0,0,"GATTO-CRVG",null,null,0,0,0,0]
[null,2,{"$f":"VLOOKUP(B28,$B$46:$C$53,2,0)","v":"VERAS-CRF"},null,null,3,"X",4,{"$f":"VLOOKUP(L28,$B$46:$C$53,2,0)","v":"AIRES-ASBAC"},null,null,3,17,{"$nulls":17},"AIRES-ASBAC",0,0,"VERAS-CRF",null,null,0,0,0,0]
[null,7,{"$f":"VLOOKUP(B29,$B$46:$C$53,2,0)","v":"BELMIRO-RIVER"},null,null,2,"X",3,{"$f":"VLOOKUP(L29,$B$46:$C$53,2,0)","v":"KADHU-CRVG"},null,null,5,18,{"$nulls":17},"KADHU-CRVG",0,0,"BELMIRO-RIVER",null,null,0,0,0,0]
[null,8,{"$f":"VLOOKUP(B30,$B$46:$C$53,2,0)","v":"VAGO-W.O"},null,null,0,"X",1,{"$f":"VLOOKUP(L30,$B$46:$C$53,2,0)","v":"FERNANDO-BOT-DF"},null,null,6,{"$nulls":18},"FERNANDO-BOT-DF",0,0,"VAGO-W.O",null,null,0,0,0,0]
[null,"6ª RODADA",{"$nulls":10},"MESA",{"$nulls":17},0,0,0,0,null,null,0,0,0,0]
[null,3,{"$f":"VLOOKUP(B32,$B$46:$C$53,2,0)","v":"AIRES-ASBAC"},null,null,2,"X",2,{"$f":"VLOOKUP(L32,$B$46:$C$53,2,0)","v":"GATTO-CRVG"},null,null,1,16,{"$nulls":17},0,"AIRES-ASBAC","GATTO-CRVG",0,null,null,0,0,0,0]
[null,4,{"$f":"VLOOKUP(B33,$B$46:$C$53,2,0)","v":"ZÉ LUIZ-CRF"},null,null,2,"X",1,{"$f":"VLOOKUP(L33,$B$46:$C$53,2,0)","v":"BELMIRO-RIVER"},null,null,7,17,{"$nulls":17},"ZÉ LUIZ-CRF",0,0,"BELMIRO-RIVER",null,null,0,0,0,0]
[null,5,{"$f":"VLOOKUP(B34,$B$46:$C$53,2,0)","v":"KADHU-CRVG"},null,null,1,"X",4,{"$f":"VLOOKUP(L34,$B$46:$C$53,2,0)","v":"FERNANDO-BOT-DF"},null,null,6,18,{"$nulls":17},"FERNANDO-BOT-DF",0,0,"KADHU-CRVG",null,null,0,0,0,0]
[null,8,{"$f":"VLOOKUP(B35,$B$46:$C$53,2,0)","v":"VAGO-W.O"},null,null,0,"X",1,{"$f":"VLOOKUP(L35,$B$46:$C$53,2,0)","v":"VERAS-CRF"},null,null,2,{"$nulls":18},"VERAS-CRF",0,0,"VAGO-W.O",null,null,0,0,0,0]
[null,"7ª RODADA",{"$nulls":10},"MESA",{"$nulls":17},0,0,0,0,null,null,0,0,0,0]
[null,1,{"$f":"VLOOKUP(B37,$B$46:$C$53,2,0)","v":"GATTO-CRVG"},null,null,5,"X",3,{"$f":"VLOOKUP(L37,$B$46:$C$53,2,0)","v":"VERAS-CRF"},null,null,2,16,{"$nulls":17},"GATTO-CRVG",0,0,"VERAS-CRF",null,null,0,0,0,0]
[null,5,{"$f":"VLOOKUP(B38,$B$46:$C$53,2,0)","v":"KADHU-CRVG"},null,null,1,"X",0,{"$f":"VLOOKUP(L38,$B$46:$C$53,2,0)","v":"VAGO-W.O"},null,null,8,17,{"$nulls":17},"KADHU-CRVG",0,0,"VAGO-W.O",null,null,0,0,0,0]
[null,6,{"$f":"VLOOKUP(B39,$B$46:$C$53,2,0)","v":"FERNANDO-BOT-DF"},null,null,4,"X",2,{"$f":"VLOOKUP(L39,$B$46:$C$53,2,0)","v":"ZÉ LUIZ-CRF"},null,null,4,18,{"$nulls":17},"FERNANDO-BOT-DF",0,0,"ZÉ LUIZ-CRF",null,null,0,0,0,0]
[null,7,{"$f":"VLOOKUP(B40,$B$46:$C$53,2,0)","v":"BELMIRO-RIVER"},null,null,2,"X",4,{"$f":"VLOOKUP(L40,$B$46:$C$53,2,0)","v":"AIRES-ASBAC"},null,null,3,{"$nulls":18},"AIRES-ASBAC",0,0,"BELMIRO-RIVER",null,null,0,0,0,0]
[{"$nulls":30},0,0,0,0,null,null,0,0,0,0]
[{"$nulls":30},0,0,0,0,null,null,0,0,0,0]
[{"$nulls":36},0,0,0,0]
[null,"PONTOS"]
[null,"Equipes ",{"$nulls":3},"PG","J","V","E","D","GP","GC","SG","APROV"]
["1º",6,"FERNANDO-BOT-DF",null,null,{"$f":"H46*3+I46*1","v":19},{"$f":"SUM(H46:J46)","v":7},{"$f":"COUNTIF($AE$7:$AE$40,C46)+COUNTIF($AK$7:$AK$40,C46)","v":6},{"$f":"COUNTIF($AF$7:$AG$40,C46)+COUNTIF($AL$7:$AM$37,C46)","v":1},{"$f":"COUNTIF($AH$7:$AH$40,C46)+COUNTIF($AN$7:$AN$37,C46)","v":0},{"$f":"SUMIF($C$7:$C$40,$C46,$F$7:$F$40)+SUMIF($I$7:$I$40,$C46,$H$7:$H$40)+SUMIF($O$7:$O$40,$C46,$R$7:$R$40)+SUMIF($U$7:$U$40,$C46,$T$7:$T$40)","v":20},{"$f":"SUMIF($C$7:$C$40,$C46,$H$7:$H$40)+SUMIF($I$7:$I$40,$C46,$F$7:$F$40)+SUMIF($O$7:$O$40,$C46,$T$7:$T$40)+SUMIF($U$7:$U$40,$C46,$R$7:$R$40)","v":8},{"$f":"K46-L46","v":12},{"$f":"F46/(G46*3)","v":{"v":0.9047619047619048,"d":"90%"}}]
["2º",3,"AIRES-ASBAC",null,null,17,7,5,2,0,19,10,9,{"v":0.8095238095238095,"d":"81%"}]
["3º",1,"GATTO-CRVG",null,null,13,7,4,1,2,22,17,5,{"v":0.6190476190476191,"d":"0.619"}]
["4º",2,"VERAS-CRF",null,null,12,7,4,0,3,19,17,2,{"v":0.5714285714285714,"d":"57%"}]
["5º",4,"ZÉ LUIZ-CRF",null,null,10,7,3,1,3,11,14,-3,{"v":0.47619047619047616,"d":"48%"}]
["6º",5,"KADHU-CRVG",null,null,7,7,2,1,4,13,21,-8,{"v":0.3333333333333333,"d":"33%"}]
["7º",7,"BELMIRO-RIVER",null,null,3,7,1,0,6,10,20,-10,{"v":0.14285714285714285,"d":"14%"}]
["8º",8,"VAGO-W.O",null,null,0,7,0,0,7,0,7,-7,{"v":0,"d":"0%"}]

{"sheet":"Resumo","index":6,"n_rows":76,"n_cols":15,"rows_kept":76,"merged":[[0,2,0,14],[1,2,1,5],[11,2,11,14],[12,2,12,5],[22,2,22,14],[23,2,23,5],[44,2,44,14],[45,2,45,5],[55,2,55,14],[56,2,56,5],[66,2,66,14],[67,2,67,5]]}
[null,null,"GRUPO A"]
[null,null,"Equipes ",{"$nulls":3},"PG","J","V","E","D","GP","GC","SG","APROV"]
[null,"1º",1,{"$f":"A!$C$46","v":"AUGUSTO-CRF"},null,null,{"$f":"A!$F$46","v":17},{"$f":"A!$G$46","v":7},{"$f":"A!$H$46","v":5},{"$f":"A!$I$46","v":2},{"$f":"A!$J$46","v":0},{"$f":"A!$K$46","v":18},{"$f":"A!$L$46","v":11},{"$f":"A!$M$46","v":7},{"$f":"A!N46","v":{"v":0.8095238095238095,"d":"0.810"}}]
[null,"2º",2,{"$f":"A!$C$47","v":"WELLINGTON-ADDP"},null,null,{"$f":"A!$F$47","v":16},{"$f":"A!$G$47","v":7},{"$f":"A!$H$47","v":5},{"$f":"A!$I$47","v":1},{"$f":"A!$J$47","v":1},{"$f":"A!$K$47","v":15},{"$f":"A!$L$47","v":10},{"$f":"A!$M$47","v":5},{"$f":"A!N47","v":{"v":0.7619047619047619,"d":"0.762"}}]
[null,"3º",3,{"$f":"A!$C$48","v":"B. RAFAEL-SANTOS"},null,null,{"$f":"A!$F$48","v":15},{"$f":"A!$G$48","v":7},{"$f":"A!$H$48","v":5},{"$f":"A!$I$48","v":0},{"$f":"A!$J$48","v":2},{"$f":"A!$K$48","v":15},{"$f":"A!$L$48","v":12},{"$f":"A!$M$48","v":3},{"$f":"A!N48","v":{"v":0.7142857142857143,"d":"0.714"}}]
[null,"4º",4,{"$f":"A!$C$49","v":"PAULINHO-BOT-DF"},null,null,{"$f":"A!$F$49","v":13},{"$f":"A!$G$49","v":7},{"$f":"A!$H$49","v":4},{"$f":"A!$I$49","v":1},{"$f":"A!$J$49","v":2},{"$f":"A!$K$49","v":12},{"$f":"A!$L$49","v":10},{"$f":"A!$M$49","v":2},{"$f":"A!N49","v":{"v":0.6190476190476191,"d":"0.619"}}]
[null,"5º",5,{"$f":"A!$C$50","v":"B.MACHADO-BQ"},null,null,{"$f":"A!$F$50","v":10},{"$f":"A!$G$50","v":7},{"$f":"A!$H$50","v":3},{"$f":"A!$I$50","v":1},{"$f":"A!$J$50","v":3},{"$f":"A!$K$50","v":13},{"$f":"A!$L$50","v":11},{"$f":"A!$M$50","v":2},{"$f":"A!N50","v":{"v":0.47619047619047616,"d":"0.476"}}]
[null,"6º",6,{"$f":"A!$C$51","v":"LIBÓRIO-FFC"},null,null,{"$f":"A!$F$51","v":7},{"$f":"A!$G$51","v":7},{"$f":"A!$H$51","v":2},{"$f":"A!$I$51","v":1},{"$f":"A!$J$51","v":4},{"$f":"A!$K$51","v":11},{"$f":"A!$L$51","v":18},{"$f":"A!$M$51","v":-7},{"$f":"A!N51","v":{"v":0.3333333333333333,"d":"0.333"}}]
[null,"7º",7,{"$f":"A!$C$52","v":"HAMILTON-BQ"},null,null,{"$f":"A!$F$52","v":0},{"$f":"A!$G$52","v":6},{"$f":"A!$H$52","v":0},{"$f":"A!$I$52","v":0},{"$f":"A!$J$52","v":6},{"$f":"A!$K$52","v":0},{"$f":"A!$L$52","v":6},{"$f":"A!$M$52","v":-6},{"$f":"A!N52","v":0}]
[null,"8º",8,{"$f":"A!$C$53","v":"VAGO-W.O"},null,null,{"$f":"A!$F$53","v":0},{"$f":"A!$G$53","v":6},{"$f":"A!$H$53","v":0},{"$f":"A!$I$53","v":0},{"$f":"A!$J$53","v":6},{"$f":"A!$K$53","v":0},{"$f":"A!$L$53","v":6},{"$f":"A!$M$53","v":-6},{"$f":"A!N53","v":0}]
[]
[null,null,"GRUPO B"]
[null,null,"Equipes ",{"$nulls":3},"PG","J","V","E","D","GP","GC","SG","APROV"]
[null,"1º",1,{"$f":"B!$C$46","v":"ROMAR-CRVG"},null,null,{"$f":"B!$F$46","v":18},{"$f":"B!$G$46","v":7},{"$f":"B!$H$46","v":6},{"$f":"B!$I$46","v":0},{"$f":"B!$J$46","v":1},{"$f":"B!$K$46","v":21},{"$f":"B!$L$46","v":11},{"$f":"B!$M$46","v":10},{"$f":"B!N46","v":{"v":0.8571428571428571,"d":"0.857"}}]
[null,"2º",2,{"$f":"B!$C$47","v":"FELIPE-CRF"},null,null,{"$f":"B!$F$47","v":15},{"$f":"B!$G$47","v":7},{"$f":"B!$H$47","v":5},{"$f":"B!$I$47","v":0},{"$f":"B!$J$47","v":2},{"$f":"B!$K$47","v":16},{"$f":"B!$L$47","v":13},{"$f":"B!$M$47","v":3},{"$f":"B!N47","v":{"v":0.7142857142857143,"d":"0.714"}}]
[null,"3º",3,{"$f":"B!$C$48","v":"P.CARUSO-AABB-DF"},null,null,{"$f":"B!$F$48","v":13},{"$f":"B!$G$48","v":7},{"$f":"B!$H$48","v":4},{"$f":"B!$I$48","v":1},{"$f":"B!$J$48","v":2},{"$f":"B!$K$48","v":16},{"$f":"B!$L$48","v":13},{"$f":"B!$M$48","v":3},{"$f":"B!N48","v":{"v":0.6190476190476191,"d":"0.619"}}]
[null,"4º",4,{"$f":"B!$C$49","v":"LYAN-FFC"},null,null,{"$f":"B!$F$49","v":12},{"$f":"B!$G$49","v":7},{"$f":"B!$H$49","v":4},{"$f":"B!$I$49","v":0},{"$f":"B!$J$49","v":3},{"$f":"B!$K$49","v":23},{"$f":"B!$L$49","v":17},{"$f":"B!$M$49","v":6},{"$f":"B!N49","v":{"v":0.5714285714285714,"d":"0.571"}}]
[null,"5º",5,{"$f":"B!$C$50","v":"TAVARES-CRVG"},null,null,{"$f":"B!$F$50","v":12},{"$f":"B!$G$50","v":7},{"$f":"B!$H$50","v":4},{"$f":"B!$I$50","v":0},{"$f":"B!$J$50","v":3},{"$f":"B!$K$50","v":21},{"$f":"B!$L$50","v":21},{"$f":"B!$M$50","v":0},{"$f":"B!N50","v":{"v":0.5714285714285714,"d":"0.571"}}]
[null,"6º",6,{"$f":"B!$C$51","v":"MARCELO-BQ"},null,null,{"$f":"B!$F$51","v":7},{"$f":"B!$G$51","v":7},{"$f":"B!$H$51","v":2},{"$f":"B!$I$51","v":1},{"$f":"B!$J$51","v":4},{"$f":"B!$K$51","v":9},{"$f":"B!$L$51","v":17},{"$f":"B!$M$51","v":-8},{"$f":"B!N51","v":{"v":0.3333333333333333,"d":"0.333"}}]
[null,"7º",7,{"$f":"B!$C$52","v":"B. ASSUMPÇÃO-BQ"},null,null,{"$f":"B!$F$52","v":6},{"$f":"B!$G$52","v":7},{"$f":"B!$H$52","v":2},{"$f":"B!$I$52","v":0},{"$f":"B!$J$52","v":5},{"$f":"B!$K$52","v":7},{"$f":"B!$L$52","v":14},{"$f":"B!$M$52","v":-7},{"$f":"B!N52","v":{"v":0.2857142857142857,"d":"0.286"}}]
[null,"8º",8,{"$f":"B!$C$53","v":"VAGO-W.O"},null,null,{"$f":"B!$F$53","v":0},{"$f":"B!$G$53","v":7},{"$f":"B!$H$53","v":0},{"$f":"B!$I$53","v":0},{"$f":"B!$J$53","v":7},{"$f":"B!$K$53","v":0},{"$f":"B!$L$53","v":7},{"$f":"B!$M$53","v":-7},{"$f":"B!N53","v":0}]
[]
[null,null,"GRUPO C"]
[null,null,"Equipes ",{"$nulls":3},"PG","J","V","E","D","GP","GC","SG","APROV"]
[null,"1º",1,{"$f":"'C'!$C$46","v":"BRAYNER-CRVG"},null,null,{"$f":"'C'!$F$46","v":19},{"$f":"'C'!$G$46","v":7},{"$f":"'C'!$H$46","v":6},{"$f":"'C'!$I$46","v":1},{"$f":"'C'!$J$46","v":0},{"$f":"'C'!$K$46","v":26},{"$f":"'C'!$L$46","v":12},{"$f":"'C'!$M$46","v":14},{"$f":"'C'!N46","v":{"v":0.9047619047619048,"d":"0.905"}}]
[null,"2º",2,{"$f":"'C'!$C$47","v":"ALMO-CC"},null,null,{"$f":"'C'!$F$47","v":17},{"$f":"'C'!$G$47","v":7},{"$f":"'C'!$H$47","v":5},{"$f":"'C'!$I$47","v":2},{"$f":"'C'!$J$47","v":0},{"$f":"'C'!$K$47","v":21},{"$f":"'C'!$L$47","v":14},{"$f":"'C'!$M$47","v":7},{"$f":"'C'!N47","v":{"v":0.8095238095238095,"d":"0.810"}}]
[null,"3º",3,{"$f":"'C'!$C$48","v":"GIUSEPE-BOT-DF"},null,null,{"$f":"'C'!$F$48","v":16},{"$f":"'C'!$G$48","v":7},{"$f":"'C'!$H$48","v":5},{"$f":"'C'!$I$48","v":1},{"$f":"'C'!$J$48","v":1},{"$f":"'C'!$K$48","v":16},{"$f":"'C'!$L$48","v":10},{"$f":"'C'!$M$48","v":6},{"$f":"'C'!N48","v":{"v":0.7619047619047619,"d":"0.762"}}]
[null,"4º",4,{"$f":"'C'!$C$49","v":"GILBERTO-ASBAC"},null,null,{"$f":"'C'!$F$49","v":9},{"$f":"'C'!$G$49","v":7},{"$f":"'C'!$H$49","v":3},{"$f":"'C'!$I$49","v":0},{"$f":"'C'!$J$49","v":4},{"$f":"'C'!$K$49","v":19},{"$f":"'C'!$L$49","v":20},{"$f":"'C'!$M$49","v":-1},{"$f":"'C'!N49","v":{"v":0.42857142857142855,"d":"0.429"}}]
[null,"5º",5,{"$f":"'C'!$C$50","v":"REBEL-ADDP"},null,null,{"$f":"'C'!$F$50","v":9},{"$f":"'C'!$G$50","v":7},{"$f":"'C'!$H$50","v":3},{"$f":"'C'!$I$50","v":0},{"$f":"'C'!$J$50","v":4},{"$f":"'C'!$K$50","v":12},{"$f":"'C'!$L$50","v":20},{"$f":"'C'!$M$50","v":-8},{"$f":"'C'!N50","v":{"v":0.42857142857142855,"d":"0.429"}}]
[null,"6º",6,{"$f":"'C'!$C$51","v":"NILSON-CC"},null,null,{"$f":"'C'!$F$51","v":6},{"$f":"'C'!$G$51","v":7},{"$f":"'C'!$H$51","v":2},{"$f":"'C'!$I$51","v":0},{"$f":"'C'!$J$51","v":5},{"$f":"'C'!$K$51","v":10},{"$f":"'C'!$L$51","v":13},{"$f":"'C'!$M$51","v":-3},{"$f":"'C'!N51","v":{"v":0.2857142857142857,"d":"0.286"}}]
[null,"7º",7,{"$f":"'C'!$C$52","v":"CARLOS-APCEF-DF"},null,null,{"$f":"'C'!$F$52","v":6},{"$f":"'C'!$G$52","v":7},{"$f":"'C'!$H$52","v":2},{"$f":"'C'!$I$52","v":0},{"$f":"'C'!$J$52","v":5},{"$f":"'C'!$K$52","v":14},{"$f":"'C'!$L$52","v":22},{"$f":"'C'!$M$52","v":-8},{"$f":"'C'!N52","v":{"v":0.2857142857142857,"d":"0.286"}}]
[null,"8º",8,{"$f":"'C'!$C$53","v":"VAGO-W.O"},null,null,{"$f":"'C'!$F$53","v":0},{"$f":"'C'!$G$53","v":7},{"$f":"'C'!$H$53","v":0},{"$f":"'C'!$I$53","v":0},{"$f":"'C'!$J$53","v":7},{"$f":"'C'!$K$53","v":0},{"$f":"'C'!$L$53","v":7},{"$f":"'C'!$M$53","v":-7},{"$f":"'C'!N53","v":0}]
{"$rows_empty":12}
[null,null,"GRUPO D"]
[null,null,"Equipes ",{"$nulls":3},"PG","J","V","E","D","GP","GC","SG","APROV"]
[null,"1º",1,{"$f":"D!$C$46","v":"RICARDO-CRF"},null,null,{"$f":"D!$F$46","v":18},{"$f":"D!$G$46","v":7},{"$f":"D!$H$46","v":6},{"$f":"D!$I$46","v":0},{"$f":"D!$J$46","v":1},{"$f":"D!$K$46","v":22},{"$f":"D!$L$46","v":12},{"$f":"D!$M$46","v":10},{"$f":"D!N46","v":{"v":0.8571428571428571,"d":"0.857"}}]
[null,"2º",2,{"$f":"D!$C$47","v":"LUCIANO-CRF"},null,null,{"$f":"D!$F$47","v":16},{"$f":"D!$G$47","v":7},{"$f":"D!$H$47","v":5},{"$f":"D!$I$47","v":1},{"$f":"D!$J$47","v":1},{"$f":"D!$K$47","v":12},{"$f":"D!$L$47","v":9},{"$f":"D!$M$47","v":3},{"$f":"D!N47","v":{"v":0.7619047619047619,"d":"0.762"}}]
[null,"3º",3,{"$f":"D!$C$48","v":"LOPES-RIVER"},null,null,{"$f":"D!$F$48","v":14},{"$f":"D!$G$48","v":7},{"$f":"D!$H$48","v":4},{"$f":"D!$I$48","v":2},{"$f":"D!$J$48","v":1},{"$f":"D!$K$48","v":18},{"$f":"D!$L$48","v":11},{"$f":"D!$M$48","v":7},{"$f":"D!N48","v":{"v":0.6666666666666666,"d":"0.667"}}]
[null,"4º",4,{"$f":"D!$C$49","v":"EDWARD-BQ"},null,null,{"$f":"D!$F$49","v":14},{"$f":"D!$G$49","v":7},{"$f":"D!$H$49","v":4},{"$f":"D!$I$49","v":2},{"$f":"D!$J$49","v":1},{"$f":"D!$K$49","v":11},{"$f":"D!$L$49","v":9},{"$f":"D!$M$49","v":2},{"$f":"D!N49","v":{"v":0.6666666666666666,"d":"0.667"}}]
[null,"5º",5,{"$f":"D!$C$50","v":"ROGÉRIO-APCEF"},null,null,{"$f":"D!$F$50","v":10},{"$f":"D!$G$50","v":7},{"$f":"D!$H$50","v":3},{"$f":"D!$I$50","v":1},{"$f":"D!$J$50","v":3},{"$f":"D!$K$50","v":10},{"$f":"D!$L$50","v":10},{"$f":"D!$M$50","v":0},{"$f":"D!N50","v":{"v":0.47619047619047616,"d":"0.476"}}]
[null,"6º",6,{"$f":"D!$C$51","v":"KLAUS-APCEF"},null,null,{"$f":"D!$F$51","v":6},{"$f":"D!$G$51","v":7},{"$f":"D!$H$51","v":2},{"$f":"D!$I$51","v":0},{"$f":"D!$J$51","v":5},{"$f":"D!$K$51","v":10},{"$f":"D!$L$51","v":20},{"$f":"D!$M$51","v":-10},{"$f":"D!N51","v":{"v":0.2857142857142857,"d":"0.286"}}]
[null,"7º",7,{"$f":"D!$C$52","v":"DANIEL-CRVG"},null,null,{"$f":"D!$F$52","v":1},{"$f":"D!$G$52","v":7},{"$f":"D!$H$52","v":0},{"$f":"D!$I$52","v":1},{"$f":"D!$J$52","v":6},{"$f":"D!$K$52","v":0},{"$f":"D!$L$52","v":6},{"$f":"D!$M$52","v":-6},{"$f":"D!N52","v":{"v":0.047619047619047616,"d":"0.048"}}]
[null,"8º",8,{"$f":"D!$C$53","v":"VAGO-W.O"},null,null,{"$f":"D!$F$53","v":1},{"$f":"D!$G$53","v":7},{"$f":"D!$H$53","v":0},{"$f":"D!$I$53","v":1},{"$f":"D!$J$53","v":6},{"$f":"D!$K$53","v":0},{"$f":"D!$L$53","v":6},{"$f":"D!$M$53","v":-6},{"$f":"D!N53","v":{"v":0.047619047619047616,"d":"0.048"}}]
[]
[null,null,"GRUPO E"]
[null,null,"Equipes ",{"$nulls":3},"PG","J","V","E","D","GP","GC","SG","APROV"]
[null,"1º",1,{"$f":"E!$C$46","v":"RONALD-CRF"},null,null,{"$f":"E!$F$46","v":19},{"$f":"E!$G$46","v":7},{"$f":"E!$H$46","v":6},{"$f":"E!$I$46","v":1},{"$f":"E!$J$46","v":0},{"$f":"E!$K$46","v":27},{"$f":"E!$L$46","v":14},{"$f":"E!$M$46","v":13},{"$f":"E!N46","v":{"v":0.9047619047619048,"d":"0.905"}}]
[null,"2º",2,{"$f":"E!$C$47","v":"L.HENRIQUE-TUPI"},null,null,{"$f":"E!$F$47","v":14},{"$f":"E!$G$47","v":7},{"$f":"E!$H$47","v":4},{"$f":"E!$I$47","v":2},{"$f":"E!$J$47","v":1},{"$f":"E!$K$47","v":18},{"$f":"E!$L$47","v":14},{"$f":"E!$M$47","v":4},{"$f":"E!N47","v":{"v":0.6666666666666666,"d":"0.667"}}]
[null,"3º",3,{"$f":"E!$C$48","v":"MARCUS-BQ"},null,null,{"$f":"E!$F$48","v":13},{"$f":"E!$G$48","v":7},{"$f":"E!$H$48","v":4},{"$f":"E!$I$48","v":1},{"$f":"E!$J$48","v":2},{"$f":"E!$K$48","v":14},{"$f":"E!$L$48","v":11},{"$f":"E!$M$48","v":3},{"$f":"E!N48","v":{"v":0.6190476190476191,"d":"0.619"}}]
[null,"4º",4,{"$f":"E!$C$49","v":"MENDEZ-CRVG"},null,null,{"$f":"E!$F$49","v":11},{"$f":"E!$G$49","v":7},{"$f":"E!$H$49","v":3},{"$f":"E!$I$49","v":2},{"$f":"E!$J$49","v":2},{"$f":"E!$K$49","v":13},{"$f":"E!$L$49","v":14},{"$f":"E!$M$49","v":-1},{"$f":"E!N49","v":{"v":0.5238095238095238,"d":"0.524"}}]
[null,"5º",5,{"$f":"E!$C$50","v":"MATOSO-CRVG"},null,null,{"$f":"E!$F$50","v":9},{"$f":"E!$G$50","v":7},{"$f":"E!$H$50","v":2},{"$f":"E!$I$50","v":3},{"$f":"E!$J$50","v":2},{"$f":"E!$K$50","v":10},{"$f":"E!$L$50","v":12},{"$f":"E!$M$50","v":-2},{"$f":"E!N50","v":{"v":0.42857142857142855,"d":"0.429"}}]
[null,"6º",6,{"$f":"E!$C$51","v":"ARMANDO-PE"},null,null,{"$f":"E!$F$51","v":6},{"$f":"E!$G$51","v":7},{"$f":"E!$H$51","v":1},{"$f":"E!$I$51","v":3},{"$f":"E!$J$51","v":3},{"$f":"E!$K$51","v":5},{"$f":"E!$L$51","v":8},{"$f":"E!$M$51","v":-3},{"$f":"E!N51","v":{"v":0.2857142857142857,"d":"0.286"}}]
[null,"7º",7,{"$f":"E!$C$52","v":"ANDRÉ-BQ"},null,null,{"$f":"E!$F$52","v":5},{"$f":"E!$G$52","v":7},{"$f":"E!$H$52","v":1},{"$f":"E!$I$52","v":2},{"$f":"E!$J$52","v":4},{"$f":"E!$K$52","v":5},{"$f":"E!$L$52","v":12},{"$f":"E!$M$52","v":-7},{"$f":"E!N52","v":{"v":0.23809523809523808,"d":"0.238"}}]
[null,"8º",8,{"$f":"E!$C$53","v":"VAGO-W.O"},null,null,{"$f":"E!$F$53","v":0},{"$f":"E!$G$53","v":7},{"$f":"E!$H$53","v":0},{"$f":"E!$I$53","v":0},{"$f":"E!$J$53","v":7},{"$f":"E!$K$53","v":0},{"$f":"E!$L$53","v":7},{"$f":"E!$M$53","v":-7},{"$f":"E!N53","v":0}]
[]
[null,null,"GRUPO F"]
[null,null,"Equipes ",{"$nulls":3},"PG","J","V","E","D","GP","GC","SG","APROV"]
[null,"1º",1,{"$f":"F!$C$46","v":"FERNANDO-BOT-DF"},null,null,{"$f":"F!$F$46","v":19},{"$f":"F!$G$46","v":7},{"$f":"F!$H$46","v":6},{"$f":"F!$I$46","v":1},{"$f":"F!$J$46","v":0},{"$f":"F!$K$46","v":20},{"$f":"F!$L$46","v":8},{"$f":"F!$M$46","v":12},{"$f":"F!N46","v":{"v":0.9047619047619048,"d":"0.905"}}]
[null,"2º",2,{"$f":"F!$C$47","v":"AIRES-ASBAC"},null,null,{"$f":"F!$F$47","v":17},{"$f":"F!$G$47","v":7},{"$f":"F!$H$47","v":5},{"$f":"F!$I$47","v":2},{"$f":"F!$J$47","v":0},{"$f":"F!$K$47","v":19},{"$f":"F!$L$47","v":10},{"$f":"F!$M$47","v":9},{"$f":"F!N47","v":{"v":0.8095238095238095,"d":"0.810"}}]
[null,"3º",3,{"$f":"F!$C$48","v":"GATTO-CRVG"},null,null,{"$f":"F!$F$48","v":13},{"$f":"F!$G$48","v":7},{"$f":"F!$H$48","v":4},{"$f":"F!$I$48","v":1},{"$f":"F!$J$48","v":2},{"$f":"F!$K$48","v":22},{"$f":"F!$L$48","v":17},{"$f":"F!$M$48","v":5},{"$f":"F!N48","v":{"v":0.6190476190476191,"d":"0.619"}}]
[null,"4º",4,{"$f":"F!$C$49","v":"VERAS-CRF"},null,null,{"$f":"F!$F$49","v":12},{"$f":"F!$G$49","v":7},{"$f":"F!$H$49","v":4},{"$f":"F!$I$49","v":0},{"$f":"F!$J$49","v":3},{"$f":"F!$K$49","v":19},{"$f":"F!$L$49","v":17},{"$f":"F!$M$49","v":2},{"$f":"F!N49","v":{"v":0.5714285714285714,"d":"0.571"}}]
[null,"5º",5,{"$f":"F!$C$50","v":"ZÉ LUIZ-CRF"},null,null,{"$f":"F!$F$50","v":10},{"$f":"F!$G$50","v":7},{"$f":"F!$H$50","v":3},{"$f":"F!$I$50","v":1},{"$f":"F!$J$50","v":3},{"$f":"F!$K$50","v":11},{"$f":"F!$L$50","v":14},{"$f":"F!$M$50","v":-3},{"$f":"F!N50","v":{"v":0.47619047619047616,"d":"0.476"}}]
[null,"6º",6,{"$f":"F!$C$51","v":"KADHU-CRVG"},null,null,{"$f":"F!$F$51","v":7},{"$f":"F!$G$51","v":7},{"$f":"F!$H$51","v":2},{"$f":"F!$I$51","v":1},{"$f":"F!$J$51","v":4},{"$f":"F!$K$51","v":13},{"$f":"F!$L$51","v":21},{"$f":"F!$M$51","v":-8},{"$f":"F!N51","v":{"v":0.3333333333333333,"d":"0.333"}}]
[null,"7º",7,{"$f":"F!$C$52","v":"BELMIRO-RIVER"},null,null,{"$f":"F!$F$52","v":3},{"$f":"F!$G$52","v":7},{"$f":"F!$H$52","v":1},{"$f":"F!$I$52","v":0},{"$f":"F!$J$52","v":6},{"$f":"F!$K$52","v":10},{"$f":"F!$L$52","v":20},{"$f":"F!$M$52","v":-10},{"$f":"F!N52","v":{"v":0.14285714285714285,"d":"0.143"}}]
[null,"8º",8,{"$f":"F!$C$53","v":"VAGO-W.O"},null,null,{"$f":"F!$F$53","v":0},{"$f":"F!$G$53","v":7},{"$f":"F!$H$53","v":0},{"$f":"F!$I$53","v":0},{"$f":"F!$J$53","v":7},{"$f":"F!$K$53","v":0},{"$f":"F!$L$53","v":7},{"$f":"F!$M$53","v":-7},{"$f":"F!N53","v":0}]

{"sheet":"Classificação","index":7,"n_rows":53,"n_cols":16,"rows_kept":53}
[]
[]
[]
[{"$nulls":5},4,5,6,7,8,9,10,11,12]
["Geral","Série","Atletas",null,null,"PG","J","V","E","D","GP","GC","SG","%","MGP","MGC"]
["1º","OURO/PRATA",{"$f":"'C'!$C$46","v":"BRAYNER-CRVG"},null,null,{"$f":"VLOOKUP($C6,Resumo!$D:$O,F$4,0)","v":19},{"$f":"VLOOKUP($C6,Resumo!$D:$O,G$4,0)","v":7},{"$f":"VLOOKUP($C6,Resumo!$D:$O,H$4,0)","v":6},{"$f":"VLOOKUP($C6,Resumo!$D:$O,I$4,0)","v":1},{"$f":"VLOOKUP($C6,Resumo!$D:$O,J$4,0)","v":0},{"$f":"VLOOKUP($C6,Resumo!$D:$O,K$4,0)","v":26},{"$f":"VLOOKUP($C6,Resumo!$D:$O,L$4,0)","v":12},{"$f":"VLOOKUP($C6,Resumo!$D:$O,M$4,0)","v":14},{"$f":"VLOOKUP($C6,Resumo!$D:$O,N$4,0)","v":{"v":0.9047619047619048,"d":"0.90"}},{"$f":"K6/G6","v":{"v":3.7142857142857144,"d":"3.71"}},{"$f":"L6/G6","v":{"v":1.7142857142857142,"d":"1.71"}}]
["2º","OURO/PRATA",{"$f":"E!$C$46","v":"RONALD-CRF"},null,null,{"$f":"VLOOKUP($C7,Resumo!$D:$O,F$4,0)","v":19},{"$f":"VLOOKUP($C7,Resumo!$D:$O,G$4,0)","v":7},{"$f":"VLOOKUP($C7,Resumo!$D:$O,H$4,0)","v":6},{"$f":"VLOOKUP($C7,Resumo!$D:$O,I$4,0)","v":1},{"$f":"VLOOKUP($C7,Resumo!$D:$O,J$4,0)","v":0},{"$f":"VLOOKUP($C7,Resumo!$D:$O,K$4,0)","v":27},{"$f":"VLOOKUP($C7,Resumo!$D:$O,L$4,0)","v":14},{"$f":"VLOOKUP($C7,Resumo!$D:$O,M$4,0)","v":13},{"$f":"VLOOKUP($C7,Resumo!$D:$O,N$4,0)","v":{"v":0.9047619047619048,"d":"0.90"}},{"v":3.857142857142857,"d":"3.86"},{"v":2,"d":"2.00"}]
["3º","OURO/PRATA",{"$f":"F!$C$46","v":"FERNANDO-BOT-DF"},null,null,{"$f":"VLOOKUP($C8,Resumo!$D:$O,F$4,0)","v":19},{"$f":"VLOOKUP($C8,Resumo!$D:$O,G$4,0)","v":7},{"$f":"VLOOKUP($C8,Resumo!$D:$O,H$4,0)","v":6},{"$f":"VLOOKUP($C8,Resumo!$D:$O,I$4,0)","v":1},{"$f":"VLOOKUP($C8,Resumo!$D:$O,J$4,0)","v":0},{"$f":"VLOOKUP($C8,Resumo!$D:$O,K$4,0)","v":20},{"$f":"VLOOKUP($C8,Resumo!$D:$O,L$4,0)","v":8},{"$f":"VLOOKUP($C8,Resumo!$D:$O,M$4,0)","v":12},{"$f":"VLOOKUP($C8,Resumo!$D:$O,N$4,0)","v":{"v":0.9047619047619048,"d":"0.90"}},{"v":2.857142857142857,"d":"2.86"},{"v":1.1428571428571428,"d":"1.14"}]
["4º","OURO/PRATA",{"$f":"D!$C$46","v":"RICARDO-CRF"},null,null,{"$f":"VLOOKUP($C9,Resumo!$D:$O,F$4,0)","v":18},{"$f":"VLOOKUP($C9,Resumo!$D:$O,G$4,0)","v":7},{"$f":"VLOOKUP($C9,Resumo!$D:$O,H$4,0)","v":6},{"$f":"VLOOKUP($C9,Resumo!$D:$O,I$4,0)","v":0},{"$f":"VLOOKUP($C9,Resumo!$D:$O,J$4,0)","v":1},{"$f":"VLOOKUP($C9,Resumo!$D:$O,K$4,0)","v":22},{"$f":"VLOOKUP($C9,Resumo!$D:$O,L$4,0)","v":12},{"$f":"VLOOKUP($C9,Resumo!$D:$O,M$4,0)","v":10},{"$f":"VLOOKUP($C9,Resumo!$D:$O,N$4,0)","v":{"v":0.8571428571428571,"d":"0.86"}},{"v":3.142857142857143,"d":"3.14"},{"v":1.7142857142857142,"d":"1.71"}]
["5º","OURO/PRATA",{"$f":"B!$C$46","v":"ROMAR-CRVG"},null,null,{"$f":"VLOOKUP($C10,Resumo!$D:$O,F$4,0)","v":18},{"$f":"VLOOKUP($C10,Resumo!$D:$O,G$4,0)","v":7},{"$f":"VLOOKUP($C10,Resumo!$D:$O,H$4,0)","v":6},{"$f":"VLOOKUP($C10,Resumo!$D:$O,I$4,0)","v":0},{"$f":"VLOOKUP($C10,Resumo!$D:$O,J$4,0)","v":1},{"$f":"VLOOKUP($C10,Resumo!$D:$O,K$4,0)","v":21},{"$f":"VLOOKUP($C10,Resumo!$D:$O,L$4,0)","v":11},{"$f":"VLOOKUP($C10,Resumo!$D:$O,M$4,0)","v":10},{"$f":"VLOOKUP($C10,Resumo!$D:$O,N$4,0)","v":{"v":0.8571428571428571,"d":"0.86"}},{"v":3,"d":"3.00"},{"v":1.5714285714285714,"d":"1.57"}]
["6º","OURO/PRATA",{"$f":"F!$C$47","v":"AIRES-ASBAC"},null,null,{"$f":"VLOOKUP($C11,Resumo!$D:$O,F$4,0)","v":17},{"$f":"VLOOKUP($C11,Resumo!$D:$O,G$4,0)","v":7},{"$f":"VLOOKUP($C11,Resumo!$D:$O,H$4,0)","v":5},{"$f":"VLOOKUP($C11,Resumo!$D:$O,I$4,0)","v":2},{"$f":"VLOOKUP($C11,Resumo!$D:$O,J$4,0)","v":0},{"$f":"VLOOKUP($C11,Resumo!$D:$O,K$4,0)","v":19},{"$f":"VLOOKUP($C11,Resumo!$D:$O,L$4,0)","v":10},{"$f":"VLOOKUP($C11,Resumo!$D:$O,M$4,0)","v":9},{"$f":"VLOOKUP($C11,Resumo!$D:$O,N$4,0)","v":{"v":0.8095238095238095,"d":"0.81"}},{"v":2.7142857142857144,"d":"2.71"},{"v":1.4285714285714286,"d":"1.43"}]
["7º","OURO/PRATA",{"$f":"'C'!$C$47","v":"ALMO-CC"},null,null,{"$f":"VLOOKUP($C12,Resumo!$D:$O,F$4,0)","v":17},{"$f":"VLOOKUP($C12,Resumo!$D:$O,G$4,0)","v":7},{"$f":"VLOOKUP($C12,Resumo!$D:$O,H$4,0)","v":5},{"$f":"VLOOKUP($C12,Resumo!$D:$O,I$4,0)","v":2},{"$f":"VLOOKUP($C12,Resumo!$D:$O,J$4,0)","v":0},{"$f":"VLOOKUP($C12,Resumo!$D:$O,K$4,0)","v":21},{"$f":"VLOOKUP($C12,Resumo!$D:$O,L$4,0)","v":14},{"$f":"VLOOKUP($C12,Resumo!$D:$O,M$4,0)","v":7},{"$f":"VLOOKUP($C12,Resumo!$D:$O,N$4,0)","v":{"v":0.8095238095238095,"d":"0.81"}},{"v":3,"d":"3.00"},{"v":2,"d":"2.00"}]
["8º","OURO/PRATA",{"$f":"A!$C$46","v":"AUGUSTO-CRF"},null,null,{"$f":"VLOOKUP($C13,Resumo!$D:$O,F$4,0)","v":17},{"$f":"VLOOKUP($C13,Resumo!$D:$O,G$4,0)","v":7},{"$f":"VLOOKUP($C13,Resumo!$D:$O,H$4,0)","v":5},{"$f":"VLOOKUP($C13,Resumo!$D:$O,I$4,0)","v":2},{"$f":"VLOOKUP($C13,Resumo!$D:$O,J$4,0)","v":0},{"$f":"VLOOKUP($C13,Resumo!$D:$O,K$4,0)","v":18},{"$f":"VLOOKUP($C13,Resumo!$D:$O,L$4,0)","v":11},{"$f":"VLOOKUP($C13,Resumo!$D:$O,M$4,0)","v":7},{"$f":"VLOOKUP($C13,Resumo!$D:$O,N$4,0)","v":{"v":0.8095238095238095,"d":"0.81"}},{"v":2.5714285714285716,"d":"2.57"},{"v":1.5714285714285714,"d":"1.57"}]
["9º","OURO/PRATA",{"$f":"'C'!$C$48","v":"GIUSEPE-BOT-DF"},null,null,{"$f":"VLOOKUP($C14,Resumo!$D:$O,F$4,0)","v":16},{"$f":"VLOOKUP($C14,Resumo!$D:$O,G$4,0)","v":7},{"$f":"VLOOKUP($C14,Resumo!$D:$O,H$4,0)","v":5},{"$f":"VLOOKUP($C14,Resumo!$D:$O,I$4,0)","v":1},{"$f":"VLOOKUP($C14,Resumo!$D:$O,J$4,0)","v":1},{"$f":"VLOOKUP($C14,Resumo!$D:$O,K$4,0)","v":16},{"$f":"VLOOKUP($C14,Resumo!$D:$O,L$4,0)","v":10},{"$f":"VLOOKUP($C14,Resumo!$D:$O,M$4,0)","v":6},{"$f":"VLOOKUP($C14,Resumo!$D:$O,N$4,0)","v":{"v":0.7619047619047619,"d":"0.76"}},{"v":2.2857142857142856,"d":"2.29"},{"v":1.4285714285714286,"d":"1.43"}]
["10º","OURO/PRATA",{"$f":"A!$C$47","v":"WELLINGTON-ADDP"},null,null,{"$f":"VLOOKUP($C15,Resumo!$D:$O,F$4,0)","v":16},{"$f":"VLOOKUP($C15,Resumo!$D:$O,G$4,0)","v":7},{"$f":"VLOOKUP($C15,Resumo!$D:$O,H$4,0)","v":5},{"$f":"VLOOKUP($C15,Resumo!$D:$O,I$4,0)","v":1},{"$f":"VLOOKUP($C15,Resumo!$D:$O,J$4,0)","v":1},{"$f":"VLOOKUP($C15,Resumo!$D:$O,K$4,0)","v":15},{"$f":"VLOOKUP($C15,Resumo!$D:$O,L$4,0)","v":10},{"$f":"VLOOKUP($C15,Resumo!$D:$O,M$4,0)","v":5},{"$f":"VLOOKUP($C15,Resumo!$D:$O,N$4,0)","v":{"v":0.7619047619047619,"d":"0.76"}},{"v":2.142857142857143,"d":"2.14"},{"v":1.4285714285714286,"d":"1.43"}]
["11º","OURO/PRATA",{"$f":"D!$C$47","v":"LUCIANO-CRF"},null,null,{"$f":"VLOOKUP($C16,Resumo!$D:$O,F$4,0)","v":16},{"$f":"VLOOKUP($C16,Resumo!$D:$O,G$4,0)","v":7},{"$f":"VLOOKUP($C16,Resumo!$D:$O,H$4,0)","v":5},{"$f":"VLOOKUP($C16,Resumo!$D:$O,I$4,0)","v":1},{"$f":"VLOOKUP($C16,Resumo!$D:$O,J$4,0)","v":1},{"$f":"VLOOKUP($C16,Resumo!$D:$O,K$4,0)","v":12},{"$f":"VLOOKUP($C16,Resumo!$D:$O,L$4,0)","v":9},{"$f":"VLOOKUP($C16,Resumo!$D:$O,M$4,0)","v":3},{"$f":"VLOOKUP($C16,Resumo!$D:$O,N$4,0)","v":{"v":0.7619047619047619,"d":"0.76"}},{"v":1.7142857142857142,"d":"1.71"},{"v":1.2857142857142858,"d":"1.29"}]
["12º","OURO/PRATA",{"$f":"B!$C$47","v":"FELIPE-CRF"},null,null,{"$f":"VLOOKUP($C17,Resumo!$D:$O,F$4,0)","v":15},{"$f":"VLOOKUP($C17,Resumo!$D:$O,G$4,0)","v":7},{"$f":"VLOOKUP($C17,Resumo!$D:$O,H$4,0)","v":5},{"$f":"VLOOKUP($C17,Resumo!$D:$O,I$4,0)","v":0},{"$f":"VLOOKUP($C17,Resumo!$D:$O,J$4,0)","v":2},{"$f":"VLOOKUP($C17,Resumo!$D:$O,K$4,0)","v":16},{"$f":"VLOOKUP($C17,Resumo!$D:$O,L$4,0)","v":13},{"$f":"VLOOKUP($C17,Resumo!$D:$O,M$4,0)","v":3},{"$f":"VLOOKUP($C17,Resumo!$D:$O,N$4,0)","v":{"v":0.7142857142857143,"d":"0.71"}},{"v":2.2857142857142856,"d":"2.29"},{"v":1.8571428571428572,"d":"1.86"}]
["13º","OURO/PRATA",{"$f":"A!$C$48","v":"B. RAFAEL-SANTOS"},null,null,{"$f":"VLOOKUP($C18,Resumo!$D:$O,F$4,0)","v":15},{"$f":"VLOOKUP($C18,Resumo!$D:$O,G$4,0)","v":7},{"$f":"VLOOKUP($C18,Resumo!$D:$O,H$4,0)","v":5},{"$f":"VLOOKUP($C18,Resumo!$D:$O,I$4,0)","v":0},{"$f":"VLOOKUP($C18,Resumo!$D:$O,J$4,0)","v":2},{"$f":"VLOOKUP($C18,Resumo!$D:$O,K$4,0)","v":15},{"$f":"VLOOKUP($C18,Resumo!$D:$O,L$4,0)","v":12},{"$f":"VLOOKUP($C18,Resumo!$D:$O,M$4,0)","v":3},{"$f":"VLOOKUP($C18,Resumo!$D:$O,N$4,0)","v":{"v":0.7142857142857143,"d":"0.71"}},{"v":2.142857142857143,"d":"2.14"},{"v":1.7142857142857142,"d":"1.71"}]
["14º","OURO/PRATA",{"$f":"D!$C$48","v":"LOPES-RIVER"},null,null,{"$f":"VLOOKUP($C19,Resumo!$D:$O,F$4,0)","v":14},{"$f":"VLOOKUP($C19,Resumo!$D:$O,G$4,0)","v":7},{"$f":"VLOOKUP($C19,Resumo!$D:$O,H$4,0)","v":4},{"$f":"VLOOKUP($C19,Resumo!$D:$O,I$4,0)","v":2},{"$f":"VLOOKUP($C19,Resumo!$D:$O,J$4,0)","v":1},{"$f":"VLOOKUP($C19,Resumo!$D:$O,K$4,0)","v":18},{"$f":"VLOOKUP($C19,Resumo!$D:$O,L$4,0)","v":11},{"$f":"VLOOKUP($C19,Resumo!$D:$O,M$4,0)","v":7},{"$f":"VLOOKUP($C19,Resumo!$D:$O,N$4,0)","v":{"v":0.6666666666666666,"d":"0.67"}},{"v":2.5714285714285716,"d":"2.57"},{"v":1.5714285714285714,"d":"1.57"}]
["15º","OURO/PRATA",{"$f":"E!$C$47","v":"L.HENRIQUE-TUPI"},null,null,{"$f":"VLOOKUP($C20,Resumo!$D:$O,F$4,0)","v":14},{"$f":"VLOOKUP($C20,Resumo!$D:$O,G$4,0)","v":7},{"$f":"VLOOKUP($C20,Resumo!$D:$O,H$4,0)","v":4},{"$f":"VLOOKUP($C20,Resumo!$D:$O,I$4,0)","v":2},{"$f":"VLOOKUP($C20,Resumo!$D:$O,J$4,0)","v":1},{"$f":"VLOOKUP($C20,Resumo!$D:$O,K$4,0)","v":18},{"$f":"VLOOKUP($C20,Resumo!$D:$O,L$4,0)","v":14},{"$f":"VLOOKUP($C20,Resumo!$D:$O,M$4,0)","v":4},{"$f":"VLOOKUP($C20,Resumo!$D:$O,N$4,0)","v":{"v":0.6666666666666666,"d":"0.67"}},{"v":2.5714285714285716,"d":"2.57"},{"v":2,"d":"2.00"}]
["16º","OURO/PRATA",{"$f":"D!$C$49","v":"EDWARD-BQ"},null,null,{"$f":"VLOOKUP($C21,Resumo!$D:$O,F$4,0)","v":14},{"$f":"VLOOKUP($C21,Resumo!$D:$O,G$4,0)","v":7},{"$f":"VLOOKUP($C21,Resumo!$D:$O,H$4,0)","v":4},{"$f":"VLOOKUP($C21,Resumo!$D:$O,I$4,0)","v":2},{"$f":"VLOOKUP($C21,Resumo!$D:$O,J$4,0)","v":1},{"$f":"VLOOKUP($C21,Resumo!$D:$O,K$4,0)","v":11},{"$f":"VLOOKUP($C21,Resumo!$D:$O,L$4,0)","v":9},{"$f":"VLOOKUP($C21,Resumo!$D:$O,M$4,0)","v":2},{"$f":"VLOOKUP($C21,Resumo!$D:$O,N$4,0)","v":{"v":0.6666666666666666,"d":"0.67"}},{"v":1.5714285714285714,"d":"1.57"},{"v":1.2857142857142858,"d":"1.29"}]
["17º","OURO/PRATA",{"$f":"F!$C$48","v":"GATTO-CRVG"},null,null,{"$f":"VLOOKUP($C22,Resumo!$D:$O,F$4,0)","v":13},{"$f":"VLOOKUP($C22,Resumo!$D:$O,G$4,0)","v":7},{"$f":"VLOOKUP($C22,Resumo!$D:$O,H$4,0)","v":4},{"$f":"VLOOKUP($C22,Resumo!$D:$O,I$4,0)","v":1},{"$f":"VLOOKUP($C22,Resumo!$D:$O,J$4,0)","v":2},{"$f":"VLOOKUP($C22,Resumo!$D:$O,K$4,0)","v":22},{"$f":"VLOOKUP($C22,Resumo!$D:$O,L$4,0)","v":17},{"$f":"VLOOKUP($C22,Resumo!$D:$O,M$4,0)","v":5},{"$f":"VLOOKUP($C22,Resumo!$D:$O,N$4,0)","v":{"v":0.6190476190476191,"d":"0.62"}},{"v":3.142857142857143,"d":"3.14"},{"v":2.4285714285714284,"d":"2.43"}]
["18º","OURO/PRATA",{"$f":"B!$C$48","v":"P.CARUSO-AABB-DF"},null,null,{"$f":"VLOOKUP($C23,Resumo!$D:$O,F$4,0)","v":13},{"$f":"VLOOKUP($C23,Resumo!$D:$O,G$4,0)","v":7},{"$f":"VLOOKUP($C23,Resumo!$D:$O,H$4,0)","v":4},{"$f":"VLOOKUP($C23,Resumo!$D:$O,I$4,0)","v":1},{"$f":"VLOOKUP($C23,Resumo!$D:$O,J$4,0)","v":2},{"$f":"VLOOKUP($C23,Resumo!$D:$O,K$4,0)","v":16},{"$f":"VLOOKUP($C23,Resumo!$D:$O,L$4,0)","v":13},{"$f":"VLOOKUP($C23,Resumo!$D:$O,M$4,0)","v":3},{"$f":"VLOOKUP($C23,Resumo!$D:$O,N$4,0)","v":{"v":0.6190476190476191,"d":"0.62"}},{"v":2.2857142857142856,"d":"2.29"},{"v":1.8571428571428572,"d":"1.86"}]
["19º","OURO/PRATA",{"$f":"E!$C$48","v":"MARCUS-BQ"},null,null,{"$f":"VLOOKUP($C24,Resumo!$D:$O,F$4,0)","v":13},{"$f":"VLOOKUP($C24,Resumo!$D:$O,G$4,0)","v":7},{"$f":"VLOOKUP($C24,Resumo!$D:$O,H$4,0)","v":4},{"$f":"VLOOKUP($C24,Resumo!$D:$O,I$4,0)","v":1},{"$f":"VLOOKUP($C24,Resumo!$D:$O,J$4,0)","v":2},{"$f":"VLOOKUP($C24,Resumo!$D:$O,K$4,0)","v":14},{"$f":"VLOOKUP($C24,Resumo!$D:$O,L$4,0)","v":11},{"$f":"VLOOKUP($C24,Resumo!$D:$O,M$4,0)","v":3},{"$f":"VLOOKUP($C24,Resumo!$D:$O,N$4,0)","v":{"v":0.6190476190476191,"d":"0.62"}},{"v":2,"d":"2.00"},{"v":1.5714285714285714,"d":"1.57"}]
["20º","OURO/PRATA",{"$f":"A!$C$49","v":"PAULINHO-BOT-DF"},null,null,{"$f":"VLOOKUP($C25,Resumo!$D:$O,F$4,0)","v":13},{"$f":"VLOOKUP($C25,Resumo!$D:$O,G$4,0)","v":7},{"$f":"VLOOKUP($C25,Resumo!$D:$O,H$4,0)","v":4},{"$f":"VLOOKUP($C25,Resumo!$D:$O,I$4,0)","v":1},{"$f":"VLOOKUP($C25,Resumo!$D:$O,J$4,0)","v":2},{"$f":"VLOOKUP($C25,Resumo!$D:$O,K$4,0)","v":12},{"$f":"VLOOKUP($C25,Resumo!$D:$O,L$4,0)","v":10},{"$f":"VLOOKUP($C25,Resumo!$D:$O,M$4,0)","v":2},{"$f":"VLOOKUP($C25,Resumo!$D:$O,N$4,0)","v":{"v":0.6190476190476191,"d":"0.62"}},{"v":1.7142857142857142,"d":"1.71"},{"v":1.4285714285714286,"d":"1.43"}]
["21º","OURO/PRATA",{"$f":"B!$C$49","v":"LYAN-FFC"},null,null,{"$f":"VLOOKUP($C26,Resumo!$D:$O,F$4,0)","v":12},{"$f":"VLOOKUP($C26,Resumo!$D:$O,G$4,0)","v":7},{"$f":"VLOOKUP($C26,Resumo!$D:$O,H$4,0)","v":4},{"$f":"VLOOKUP($C26,Resumo!$D:$O,I$4,0)","v":0},{"$f":"VLOOKUP($C26,Resumo!$D:$O,J$4,0)","v":3},{"$f":"VLOOKUP($C26,Resumo!$D:$O,K$4,0)","v":23},{"$f":"VLOOKUP($C26,Resumo!$D:$O,L$4,0)","v":17},{"$f":"VLOOKUP($C26,Resumo!$D:$O,M$4,0)","v":6},{"$f":"VLOOKUP($C26,Resumo!$D:$O,N$4,0)","v":{"v":0.5714285714285714,"d":"0.57"}},{"v":3.2857142857142856,"d":"3.29"},{"v":2.4285714285714284,"d":"2.43"}]
["22º","OURO/PRATA",{"$f":"F!$C$49","v":"VERAS-CRF"},null,null,{"$f":"VLOOKUP($C27,Resumo!$D:$O,F$4,0)","v":12},{"$f":"VLOOKUP($C27,Resumo!$D:$O,G$4,0)","v":7},{"$f":"VLOOKUP($C27,Resumo!$D:$O,H$4,0)","v":4},{"$f":"VLOOKUP($C27,Resumo!$D:$O,I$4,0)","v":0},{"$f":"VLOOKUP($C27,Resumo!$D:$O,J$4,0)","v":3},{"$f":"VLOOKUP($C27,Resumo!$D:$O,K$4,0)","v":19},{"$f":"VLOOKUP($C27,Resumo!$D:$O,L$4,0)","v":17},{"$f":"VLOOKUP($C27,Resumo!$D:$O,M$4,0)","v":2},{"$f":"VLOOKUP($C27,Resumo!$D:$O,N$4,0)","v":{"v":0.5714285714285714,"d":"0.57"}},{"v":2.7142857142857144,"d":"2.71"},{"v":2.4285714285714284,"d":"2.43"}]
["23º","OURO/PRATA",{"$f":"E!$C$49","v":"MENDEZ-CRVG"},null,null,{"$f":"VLOOKUP($C28,Resumo!$D:$O,F$4,0)","v":11},{"$f":"VLOOKUP($C28,Resumo!$D:$O,G$4,0)","v":7},{"$f":"VLOOKUP($C28,Resumo!$D:$O,H$4,0)","v":3},{"$f":"VLOOKUP($C28,Resumo!$D:$O,I$4,0)","v":2},{"$f":"VLOOKUP($C28,Resumo!$D:$O,J$4,0)","v":2},{"$f":"VLOOKUP($C28,Resumo!$D:$O,K$4,0)","v":13},{"$f":"VLOOKUP($C28,Resumo!$D:$O,L$4,0)","v":14},{"$f":"VLOOKUP($C28,Resumo!$D:$O,M$4,0)","v":-1},{"$f":"VLOOKUP($C28,Resumo!$D:$O,N$4,0)","v":{"v":0.5238095238095238,"d":"0.52"}},{"v":1.8571428571428572,"d":"1.86"},{"v":2,"d":"2.00"}]
["24º","OURO/PRATA",{"$f":"'C'!$C$49","v":"GILBERTO-ASBAC"},null,null,{"$f":"VLOOKUP($C29,Resumo!$D:$O,F$4,0)","v":9},{"$f":"VLOOKUP($C29,Resumo!$D:$O,G$4,0)","v":7},{"$f":"VLOOKUP($C29,Resumo!$D:$O,H$4,0)","v":3},{"$f":"VLOOKUP($C29,Resumo!$D:$O,I$4,0)","v":0},{"$f":"VLOOKUP($C29,Resumo!$D:$O,J$4,0)","v":4},{"$f":"VLOOKUP($C29,Resumo!$D:$O,K$4,0)","v":19},{"$f":"VLOOKUP($C29,Resumo!$D:$O,L$4,0)","v":20},{"$f":"VLOOKUP($C29,Resumo!$D:$O,M$4,0)","v":-1},{"$f":"VLOOKUP($C29,Resumo!$D:$O,N$4,0)","v":{"v":0.42857142857142855,"d":"0.43"}},{"v":2.7142857142857144,"d":"2.71"},{"v":2.857142857142857,"d":"2.86"}]
["25º","PRATA/BRONZE",{"$f":"B!$C$50","v":"TAVARES-CRVG"},null,null,{"$f":"VLOOKUP($C30,Resumo!$D:$O,F$4,0)","v":12},{"$f":"VLOOKUP($C30,Resumo!$D:$O,G$4,0)","v":7},{"$f":"VLOOKUP($C30,Resumo!$D:$O,H$4,0)","v":4},{"$f":"VLOOKUP($C30,Resumo!$D:$O,I$4,0)","v":0},{"$f":"VLOOKUP($C30,Resumo!$D:$O,J$4,0)","v":3},{"$f":"VLOOKUP($C30,Resumo!$D:$O,K$4,0)","v":21},{"$f":"VLOOKUP($C30,Resumo!$D:$O,L$4,0)","v":21},{"$f":"VLOOKUP($C30,Resumo!$D:$O,M$4,0)","v":0},{"$f":"VLOOKUP($C30,Resumo!$D:$O,N$4,0)","v":{"v":0.5714285714285714,"d":"0.57"}},{"v":3,"d":"3.00"},{"v":3,"d":"3.00"}]
["26º","PRATA/BRONZE",{"$f":"A!$C$50","v":"B.MACHADO-BQ"},null,null,{"$f":"VLOOKUP($C31,Resumo!$D:$O,F$4,0)","v":10},{"$f":"VLOOKUP($C31,Resumo!$D:$O,G$4,0)","v":7},{"$f":"VLOOKUP($C31,Resumo!$D:$O,H$4,0)","v":3},{"$f":"VLOOKUP($C31,Resumo!$D:$O,I$4,0)","v":1},{"$f":"VLOOKUP($C31,Resumo!$D:$O,J$4,0)","v":3},{"$f":"VLOOKUP($C31,Resumo!$D:$O,K$4,0)","v":13},{"$f":"VLOOKUP($C31,Resumo!$D:$O,L$4,0)","v":11},{"$f":"VLOOKUP($C31,Resumo!$D:$O,M$4,0)","v":2},{"$f":"VLOOKUP($C31,Resumo!$D:$O,N$4,0)","v":{"v":0.47619047619047616,"d":"0.48"}},{"v":1.8571428571428572,"d":"1.86"},{"v":1.5714285714285714,"d":"1.57"}]
["27º","PRATA/BRONZE",{"$f":"D!$C$50","v":"ROGÉRIO-APCEF"},null,null,{"$f":"VLOOKUP($C32,Resumo!$D:$O,F$4,0)","v":10},{"$f":"VLOOKUP($C32,Resumo!$D:$O,G$4,0)","v":7},{"$f":"VLOOKUP($C32,Resumo!$D:$O,H$4,0)","v":3},{"$f":"VLOOKUP($C32,Resumo!$D:$O,I$4,0)","v":1},{"$f":"VLOOKUP($C32,Resumo!$D:$O,J$4,0)","v":3},{"$f":"VLOOKUP($C32,Resumo!$D:$O,K$4,0)","v":10},{"$f":"VLOOKUP($C32,Resumo!$D:$O,L$4,0)","v":10},{"$f":"VLOOKUP($C32,Resumo!$D:$O,M$4,0)","v":0},{"$f":"VLOOKUP($C32,Resumo!$D:$O,N$4,0)","v":{"v":0.47619047619047616,"d":"0.48"}},{"v":1.4285714285714286,"d":"1.43"},{"v":1.4285714285714286,"d":"1.43"}]
["28º","PRATA/BRONZE",{"$f":"F!$C$50","v":"ZÉ LUIZ-CRF"},null,null,{"$f":"VLOOKUP($C33,Resumo!$D:$O,F$4,0)","v":10},{"$f":"VLOOKUP($C33,Resumo!$D:$O,G$4,0)","v":7},{"$f":"VLOOKUP($C33,Resumo!$D:$O,H$4,0)","v":3},{"$f":"VLOOKUP($C33,Resumo!$D:$O,I$4,0)","v":1},{"$f":"VLOOKUP($C33,Resumo!$D:$O,J$4,0)","v":3},{"$f":"VLOOKUP($C33,Resumo!$D:$O,K$4,0)","v":11},{"$f":"VLOOKUP($C33,Resumo!$D:$O,L$4,0)","v":14},{"$f":"VLOOKUP($C33,Resumo!$D:$O,M$4,0)","v":-3},{"$f":"VLOOKUP($C33,Resumo!$D:$O,N$4,0)","v":{"v":0.47619047619047616,"d":"0.48"}},{"v":1.5714285714285714,"d":"1.57"},{"v":2,"d":"2.00"}]
["29º","PRATA/BRONZE",{"$f":"'C'!$C$50","v":"REBEL-ADDP"},null,null,{"$f":"VLOOKUP($C34,Resumo!$D:$O,F$4,0)","v":9},{"$f":"VLOOKUP($C34,Resumo!$D:$O,G$4,0)","v":7},{"$f":"VLOOKUP($C34,Resumo!$D:$O,H$4,0)","v":3},{"$f":"VLOOKUP($C34,Resumo!$D:$O,I$4,0)","v":0},{"$f":"VLOOKUP($C34,Resumo!$D:$O,J$4,0)","v":4},{"$f":"VLOOKUP($C34,Resumo!$D:$O,K$4,0)","v":12},{"$f":"VLOOKUP($C34,Resumo!$D:$O,L$4,0)","v":20},{"$f":"VLOOKUP($C34,Resumo!$D:$O,M$4,0)","v":-8},{"$f":"VLOOKUP($C34,Resumo!$D:$O,N$4,0)","v":{"v":0.42857142857142855,"d":"0.43"}},{"v":1.7142857142857142,"d":"1.71"},{"v":2.857142857142857,"d":"2.86"}]
["30º","PRATA/BRONZE",{"$f":"E!$C$50","v":"MATOSO-CRVG"},null,null,{"$f":"VLOOKUP($C35,Resumo!$D:$O,F$4,0)","v":9},{"$f":"VLOOKUP($C35,Resumo!$D:$O,G$4,0)","v":7},{"$f":"VLOOKUP($C35,Resumo!$D:$O,H$4,0)","v":2},{"$f":"VLOOKUP($C35,Resumo!$D:$O,I$4,0)","v":3},{"$f":"VLOOKUP($C35,Resumo!$D:$O,J$4,0)","v":2},{"$f":"VLOOKUP($C35,Resumo!$D:$O,K$4,0)","v":10},{"$f":"VLOOKUP($C35,Resumo!$D:$O,L$4,0)","v":12},{"$f":"VLOOKUP($C35,Resumo!$D:$O,M$4,0)","v":-2},{"$f":"VLOOKUP($C35,Resumo!$D:$O,N$4,0)","v":{"v":0.42857142857142855,"d":"0.43"}},{"v":1.4285714285714286,"d":"1.43"},{"v":1.7142857142857142,"d":"1.71"}]
["31º","PRATA/BRONZE",{"$f":"A!$C$51","v":"LIBÓRIO-FFC"},null,null,{"$f":"VLOOKUP($C36,Resumo!$D:$O,F$4,0)","v":7},{"$f":"VLOOKUP($C36,Resumo!$D:$O,G$4,0)","v":7},{"$f":"VLOOKUP($C36,Resumo!$D:$O,H$4,0)","v":2},{"$f":"VLOOKUP($C36,Resumo!$D:$O,I$4,0)","v":1},{"$f":"VLOOKUP($C36,Resumo!$D:$O,J$4,0)","v":4},{"$f":"VLOOKUP($C36,Resumo!$D:$O,K$4,0)","v":11},{"$f":"VLOOKUP($C36,Resumo!$D:$O,L$4,0)","v":18},{"$f":"VLOOKUP($C36,Resumo!$D:$O,M$4,0)","v":-7},{"$f":"VLOOKUP($C36,Resumo!$D:$O,N$4,0)","v":{"v":0.3333333333333333,"d":"0.33"}},{"v":1.5714285714285714,"d":"1.57"},{"v":2.5714285714285716,"d":"2.57"}]
["32º","PRATA/BRONZE",{"$f":"F!$C$51","v":"KADHU-CRVG"},null,null,{"$f":"VLOOKUP($C37,Resumo!$D:$O,F$4,0)","v":7},{"$f":"VLOOKUP($C37,Resumo!$D:$O,G$4,0)","v":7},{"$f":"VLOOKUP($C37,Resumo!$D:$O,H$4,0)","v":2},{"$f":"VLOOKUP($C37,Resumo!$D:$O,I$4,0)","v":1},{"$f":"VLOOKUP($C37,Resumo!$D:$O,J$4,0)","v":4},{"$f":"VLOOKUP($C37,Resumo!$D:$O,K$4,0)","v":13},{"$f":"VLOOKUP($C37,Resumo!$D:$O,L$4,0)","v":21},{"$f":"VLOOKUP($C37,Resumo!$D:$O,M$4,0)","v":-8},{"$f":"VLOOKUP($C37,Resumo!$D:$O,N$4,0)","v":{"v":0.3333333333333333,"d":"0.33"}},{"v":1.8571428571428572,"d":"1.86"},{"v":3,"d":"3.00"}]
["33º","PRATA/BRONZE",{"$f":"B!$C$51","v":"MARCELO-BQ"},null,null,{"$f":"VLOOKUP($C38,Resumo!$D:$O,F$4,0)","v":7},{"$f":"VLOOKUP($C38,Resumo!$D:$O,G$4,0)","v":7},{"$f":"VLOOKUP($C38,Resumo!$D:$O,H$4,0)","v":2},{"$f":"VLOOKUP($C38,Resumo!$D:$O,I$4,0)","v":1},{"$f":"VLOOKUP($C38,Resumo!$D:$O,J$4,0)","v":4},{"$f":"VLOOKUP($C38,Resumo!$D:$O,K$4,0)","v":9},{"$f":"VLOOKUP($C38,Resumo!$D:$O,L$4,0)","v":17},{"$f":"VLOOKUP($C38,Resumo!$D:$O,M$4,0)","v":-8},{"$f":"VLOOKUP($C38,Resumo!$D:$O,N$4,0)","v":{"v":0.3333333333333333,"d":"0.33"}},{"v":1.2857142857142858,"d":"1.29"},{"v":2.4285714285714284,"d":"2.43"}]
["34º","PRATA/BRONZE",{"$f":"'C'!$C$51","v":"NILSON-CC"},null,null,{"$f":"VLOOKUP($C39,Resumo!$D:$O,F$4,0)","v":6},{"$f":"VLOOKUP($C39,Resumo!$D:$O,G$4,0)","v":7},{"$f":"VLOOKUP($C39,Resumo!$D:$O,H$4,0)","v":2},{"$f":"VLOOKUP($C39,Resumo!$D:$O,I$4,0)","v":0},{"$f":"VLOOKUP($C39,Resumo!$D:$O,J$4,0)","v":5},{"$f":"VLOOKUP($C39,Resumo!$D:$O,K$4,0)","v":10},{"$f":"VLOOKUP($C39,Resumo!$D:$O,L$4,0)","v":13},{"$f":"VLOOKUP($C39,Resumo!$D:$O,M$4,0)","v":-3},{"$f":"VLOOKUP($C39,Resumo!$D:$O,N$4,0)","v":{"v":0.2857142857142857,"d":"0.29"}},{"v":1.4285714285714286,"d":"1.43"},{"v":1.8571428571428572,"d":"1.86"}]
["35º","PRATA/BRONZE",{"$f":"B!$C$52","v":"B. ASSUMPÇÃO-BQ"},null,null,{"$f":"VLOOKUP($C40,Resumo!$D:$O,F$4,0)","v":6},{"$f":"VLOOKUP($C40,Resumo!$D:$O,G$4,0)","v":7},{"$f":"VLOOKUP($C40,Resumo!$D:$O,H$4,0)","v":2},{"$f":"VLOOKUP($C40,Resumo!$D:$O,I$4,0)","v":0},{"$f":"VLOOKUP($C40,Resumo!$D:$O,J$4,0)","v":5},{"$f":"VLOOKUP($C40,Resumo!$D:$O,K$4,0)","v":7},{"$f":"VLOOKUP($C40,Resumo!$D:$O,L$4,0)","v":14},{"$f":"VLOOKUP($C40,Resumo!$D:$O,M$4,0)","v":-7},{"$f":"VLOOKUP($C40,Resumo!$D:$O,N$4,0)","v":{"v":0.2857142857142857,"d":"0.29"}},{"v":1,"d":"1.00"},{"v":2,"d":"2.00"}]
["36º","PRATA/BRONZE",{"$f":"'C'!$C$52","v":"CARLOS-APCEF-DF"},null,null,{"$f":"VLOOKUP($C41,Resumo!$D:$O,F$4,0)","v":6},{"$f":"VLOOKUP($C41,Resumo!$D:$O,G$4,0)","v":7},{"$f":"VLOOKUP($C41,Resumo!$D:$O,H$4,0)","v":2},{"$f":"VLOOKUP($C41,Resumo!$D:$O,I$4,0)","v":0},{"$f":"VLOOKUP($C41,Resumo!$D:$O,J$4,0)","v":5},{"$f":"VLOOKUP($C41,Resumo!$D:$O,K$4,0)","v":14},{"$f":"VLOOKUP($C41,Resumo!$D:$O,L$4,0)","v":22},{"$f":"VLOOKUP($C41,Resumo!$D:$O,M$4,0)","v":-8},{"$f":"VLOOKUP($C41,Resumo!$D:$O,N$4,0)","v":{"v":0.2857142857142857,"d":"0.29"}},{"v":2,"d":"2.00"},{"v":3.142857142857143,"d":"3.14"}]
["37º","PRATA/BRONZE",{"$f":"D!$C$51","v":"KLAUS-APCEF"},null,null,{"$f":"VLOOKUP($C42,Resumo!$D:$O,F$4,0)","v":6},{"$f":"VLOOKUP($C42,Resumo!$D:$O,G$4,0)","v":7},{"$f":"VLOOKUP($C42,Resumo!$D:$O,H$4,0)","v":2},{"$f":"VLOOKUP($C42,Resumo!$D:$O,I$4,0)","v":0},{"$f":"VLOOKUP($C42,Resumo!$D:$O,J$4,0)","v":5},{"$f":"VLOOKUP($C42,Resumo!$D:$O,K$4,0)","v":10},{"$f":"VLOOKUP($C42,Resumo!$D:$O,L$4,0)","v":20},{"$f":"VLOOKUP($C42,Resumo!$D:$O,M$4,0)","v":-10},{"$f":"VLOOKUP($C42,Resumo!$D:$O,N$4,0)","v":{"v":0.2857142857142857,"d":"0.29"}},{"v":1.4285714285714286,"d":"1.43"},{"v":2.857142857142857,"d":"2.86"}]
["38º","PRATA/BRONZE",{"$f":"E!$C$51","v":"ARMANDO-PE"},null,null,{"$f":"VLOOKUP($C43,Resumo!$D:$O,F$4,0)","v":6},{"$f":"VLOOKUP($C43,Resumo!$D:$O,G$4,0)","v":7},{"$f":"VLOOKUP($C43,Resumo!$D:$O,H$4,0)","v":1},{"$f":"VLOOKUP($C43,Resumo!$D:$O,I$4,0)","v":3},{"$f":"VLOOKUP($C43,Resumo!$D:$O,J$4,0)","v":3},{"$f":"VLOOKUP($C43,Resumo!$D:$O,K$4,0)","v":5},{"$f":"VLOOKUP($C43,Resumo!$D:$O,L$4,0)","v":8},{"$f":"VLOOKUP($C43,Resumo!$D:$O,M$4,0)","v":-3},{"$f":"VLOOKUP($C43,Resumo!$D:$O,N$4,0)","v":{"v":0.2857142857142857,"d":"0.29"}},{"v":0.7142857142857143,"d":"0.71"},{"v":1.1428571428571428,"d":"1.14"}]
["39º","PRATA/BRONZE",{"$f":"E!$C$52","v":"ANDRÉ-BQ"},null,null,{"$f":"VLOOKUP($C44,Resumo!$D:$O,F$4,0)","v":5},{"$f":"VLOOKUP($C44,Resumo!$D:$O,G$4,0)","v":7},{"$f":"VLOOKUP($C44,Resumo!$D:$O,H$4,0)","v":1},{"$f":"VLOOKUP($C44,Resumo!$D:$O,I$4,0)","v":2},{"$f":"VLOOKUP($C44,Resumo!$D:$O,J$4,0)","v":4},{"$f":"VLOOKUP($C44,Resumo!$D:$O,K$4,0)","v":5},{"$f":"VLOOKUP($C44,Resumo!$D:$O,L$4,0)","v":12},{"$f":"VLOOKUP($C44,Resumo!$D:$O,M$4,0)","v":-7},{"$f":"VLOOKUP($C44,Resumo!$D:$O,N$4,0)","v":{"v":0.23809523809523808,"d":"0.24"}},{"v":0.7142857142857143,"d":"0.71"},{"v":1.7142857142857142,"d":"1.71"}]
["40º","PRATA/BRONZE",{"$f":"F!$C$52","v":"BELMIRO-RIVER"},null,null,{"$f":"VLOOKUP($C45,Resumo!$D:$O,F$4,0)","v":3},{"$f":"VLOOKUP($C45,Resumo!$D:$O,G$4,0)","v":7},{"$f":"VLOOKUP($C45,Resumo!$D:$O,H$4,0)","v":1},{"$f":"VLOOKUP($C45,Resumo!$D:$O,I$4,0)","v":0},{"$f":"VLOOKUP($C45,Resumo!$D:$O,J$4,0)","v":6},{"$f":"VLOOKUP($C45,Resumo!$D:$O,K$4,0)","v":10},{"$f":"VLOOKUP($C45,Resumo!$D:$O,L$4,0)","v":20},{"$f":"VLOOKUP($C45,Resumo!$D:$O,M$4,0)","v":-10},{"$f":"VLOOKUP($C45,Resumo!$D:$O,N$4,0)","v":{"v":0.14285714285714285,"d":"0.14"}},{"v":1.4285714285714286,"d":"1.43"},{"v":2.857142857142857,"d":"2.86"}]
["41º","PRATA/BRONZE",{"$f":"D!$C$52","v":"DANIEL-CRVG"},null,null,{"$f":"VLOOKUP($C46,Resumo!$D:$O,F$4,0)","v":1},{"$f":"VLOOKUP($C46,Resumo!$D:$O,G$4,0)","v":7},{"$f":"VLOOKUP($C46,Resumo!$D:$O,H$4,0)","v":0},{"$f":"VLOOKUP($C46,Resumo!$D:$O,I$4,0)","v":1},{"$f":"VLOOKUP($C46,Resumo!$D:$O,J$4,0)","v":6},{"$f":"VLOOKUP($C46,Resumo!$D:$O,K$4,0)","v":0},{"$f":"VLOOKUP($C46,Resumo!$D:$O,L$4,0)","v":6},{"$f":"VLOOKUP($C46,Resumo!$D:$O,M$4,0)","v":-6},{"$f":"VLOOKUP($C46,Resumo!$D:$O,N$4,0)","v":{"v":0.047619047619047616,"d":"0.05"}},0,{"v":0.8571428571428571,"d":"0.86"}]
["42º","PRATA/BRONZE",{"$f":"A!$C$52","v":"HAMILTON-BQ"},null,null,{"$f":"VLOOKUP($C47,Resumo!$D:$O,F$4,0)","v":0},{"$f":"VLOOKUP($C47,Resumo!$D:$O,G$4,0)","v":6},{"$f":"VLOOKUP($C47,Resumo!$D:$O,H$4,0)","v":0},{"$f":"VLOOKUP($C47,Resumo!$D:$O,I$4,0)","v":0},{"$f":"VLOOKUP($C47,Resumo!$D:$O,J$4,0)","v":6},{"$f":"VLOOKUP($C47,Resumo!$D:$O,K$4,0)","v":0},{"$f":"VLOOKUP($C47,Resumo!$D:$O,L$4,0)","v":6},{"$f":"VLOOKUP($C47,Resumo!$D:$O,M$4,0)","v":-6},{"$f":"VLOOKUP($C47,Resumo!$D:$O,N$4,0)","v":{"v":0,"d":"0.00"}},0,{"v":1,"d":"1.00"}]
["43º","PRATA/BRONZE",{"$f":"A!$C$53","v":"VAGO-W.O"},null,null,{"$f":"VLOOKUP($C48,Resumo!$D:$O,F$4,0)","v":0},{"$f":"VLOOKUP($C48,Resumo!$D:$O,G$4,0)","v":6},{"$f":"VLOOKUP($C48,Resumo!$D:$O,H$4,0)","v":0},{"$f":"VLOOKUP($C48,Resumo!$D:$O,I$4,0)","v":0},{"$f":"VLOOKUP($C48,Resumo!$D:$O,J$4,0)","v":6},{"$f":"VLOOKUP($C48,Resumo!$D:$O,K$4,0)","v":0},{"$f":"VLOOKUP($C48,Resumo!$D:$O,L$4,0)","v":6},{"$f":"VLOOKUP($C48,Resumo!$D:$O,M$4,0)","v":-6},{"$f":"VLOOKUP($C48,Resumo!$D:$O,N$4,0)","v":{"v":0,"d":"0.00"}},0,{"v":1,"d":"1.00"}]
["44º","PRATA/BRONZE",{"$f":"B!$C$53","v":"VAGO-W.O"},null,null,{"$f":"VLOOKUP($C49,Resumo!$D:$O,F$4,0)","v":0},{"$f":"VLOOKUP($C49,Resumo!$D:$O,G$4,0)","v":6},{"$f":"VLOOKUP($C49,Resumo!$D:$O,H$4,0)","v":0},{"$f":"VLOOKUP($C49,Resumo!$D:$O,I$4,0)","v":0},{"$f":"VLOOKUP($C49,Resumo!$D:$O,J$4,0)","v":6},{"$f":"VLOOKUP($C49,Resumo!$D:$O,K$4,0)","v":0},{"$f":"VLOOKUP($C49,Resumo!$D:$O,L$4,0)","v":6},{"$f":"VLOOKUP($C49,Resumo!$D:$O,M$4,0)","v":-6},{"$f":"VLOOKUP($C49,Resumo!$D:$O,N$4,0)","v":{"v":0,"d":"0.00"}},0,{"v":1,"d":"1.00"}]
["45º","PRATA/BRONZE",{"$f":"'C'!$C$53","v":"VAGO-W.O"},null,null,{"$f":"VLOOKUP($C50,Resumo!$D:$O,F$4,0)","v":0},{"$f":"VLOOKUP($C50,Resumo!$D:$O,G$4,0)","v":6},{"$f":"VLOOKUP($C50,Resumo!$D:$O,H$4,0)","v":0},{"$f":"VLOOKUP($C50,Resumo!$D:$O,I$4,0)","v":0},{"$f":"VLOOKUP($C50,Resumo!$D:$O,J$4,0)","v":6},{"$f":"VLOOKUP($C50,Resumo!$D:$O,K$4,0)","v":0},{"$f":"VLOOKUP($C50,Resumo!$D:$O,L$4,0)","v":6},{"$f":"VLOOKUP($C50,Resumo!$D:$O,M$4,0)","v":-6},{"$f":"VLOOKUP($C50,Resumo!$D:$O,N$4,0)","v":{"v":0,"d":"0.00"}},0,{"v":1,"d":"1.00"}]
["46º","PRATA/BRONZE",{"$f":"D!$C$53","v":"VAGO-W.O"},null,null,{"$f":"VLOOKUP($C51,Resumo!$D:$O,F$4,0)","v":0},{"$f":"VLOOKUP($C51,Resumo!$D:$O,G$4,0)","v":6},{"$f":"VLOOKUP($C51,Resumo!$D:$O,H$4,0)","v":0},{"$f":"VLOOKUP($C51,Resumo!$D:$O,I$4,0)","v":0},{"$f":"VLOOKUP($C51,Resumo!$D:$O,J$4,0)","v":6},{"$f":"VLOOKUP($C51,Resumo!$D:$O,K$4,0)","v":0},{"$f":"VLOOKUP($C51,Resumo!$D:$O,L$4,0)","v":6},{"$f":"VLOOKUP($C51,Resumo!$D:$O,M$4,0)","v":-6},{"$f":"VLOOKUP($C51,Resumo!$D:$O,N$4,0)","v":{"v":0,"d":"0.00"}},0,{"v":1,"d":"1.00"}]
["47º","PRATA/BRONZE",{"$f":"E!$C$53","v":"VAGO-W.O"},null,null,{"$f":"VLOOKUP($C52,Resumo!$D:$O,F$4,0)","v":0},{"$f":"VLOOKUP($C52,Resumo!$D:$O,G$4,0)","v":6},{"$f":"VLOOKUP($C52,Resumo!$D:$O,H$4,0)","v":0},{"$f":"VLOOKUP($C52,Resumo!$D:$O,I$4,0)","v":0},{"$f":"VLOOKUP($C52,Resumo!$D:$O,J$4,0)","v":6},{"$f":"VLOOKUP($C52,Resumo!$D:$O,K$4,0)","v":0},{"$f":"VLOOKUP($C52,Resumo!$D:$O,L$4,0)","v":6},{"$f":"VLOOKUP($C52,Resumo!$D:$O,M$4,0)","v":-6},{"$f":"VLOOKUP($C52,Resumo!$D:$O,N$4,0)","v":{"v":0,"d":"0.00"}},0,{"v":1,"d":"1.00"}]
["48º","PRATA/BRONZE",{"$f":"F!$C$53","v":"VAGO-W.O"},null,null,{"$f":"VLOOKUP($C53,Resumo!$D:$O,F$4,0)","v":0},{"$f":"VLOOKUP($C53,Resumo!$D:$O,G$4,0)","v":6},{"$f":"VLOOKUP($C53,Resumo!$D:$O,H$4,0)","v":0},{"$f":"VLOOKUP($C53,Resumo!$D:$O,I$4,0)","v":0},{"$f":"VLOOKUP($C53,Resumo!$D:$O,J$4,0)","v":6},{"$f":"VLOOKUP($C53,Resumo!$D:$O,K$4,0)","v":0},{"$f":"VLOOKUP($C53,Resumo!$D:$O,L$4,0)","v":6},{"$f":"VLOOKUP($C53,Resumo!$D:$O,M$4,0)","v":-6},{"$f":"VLOOKUP($C53,Resumo!$D:$O,N$4,0)","v":{"v":0,"d":"0.00"}},0,{"v":1,"d":"1.00"}]

{"sheet":"Grupos Prox Fase","index":8,"n_rows":16,"n_cols":9,"rows_kept":16}
[]
[]
[null,"1º",{"$f":"VLOOKUP(B3,Classificação!$A$6:$C$53,3,0)","v":"BRAYNER-CRVG"},"2º",{"$f":"VLOOKUP(D3,Classificação!$A$6:$C$53,3,0)","v":"RONALD-CRF"},"3º",{"$f":"VLOOKUP(F3,Classificação!$A$6:$C$53,3,0)","v":"FERNANDO-BOT-DF"},"4º",{"$f":"VLOOKUP(H3,Classificação!$A$6:$C$53,3,0)","v":"RICARDO-CRF"}]
[null,"8º",{"$f":"VLOOKUP(B4,Classificação!$A$6:$C$53,3,0)","v":"AUGUSTO-CRF"},"7º",{"$f":"VLOOKUP(D4,Classificação!$A$6:$C$53,3,0)","v":"ALMO-CC"},"6º",{"$f":"VLOOKUP(F4,Classificação!$A$6:$C$53,3,0)","v":"AIRES-ASBAC"},"5º",{"$f":"VLOOKUP(H4,Classificação!$A$6:$C$53,3,0)","v":"ROMAR-CRVG"}]
[null,"9º",{"$f":"VLOOKUP(B5,Classificação!$A$6:$C$53,3,0)","v":"GIUSEPE-BOT-DF"},"10º",{"$f":"VLOOKUP(D5,Classificação!$A$6:$C$53,3,0)","v":"WELLINGTON-ADDP"},"11º",{"$f":"VLOOKUP(F5,Classificação!$A$6:$C$53,3,0)","v":"LUCIANO-CRF"},"12º",{"$f":"VLOOKUP(H5,Classificação!$A$6:$C$53,3,0)","v":"FELIPE-CRF"}]
[null,"16º",{"$f":"VLOOKUP(B6,Classificação!$A$6:$C$53,3,0)","v":"EDWARD-BQ"},"15º",{"$f":"VLOOKUP(D6,Classificação!$A$6:$C$53,3,0)","v":"L.HENRIQUE-TUPI"},"14º",{"$f":"VLOOKUP(F6,Classificação!$A$6:$C$53,3,0)","v":"LOPES-RIVER"},"13º",{"$f":"VLOOKUP(H6,Classificação!$A$6:$C$53,3,0)","v":"B. RAFAEL-SANTOS"}]
[null,"17º",{"$f":"VLOOKUP(B7,Classificação!$A$6:$C$53,3,0)","v":"GATTO-CRVG"},"18º",{"$f":"VLOOKUP(D7,Classificação!$A$6:$C$53,3,0)","v":"P.CARUSO-AABB-DF"},"19º",{"$f":"VLOOKUP(F7,Classificação!$A$6:$C$53,3,0)","v":"MARCUS-BQ"},"20º",{"$f":"VLOOKUP(H7,Classificação!$A$6:$C$53,3,0)","v":"PAULINHO-BOT-DF"}]
[null,"24º",{"$f":"VLOOKUP(B8,Classificação!$A$6:$C$53,3,0)","v":"GILBERTO-ASBAC"},"23º",{"$f":"VLOOKUP(D8,Classificação!$A$6:$C$53,3,0)","v":"MENDEZ-CRVG"},"22º",{"$f":"VLOOKUP(F8,Classificação!$A$6:$C$53,3,0)","v":"VERAS-CRF"},"21º",{"$f":"VLOOKUP(H8,Classificação!$A$6:$C$53,3,0)","v":"LYAN-FFC"}]
[]
[]
[null,"25º",{"$f":"VLOOKUP(B11,Classificação!$A$6:$C$53,3,0)","v":"TAVARES-CRVG"},"26º",{"$f":"VLOOKUP(D11,Classificação!$A$6:$C$53,3,0)","v":"B.MACHADO-BQ"},"27º",{"$f":"VLOOKUP(F11,Classificação!$A$6:$C$53,3,0)","v":"ROGÉRIO-APCEF"},"28º",{"$f":"VLOOKUP(H11,Classificação!$A$6:$C$53,3,0)","v":"ZÉ LUIZ-CRF"}]
[null,"32º",{"$f":"VLOOKUP(B12,Classificação!$A$6:$C$53,3,0)","v":"KADHU-CRVG"},"31º",{"$f":"VLOOKUP(D12,Classificação!$A$6:$C$53,3,0)","v":"LIBÓRIO-FFC"},"30º",{"$f":"VLOOKUP(F12,Classificação!$A$6:$C$53,3,0)","v":"MATOSO-CRVG"},"29º",{"$f":"VLOOKUP(H12,Classificação!$A$6:$C$53,3,0)","v":"REBEL-ADDP"}]
[null,"33º",{"$f":"VLOOKUP(B13,Classificação!$A$6:$C$53,3,0)","v":"MARCELO-BQ"},"34º",{"$f":"VLOOKUP(D13,Classificação!$A$6:$C$53,3,0)","v":"NILSON-CC"},"35º",{"$f":"VLOOKUP(F13,Classificação!$A$6:$C$53,3,0)","v":"B. ASSUMPÇÃO-BQ"},"36º",{"$f":"VLOOKUP(H13,Classificação!$A$6:$C$53,3,0)","v":"CARLOS-APCEF-DF"}]
[null,"40º",{"$f":"VLOOKUP(B14,Classificação!$A$6:$C$53,3,0)","v":"BELMIRO-RIVER"},"39º",{"$f":"VLOOKUP(D14,Classificação!$A$6:$C$53,3,0)","v":"ANDRÉ-BQ"},"38º",{"$f":"VLOOKUP(F14,Classificação!$A$6:$C$53,3,0)","v":"ARMANDO-PE"},"37º",{"$f":"VLOOKUP(H14,Classificação!$A$6:$C$53,3,0)","v":"KLAUS-APCEF"}]
[null,"41º","VAGO-W.O","42º","VAGO-W.O","43º",{"$f":"VLOOKUP(F15,Classificação!$A$6:$C$53,3,0)","v":"VAGO-W.O"},"44º",{"$f":"VLOOKUP(H15,Classificação!$A$6:$C$53,3,0)","v":"VAGO-W.O"}]
[null,"48º",{"$f":"VLOOKUP(B16,Classificação!$A$6:$C$53,3,0)","v":"VAGO-W.O"},"47º",{"$f":"VLOOKUP(D16,Classificação!$A$6:$C$53,3,0)","v":"VAGO-W.O"},"46º",{"$f":"VLOOKUP(F16,Classificação!$A$6:$C$53,3,0)","v":"VAGO-W.O"},"45º",{"$f":"VLOOKUP(H16,Classificação!$A$6:$C$53,3,0)","v":"VAGO-W.O"}]